You are viewing a plain text version of this content. The canonical link for it is here.
Posted to hdfs-dev@hadoop.apache.org by Apache Jenkins Server <je...@builds.apache.org> on 2016/03/29 12:00:37 UTC
Hadoop-Hdfs-trunk - Build # 2969 - Still Failing
See https://builds.apache.org/job/Hadoop-Hdfs-trunk/2969/
###################################################################################
########################## LAST 60 LINES OF THE CONSOLE ###########################
[...truncated 5460 lines...]
[INFO]
[INFO] --- maven-antrun-plugin:1.7:run (create-testdirs) @ hadoop-hdfs-project ---
[INFO] Executing tasks
main:
[mkdir] Created dir: /home/jenkins/jenkins-slave/workspace/Hadoop-Hdfs-trunk/hadoop-hdfs-project/target/test-dir
[INFO] Executed tasks
[INFO]
[INFO] --- maven-source-plugin:2.3:jar-no-fork (hadoop-java-sources) @ hadoop-hdfs-project ---
[INFO]
[INFO] --- maven-source-plugin:2.3:test-jar-no-fork (hadoop-java-sources) @ hadoop-hdfs-project ---
[INFO]
[INFO] --- maven-enforcer-plugin:1.3.1:enforce (dist-enforce) @ hadoop-hdfs-project ---
[INFO]
[INFO] --- maven-site-plugin:3.5:attach-descriptor (attach-descriptor) @ hadoop-hdfs-project ---
[INFO]
[INFO] --- maven-javadoc-plugin:2.8.1:jar (module-javadocs) @ hadoop-hdfs-project ---
[INFO] Skipping javadoc generation
[INFO]
[INFO] --- maven-enforcer-plugin:1.3.1:enforce (depcheck) @ hadoop-hdfs-project ---
[INFO]
[INFO] --- maven-checkstyle-plugin:2.15:checkstyle (default-cli) @ hadoop-hdfs-project ---
[INFO]
[INFO] --- findbugs-maven-plugin:3.0.0:findbugs (default-cli) @ hadoop-hdfs-project ---
[INFO] ------------------------------------------------------------------------
[INFO] Reactor Summary:
[INFO]
[INFO] Apache Hadoop HDFS Client ......................... SUCCESS [04:29 min]
[INFO] Apache Hadoop HDFS ................................ FAILURE [ 03:28 h]
[INFO] Apache Hadoop HDFS Native Client .................. SKIPPED
[INFO] Apache Hadoop HttpFS .............................. SKIPPED
[INFO] Apache Hadoop HDFS BookKeeper Journal ............. SKIPPED
[INFO] Apache Hadoop HDFS-NFS ............................ SKIPPED
[INFO] Apache Hadoop HDFS Project ........................ SUCCESS [ 0.063 s]
[INFO] ------------------------------------------------------------------------
[INFO] BUILD FAILURE
[INFO] ------------------------------------------------------------------------
[INFO] Total time: 03:33 h
[INFO] Finished at: 2016-03-29T10:00:26+00:00
[INFO] Final Memory: 56M/799M
[INFO] ------------------------------------------------------------------------
[ERROR] Failed to execute goal org.apache.maven.plugins:maven-surefire-plugin:2.17:test (default-test) on project hadoop-hdfs: ExecutionException: java.lang.RuntimeException: The forked VM terminated without properly saying goodbye. VM crash or System.exit called?
[ERROR] Command was /bin/sh -c cd /home/jenkins/jenkins-slave/workspace/Hadoop-Hdfs-trunk/hadoop-hdfs-project/hadoop-hdfs && /home/jenkins/tools/java/jdk1.7.0_55/jre/bin/java -Xmx2048m -XX:MaxPermSize=768m -XX:+HeapDumpOnOutOfMemoryError -jar /home/jenkins/jenkins-slave/workspace/Hadoop-Hdfs-trunk/hadoop-hdfs-project/hadoop-hdfs/target/surefire/surefirebooter3810133858351130602.jar /home/jenkins/jenkins-slave/workspace/Hadoop-Hdfs-trunk/hadoop-hdfs-project/hadoop-hdfs/target/surefire/surefire6682150641363074352tmp /home/jenkins/jenkins-slave/workspace/Hadoop-Hdfs-trunk/hadoop-hdfs-project/hadoop-hdfs/target/surefire/surefire_5998318069799502094881tmp
[ERROR] -> [Help 1]
[ERROR]
[ERROR] To see the full stack trace of the errors, re-run Maven with the -e switch.
[ERROR] Re-run Maven using the -X switch to enable full debug logging.
[ERROR]
[ERROR] For more information about the errors and possible solutions, please read the following articles:
[ERROR] [Help 1] http://cwiki.apache.org/confluence/display/MAVEN/MojoFailureException
[ERROR]
[ERROR] After correcting the problems, you can resume the build with the command
[ERROR] mvn <goals> -rf :hadoop-hdfs
Build step 'Execute shell' marked build as failure
Archiving artifacts
Recording test results
Sending e-mails to: hdfs-dev@hadoop.apache.org
Email was triggered for: Failure - Any
Sending email for trigger: Failure - Any
###################################################################################
############################## FAILED TESTS (if any) ##############################
6 tests failed.
FAILED: org.apache.hadoop.hdfs.TestEncryptionZonesWithKMS.testConcatFailsInEncryptionZones
Error Message:
Read timed out
Stack Trace:
java.net.SocketTimeoutException: Read timed out
at java.net.SocketInputStream.socketRead0(Native Method)
at java.net.SocketInputStream.read(SocketInputStream.java:152)
at java.net.SocketInputStream.read(SocketInputStream.java:122)
at java.io.BufferedInputStream.fill(BufferedInputStream.java:235)
at java.io.BufferedInputStream.read1(BufferedInputStream.java:275)
at java.io.BufferedInputStream.read(BufferedInputStream.java:334)
at sun.net.www.http.HttpClient.parseHTTPHeader(HttpClient.java:687)
at sun.net.www.http.HttpClient.parseHTTP(HttpClient.java:633)
at sun.net.www.protocol.http.HttpURLConnection.getInputStream(HttpURLConnection.java:1323)
at java.net.HttpURLConnection.getResponseCode(HttpURLConnection.java:468)
at org.apache.hadoop.security.authentication.client.KerberosAuthenticator.authenticate(KerberosAuthenticator.java:191)
at org.apache.hadoop.security.token.delegation.web.DelegationTokenAuthenticator.authenticate(DelegationTokenAuthenticator.java:128)
at org.apache.hadoop.security.authentication.client.AuthenticatedURL.openConnection(AuthenticatedURL.java:216)
at org.apache.hadoop.security.token.delegation.web.DelegationTokenAuthenticatedURL.openConnection(DelegationTokenAuthenticatedURL.java:322)
at org.apache.hadoop.crypto.key.kms.KMSClientProvider$1.run(KMSClientProvider.java:495)
at org.apache.hadoop.crypto.key.kms.KMSClientProvider$1.run(KMSClientProvider.java:490)
at java.security.AccessController.doPrivileged(Native Method)
at javax.security.auth.Subject.doAs(Subject.java:415)
at org.apache.hadoop.security.UserGroupInformation.doAs(UserGroupInformation.java:1742)
at org.apache.hadoop.crypto.key.kms.KMSClientProvider.createConnection(KMSClientProvider.java:490)
at org.apache.hadoop.crypto.key.kms.KMSClientProvider.createKeyInternal(KMSClientProvider.java:685)
at org.apache.hadoop.crypto.key.kms.KMSClientProvider.createKey(KMSClientProvider.java:695)
at org.apache.hadoop.crypto.key.KeyProviderExtension.createKey(KeyProviderExtension.java:74)
at org.apache.hadoop.hdfs.DFSTestUtil.createKey(DFSTestUtil.java:1646)
at org.apache.hadoop.hdfs.DFSTestUtil.createKey(DFSTestUtil.java:1627)
at org.apache.hadoop.hdfs.TestEncryptionZones.setup(TestEncryptionZones.java:159)
at org.apache.hadoop.hdfs.TestEncryptionZonesWithKMS.setup(TestEncryptionZonesWithKMS.java:59)
FAILED: org.apache.hadoop.hdfs.TestHFlush.testHFlushInterrupted
Error Message:
null
Stack Trace:
java.nio.channels.ClosedByInterruptException: null
at java.nio.channels.spi.AbstractInterruptibleChannel.end(AbstractInterruptibleChannel.java:202)
at sun.nio.ch.SocketChannelImpl.write(SocketChannelImpl.java:496)
at org.apache.hadoop.net.SocketOutputStream$Writer.performIO(SocketOutputStream.java:63)
at org.apache.hadoop.net.SocketIOWithTimeout.doIO(SocketIOWithTimeout.java:142)
at org.apache.hadoop.net.SocketOutputStream.write(SocketOutputStream.java:159)
at org.apache.hadoop.net.SocketOutputStream.write(SocketOutputStream.java:117)
at java.io.BufferedOutputStream.flushBuffer(BufferedOutputStream.java:82)
at java.io.BufferedOutputStream.flush(BufferedOutputStream.java:140)
at java.io.DataOutputStream.flush(DataOutputStream.java:123)
at org.apache.hadoop.hdfs.DataStreamer.run(DataStreamer.java:653)
FAILED: org.apache.hadoop.hdfs.server.namenode.TestEditLog.testBatchedSyncWithClosedLogs[1]
Error Message:
logging edit without syncing should do not affect txid expected:<1> but was:<2>
Stack Trace:
java.lang.AssertionError: logging edit without syncing should do not affect txid expected:<1> but was:<2>
at org.junit.Assert.fail(Assert.java:88)
at org.junit.Assert.failNotEquals(Assert.java:743)
at org.junit.Assert.assertEquals(Assert.java:118)
at org.junit.Assert.assertEquals(Assert.java:555)
at org.apache.hadoop.hdfs.server.namenode.TestEditLog.testBatchedSyncWithClosedLogs(TestEditLog.java:594)
FAILED: org.apache.hadoop.metrics2.sink.TestRollingFileSystemSinkWithHdfs.testAppend
Error Message:
Cannot obtain block length for LocatedBlock{BP-1984676970-67.195.81.150-1459245443533:blk_1073741825_1001; getBlockSize()=12; corrupt=false; offset=0; locs=[DatanodeInfoWithStorage[127.0.0.1:58207,DS-f4562852-6928-40d5-8189-34d1d7e8898c,DISK], DatanodeInfoWithStorage[127.0.0.1:45560,DS-3fdef13f-039d-487f-aad3-f3ad42ed427c,DISK], DatanodeInfoWithStorage[127.0.0.1:49167,DS-628762fb-bc3d-4d31-82b4-db4f4c8010e3,DISK]]}
Stack Trace:
java.io.IOException: Cannot obtain block length for LocatedBlock{BP-1984676970-67.195.81.150-1459245443533:blk_1073741825_1001; getBlockSize()=12; corrupt=false; offset=0; locs=[DatanodeInfoWithStorage[127.0.0.1:58207,DS-f4562852-6928-40d5-8189-34d1d7e8898c,DISK], DatanodeInfoWithStorage[127.0.0.1:45560,DS-3fdef13f-039d-487f-aad3-f3ad42ed427c,DISK], DatanodeInfoWithStorage[127.0.0.1:49167,DS-628762fb-bc3d-4d31-82b4-db4f4c8010e3,DISK]]}
at org.apache.hadoop.hdfs.DFSInputStream.readBlockLength(DFSInputStream.java:434)
at org.apache.hadoop.hdfs.DFSInputStream.fetchLocatedBlocksAndGetLastBlockLength(DFSInputStream.java:344)
at org.apache.hadoop.hdfs.DFSInputStream.openInfo(DFSInputStream.java:276)
at org.apache.hadoop.hdfs.DFSInputStream.<init>(DFSInputStream.java:266)
at org.apache.hadoop.hdfs.DFSClient.open(DFSClient.java:1038)
at org.apache.hadoop.hdfs.DistributedFileSystem$3.doCall(DistributedFileSystem.java:271)
at org.apache.hadoop.hdfs.DistributedFileSystem$3.doCall(DistributedFileSystem.java:268)
at org.apache.hadoop.fs.FileSystemLinkResolver.resolve(FileSystemLinkResolver.java:81)
at org.apache.hadoop.hdfs.DistributedFileSystem.open(DistributedFileSystem.java:268)
at org.apache.hadoop.fs.FileSystem.open(FileSystem.java:777)
at org.apache.hadoop.metrics2.sink.RollingFileSystemSinkTestBase.readLogData(RollingFileSystemSinkTestBase.java:275)
at org.apache.hadoop.metrics2.sink.RollingFileSystemSinkTestBase.readLogFile(RollingFileSystemSinkTestBase.java:254)
at org.apache.hadoop.metrics2.sink.RollingFileSystemSinkTestBase.doWriteTest(RollingFileSystemSinkTestBase.java:225)
at org.apache.hadoop.metrics2.sink.RollingFileSystemSinkTestBase.doAppendTest(RollingFileSystemSinkTestBase.java:385)
at org.apache.hadoop.metrics2.sink.TestRollingFileSystemSinkWithHdfs.testAppend(TestRollingFileSystemSinkWithHdfs.java:98)
FAILED: org.apache.hadoop.metrics2.sink.TestRollingFileSystemSinkWithHdfs.testSilentAppend
Error Message:
Cannot obtain block length for LocatedBlock{BP-541636477-67.195.81.150-1459245464828:blk_1073741825_1001; getBlockSize()=12; corrupt=false; offset=0; locs=[DatanodeInfoWithStorage[127.0.0.1:46496,DS-0aa9c2ca-d0d0-457e-b8de-f5582d0f8e73,DISK], DatanodeInfoWithStorage[127.0.0.1:52354,DS-d7b89be2-5c23-402c-b262-bc499f289ce4,DISK], DatanodeInfoWithStorage[127.0.0.1:58356,DS-57644718-b375-497c-befb-28604c11c17f,DISK]]}
Stack Trace:
java.io.IOException: Cannot obtain block length for LocatedBlock{BP-541636477-67.195.81.150-1459245464828:blk_1073741825_1001; getBlockSize()=12; corrupt=false; offset=0; locs=[DatanodeInfoWithStorage[127.0.0.1:46496,DS-0aa9c2ca-d0d0-457e-b8de-f5582d0f8e73,DISK], DatanodeInfoWithStorage[127.0.0.1:52354,DS-d7b89be2-5c23-402c-b262-bc499f289ce4,DISK], DatanodeInfoWithStorage[127.0.0.1:58356,DS-57644718-b375-497c-befb-28604c11c17f,DISK]]}
at org.apache.hadoop.hdfs.DFSInputStream.readBlockLength(DFSInputStream.java:434)
at org.apache.hadoop.hdfs.DFSInputStream.fetchLocatedBlocksAndGetLastBlockLength(DFSInputStream.java:344)
at org.apache.hadoop.hdfs.DFSInputStream.openInfo(DFSInputStream.java:276)
at org.apache.hadoop.hdfs.DFSInputStream.<init>(DFSInputStream.java:266)
at org.apache.hadoop.hdfs.DFSClient.open(DFSClient.java:1038)
at org.apache.hadoop.hdfs.DistributedFileSystem$3.doCall(DistributedFileSystem.java:271)
at org.apache.hadoop.hdfs.DistributedFileSystem$3.doCall(DistributedFileSystem.java:268)
at org.apache.hadoop.fs.FileSystemLinkResolver.resolve(FileSystemLinkResolver.java:81)
at org.apache.hadoop.hdfs.DistributedFileSystem.open(DistributedFileSystem.java:268)
at org.apache.hadoop.fs.FileSystem.open(FileSystem.java:777)
at org.apache.hadoop.metrics2.sink.RollingFileSystemSinkTestBase.readLogData(RollingFileSystemSinkTestBase.java:275)
at org.apache.hadoop.metrics2.sink.RollingFileSystemSinkTestBase.readLogFile(RollingFileSystemSinkTestBase.java:254)
at org.apache.hadoop.metrics2.sink.RollingFileSystemSinkTestBase.doWriteTest(RollingFileSystemSinkTestBase.java:225)
at org.apache.hadoop.metrics2.sink.RollingFileSystemSinkTestBase.doAppendTest(RollingFileSystemSinkTestBase.java:385)
at org.apache.hadoop.metrics2.sink.TestRollingFileSystemSinkWithHdfs.testSilentAppend(TestRollingFileSystemSinkWithHdfs.java:111)
FAILED: org.apache.hadoop.cli.TestHDFSCLI.testAll
Error Message:
One of the tests failed. See the Detailed results to identify the command that failed
Stack Trace:
java.lang.AssertionError: One of the tests failed. See the Detailed results to identify the command that failed
at org.junit.Assert.fail(Assert.java:88)
at org.junit.Assert.assertTrue(Assert.java:41)
at org.apache.hadoop.cli.CLITestHelper.displayResults(CLITestHelper.java:263)
at org.apache.hadoop.cli.CLITestHelper.tearDown(CLITestHelper.java:125)
at org.apache.hadoop.cli.TestHDFSCLI.tearDown(TestHDFSCLI.java:87)