You are viewing a plain text version of this content. The canonical link for it is here.
Posted to issues@trafficcontrol.apache.org by Apache Jenkins Server <je...@builds.apache.org> on 2017/10/09 22:53:12 UTC

Build failed in Jenkins: incubator-trafficcontrol-traffic_ops-test #185

See <https://builds.apache.org/job/incubator-trafficcontrol-traffic_ops-test/185/display/redirect?page=changes>

Changes:

[dewrich] refactor routes and wrappers in go traffic ops

[dewrich] remove unused privLevel from handlers and gofmt

[dewrich] return errors instead of sentinel values from Context helpers

[dewrich] include authenticated field in route struct

[dewrich] remove setting of default keepAlive behavior for trafficops go server

[dewrich] remove unauthenticated priv level due to refactor

------------------------------------------
Started by an SCM change
[EnvInject] - Loading node environment variables.
Building remotely on qnode3 (ubuntu xenial) in workspace <https://builds.apache.org/job/incubator-trafficcontrol-traffic_ops-test/ws/>
 > git rev-parse --is-inside-work-tree # timeout=10
Fetching changes from the remote Git repository
 > git config remote.origin.url git://github.com/apache/incubator-trafficcontrol.git # timeout=10
Fetching upstream changes from git://github.com/apache/incubator-trafficcontrol.git
 > git --version # timeout=10
using GIT_SSH to set credentials 
 > git fetch --tags --progress git://github.com/apache/incubator-trafficcontrol.git +refs/heads/*:refs/remotes/origin/*
 > git rev-parse refs/remotes/origin/master^{commit} # timeout=10
 > git rev-parse refs/remotes/origin/origin/master^{commit} # timeout=10
Checking out Revision a3b1685e9bc8b501592fad7360752f0caa6636d5 (refs/remotes/origin/master)
Commit message: "remove unauthenticated priv level due to refactor"
 > git config core.sparsecheckout # timeout=10
 > git checkout -f a3b1685e9bc8b501592fad7360752f0caa6636d5
 > git rev-list 405099f8b6b4cc5de08c1d6dca7fd376c4f4aab3 # timeout=10
FATAL: Unable to produce a script file
java.io.IOException: No space left on device
	at java.io.FileOutputStream.writeBytes(Native Method)
	at java.io.FileOutputStream.write(FileOutputStream.java:326)
	at sun.nio.cs.StreamEncoder.writeBytes(StreamEncoder.java:221)
	at sun.nio.cs.StreamEncoder.implClose(StreamEncoder.java:316)
	at sun.nio.cs.StreamEncoder.close(StreamEncoder.java:149)
	at java.io.OutputStreamWriter.close(OutputStreamWriter.java:233)
	at hudson.FilePath$17.invoke(FilePath.java:1381)
	at hudson.FilePath$17.invoke(FilePath.java:1364)
	at hudson.FilePath$FileCallableWrapper.call(FilePath.java:2750)
	at hudson.remoting.UserRequest.perform(UserRequest.java:181)
	at hudson.remoting.UserRequest.perform(UserRequest.java:52)
	at hudson.remoting.Request$2.run(Request.java:336)
	at hudson.remoting.InterceptingExecutorService$1.call(InterceptingExecutorService.java:68)
	at java.util.concurrent.FutureTask.run(FutureTask.java:266)
	at java.util.concurrent.ThreadPoolExecutor.runWorker(ThreadPoolExecutor.java:1142)
	at java.util.concurrent.ThreadPoolExecutor$Worker.run(ThreadPoolExecutor.java:617)
	at java.lang.Thread.run(Thread.java:745)
	at ......remote call to qnode3(Native Method)
	at hudson.remoting.Channel.attachCallSiteStackTrace(Channel.java:1554)
	at hudson.remoting.UserResponse.retrieve(UserRequest.java:281)
	at hudson.remoting.Channel.call(Channel.java:839)
	at hudson.FilePath.act(FilePath.java:987)
Caused: java.io.IOException: remote file operation failed: <https://builds.apache.org/job/incubator-trafficcontrol-traffic_ops-test/ws/> at hudson.remoting.Channel@2801ec2:qnode3
	at hudson.FilePath.act(FilePath.java:994)
	at hudson.FilePath.act(FilePath.java:976)
	at hudson.FilePath.createTextTempFile(FilePath.java:1364)
Caused: java.io.IOException: Failed to create a temp file on <https://builds.apache.org/job/incubator-trafficcontrol-traffic_ops-test/ws/>
	at hudson.FilePath.createTextTempFile(FilePath.java:1387)
	at hudson.tasks.CommandInterpreter.createScriptFile(CommandInterpreter.java:162)
	at hudson.tasks.CommandInterpreter.perform(CommandInterpreter.java:94)
	at hudson.tasks.CommandInterpreter.perform(CommandInterpreter.java:66)
	at hudson.tasks.BuildStepMonitor$1.perform(BuildStepMonitor.java:20)
	at hudson.model.AbstractBuild$AbstractBuildExecution.perform(AbstractBuild.java:736)
	at hudson.model.Build$BuildExecution.build(Build.java:206)
	at hudson.model.Build$BuildExecution.doRun(Build.java:163)
	at hudson.model.AbstractBuild$AbstractBuildExecution.run(AbstractBuild.java:496)
	at hudson.model.Run.execute(Run.java:1737)
	at hudson.model.FreeStyleBuild.run(FreeStyleBuild.java:43)
	at hudson.model.ResourceController.execute(ResourceController.java:97)
	at hudson.model.Executor.run(Executor.java:419)
Build step 'Execute shell' marked build as failure