You are viewing a plain text version of this content. The canonical link for it is here.
Posted to builds@solr.apache.org by Apache Jenkins Server <je...@builds.apache.org> on 2026/01/20 23:50:55 UTC

[JENKINS] Solr » Solr-Lint-10.x - Build # 96 - Still Failing!

Build: https://ci-builds.apache.org/job/Solr/job/Solr-Lint-10.x/96/

No tests ran.

Build Log:
[...truncated 1145 lines...]
BUILD FAILED in 10m 21s
629 actionable tasks: 629 executed

Publishing build scan...
https://develocity.apache.org/s/44k5xer5h2l4a

Build step 'Invoke Gradle script' changed build result to FAILURE
Build step 'Invoke Gradle script' marked build as failure
Email was triggered for: Failure - Any
Sending email for trigger: Failure - Any

[JENKINS] Solr » Solr-Lint-10.x - Build # 97 - Still Failing!

Posted by Apache Jenkins Server <je...@builds.apache.org>.
Build: https://ci-builds.apache.org/job/Solr/job/Solr-Lint-10.x/97/

No tests ran.

Build Log:
[...truncated 1145 lines...]
BUILD FAILED in 10m 17s
629 actionable tasks: 629 executed

Publishing build scan...
https://develocity.apache.org/s/o5ysgm6ku4b3a

Build step 'Invoke Gradle script' changed build result to FAILURE
Build step 'Invoke Gradle script' marked build as failure
Email was triggered for: Failure - Any
Sending email for trigger: Failure - Any