You are viewing a plain text version of this content. The canonical link for it is here.
Posted to notifications@maven.apache.org by Apache Jenkins Server <je...@builds.apache.org> on 2012/09/27 16:59:39 UTC
Build failed in Jenkins: maven-plugins-ITs-m2 #786
See <https://builds.apache.org/job/maven-plugins-ITs-m2/786/changes>
Changes:
[olamy] add contributor
[olamy] [MCHECKSTYLE-181] Upgrade to Checkstyle 5.6
Submitted by Baron Roberts
fix its as checkstyle are now modified in svn.
[olamy] [MCHECKSTYLE-181] Upgrade to Checkstyle 5.6
Submitted by Baron Roberts
Remove DoubleCheckedLocking as not anymore suppoted by checkstyle 5.6
------------------------------------------
[...truncated 10203 lines...]
[INFO] Assembling webapp [maven-war-plugin-test] in [<https://builds.apache.org/job/maven-plugins-ITs-m2/ws/maven-war-plugin/target/test-classes/unit/warexplodedmojo/test-dir/ExplodedWarWithFileNameMapping]>
[INFO] Processing war project
[INFO] Copying webapp resources [<https://builds.apache.org/job/maven-plugins-ITs-m2/ws/maven-war-plugin/target/test-classes/unit/warexplodedmojo/test-dir/ExplodedWarWithFileNameMapping-test-data/source]>
[INFO] Webapp assembled in [3 msecs]
[INFO] Exploding webapp
[INFO] Assembling webapp [maven-war-plugin-test] in [<https://builds.apache.org/job/maven-plugins-ITs-m2/ws/maven-war-plugin/target/test-classes/unit/warexplodedmojo/test-dir/ExplodedWarWithFileNameMappingAndDuplicateDependencies]>
[INFO] Processing war project
[INFO] Copying webapp resources [<https://builds.apache.org/job/maven-plugins-ITs-m2/ws/maven-war-plugin/target/test-classes/unit/warexplodedmojo/test-dir/ExplodedWarWithFileNameMappingAndDuplicateDependencies-test-data/source]>
[INFO] Webapp assembled in [3 msecs]
Tests run: 22, Failures: 0, Errors: 0, Skipped: 0, Time elapsed: 1.012 sec
Running org.apache.maven.plugin.war.WarInPlaceMojoTest
[INFO] Generating webapp in source directory [<https://builds.apache.org/job/maven-plugins-ITs-m2/ws/maven-war-plugin/target/test-classes/unit/warexplodedinplacemojo/test-dir/SimpleExplodedInplaceWar-test-data/source]>
[INFO] Assembling webapp [maven-war-plugin-test] in [<https://builds.apache.org/job/maven-plugins-ITs-m2/ws/maven-war-plugin/target/test-classes/unit/warexplodedinplacemojo/test-dir/SimpleExplodedInplaceWar-test-data/source]>
[INFO] Processing war project
[INFO] Copying webapp webResources [<https://builds.apache.org/job/maven-plugins-ITs-m2/ws/maven-war-plugin/target/test-classes/unit/warexplodedinplacemojo/test-dir/resources]> to [<https://builds.apache.org/job/maven-plugins-ITs-m2/ws/maven-war-plugin/target/test-classes/unit/warexplodedinplacemojo/test-dir/SimpleExplodedInplaceWar-test-data/source]>
[INFO] Webapp assembled in [2 msecs]
Tests run: 2, Failures: 0, Errors: 0, Skipped: 0, Time elapsed: 0.072 sec
Results :
Tests run: 85, Failures: 0, Errors: 0, Skipped: 0
[INFO] [jar:jar {execution: default-jar}]
[INFO] Building jar: <https://builds.apache.org/job/maven-plugins-ITs-m2/ws/maven-war-plugin/target/maven-war-plugin-2.3-SNAPSHOT.jar>
[INFO] [plugin:addPluginArtifactMetadata {execution: default-addPluginArtifactMetadata}]
[INFO] [invoker:install {execution: integration-test}]
[INFO] Installing <https://builds.apache.org/job/maven-plugins-ITs-m2/ws/maven-war-plugin/pom.xml> to <https://builds.apache.org/job/maven-plugins-ITs-m2/ws/maven-war-plugin/target/local-repo/org/apache/maven/plugins/maven-war-plugin/2.3-SNAPSHOT/maven-war-plugin-2.3-SNAPSHOT.pom>
[INFO] Installing <https://builds.apache.org/job/maven-plugins-ITs-m2/ws/maven-war-plugin/target/maven-war-plugin-2.3-SNAPSHOT.jar> to <https://builds.apache.org/job/maven-plugins-ITs-m2/ws/maven-war-plugin/target/local-repo/org/apache/maven/plugins/maven-war-plugin/2.3-SNAPSHOT/maven-war-plugin-2.3-SNAPSHOT.jar>
[INFO] [invoker:integration-test {execution: integration-test}]
[INFO] Building: simple-war-project/pom.xml
[INFO] run script <https://builds.apache.org/job/maven-plugins-ITs-m2/ws/maven-war-plugin/target/it/simple-war-project/verify.bsh>
[INFO] ..SUCCESS (3.3 s)
[INFO] Building: MWAR-143/pom.xml
[INFO] run script <https://builds.apache.org/job/maven-plugins-ITs-m2/ws/maven-war-plugin/target/it/MWAR-143/verify.bsh>
[INFO] ..SUCCESS (7.6 s)
[INFO] Building: MWAR-139/pom.xml
[INFO] run script <https://builds.apache.org/job/maven-plugins-ITs-m2/ws/maven-war-plugin/target/it/MWAR-139/verify.bsh>
[INFO] ..SUCCESS (3.0 s)
[INFO] Building: MWAR-133/pom.xml
[INFO] run script <https://builds.apache.org/job/maven-plugins-ITs-m2/ws/maven-war-plugin/target/it/MWAR-133/verify.bsh>
[INFO] ..SUCCESS (2.4 s)
[INFO] Building: scoped-dependency-same-artifact/pom.xml
[INFO] run script <https://builds.apache.org/job/maven-plugins-ITs-m2/ws/maven-war-plugin/target/it/scoped-dependency-same-artifact/verify.bsh>
[INFO] ..SUCCESS (3.3 s)
[INFO] Building: overlay-excludes/pom.xml
[INFO] run script <https://builds.apache.org/job/maven-plugins-ITs-m2/ws/maven-war-plugin/target/it/overlay-excludes/verify.bsh>
[INFO] ..SUCCESS (4.3 s)
[INFO] Building: simple-war-no-webxml/pom.xml
[INFO] run script <https://builds.apache.org/job/maven-plugins-ITs-m2/ws/maven-war-plugin/target/it/simple-war-no-webxml/verify.bsh>
[INFO] ..SUCCESS (3.1 s)
[INFO] Building: MWAR-62/pom.xml
[INFO] run script <https://builds.apache.org/job/maven-plugins-ITs-m2/ws/maven-war-plugin/target/it/MWAR-62/verify.bsh>
[INFO] ..SUCCESS (2.4 s)
[INFO] Building: web-resources-filtering/pom.xml
[INFO] run script <https://builds.apache.org/job/maven-plugins-ITs-m2/ws/maven-war-plugin/target/it/web-resources-filtering/verify.bsh>
[INFO] ..SUCCESS (4.0 s)
[INFO] Building: MWAR-96/pom.xml
[INFO] run script <https://builds.apache.org/job/maven-plugins-ITs-m2/ws/maven-war-plugin/target/it/MWAR-96/verify.bsh>
[INFO] ..SUCCESS (3.0 s)
[INFO] Building: MWAR-240/pom.xml
[INFO] run script <https://builds.apache.org/job/maven-plugins-ITs-m2/ws/maven-war-plugin/target/it/MWAR-240/verify.bsh>
[INFO] ..SUCCESS (3.3 s)
[INFO] Building: MWAR-131/pom.xml
[INFO] run script <https://builds.apache.org/job/maven-plugins-ITs-m2/ws/maven-war-plugin/target/it/MWAR-131/verify.bsh>
[INFO] ..SUCCESS (6.4 s)
[INFO] Building: default/pom.xml
[INFO] run script <https://builds.apache.org/job/maven-plugins-ITs-m2/ws/maven-war-plugin/target/it/default/verify.bsh>
[INFO] ..SUCCESS (3.3 s)
[INFO] Building: manifest-content/pom.xml
[INFO] run script <https://builds.apache.org/job/maven-plugins-ITs-m2/ws/maven-war-plugin/target/it/manifest-content/verify.bsh>
[INFO] ..SUCCESS (3.1 s)
[INFO] Building: MWAR-129/pom.xml
[INFO] run script <https://builds.apache.org/job/maven-plugins-ITs-m2/ws/maven-war-plugin/target/it/MWAR-129/verify.bsh>
[INFO] ..SUCCESS (2.5 s)
[INFO] [invoker:verify {execution: integration-test}]
[INFO] -------------------------------------------------
[INFO] Build Summary:
[INFO] Passed: 15, Failed: 0, Errors: 0, Skipped: 0
[INFO] -------------------------------------------------
[INFO] [install:install {execution: default-install}]
[INFO] Installing <https://builds.apache.org/job/maven-plugins-ITs-m2/ws/maven-war-plugin/target/maven-war-plugin-2.3-SNAPSHOT.jar> to /home/jenkins/.m2/repository/org/apache/maven/plugins/maven-war-plugin/2.3-SNAPSHOT/maven-war-plugin-2.3-SNAPSHOT.jar
[INFO] ------------------------------------------------------------------------
[INFO] Building SCM Publish Maven Plugin
[INFO] task-segment: [clean, install]
[INFO] ------------------------------------------------------------------------
[INFO] [clean:clean {execution: default-clean}]
[INFO] Deleting <https://builds.apache.org/job/maven-plugins-ITs-m2/ws/maven-scm-publish-plugin/target>
[INFO] [enforcer:enforce {execution: ensure-no-container-api}]
[INFO] [plugin:helpmojo {execution: generated-helpmojo}]
[INFO] Using 'UTF-8' encoding to read mojo metadata.
[INFO] Applying mojo extractor for language: java
[INFO] Mojo extractor for language: java found 1 mojo descriptors.
[INFO] Applying mojo extractor for language: bsh
[INFO] Mojo extractor for language: bsh found 0 mojo descriptors.
[INFO] Applying mojo extractor for language: java-annotations
[INFO] Mojo extractor for language: java-annotations found 0 mojo descriptors.
[INFO] [plugin:descriptor {execution: default-descriptor}]
[INFO] Using 'UTF-8' encoding to read mojo metadata.
[INFO] Applying mojo extractor for language: java
[INFO] Mojo extractor for language: java found 2 mojo descriptors.
[INFO] Applying mojo extractor for language: bsh
[INFO] Mojo extractor for language: bsh found 0 mojo descriptors.
[INFO] Applying mojo extractor for language: java-annotations
[INFO] Mojo extractor for language: java-annotations found 0 mojo descriptors.
[WARNING] The parameter expression: 'project.build.resources' used in mojo: 'process' has been deprecated. Use 'project.resources' instead.
[INFO] [remote-resources:process {execution: default}]
[debug] execute contextualize
[INFO] [resources:resources {execution: default-resources}]
[INFO] Using 'UTF-8' encoding to copy filtered resources.
[INFO] Copying 2 resources
[INFO] Copying 3 resources
[INFO] [compiler:compile {execution: default-compile}]
[INFO] Compiling 7 source files to <https://builds.apache.org/job/maven-plugins-ITs-m2/ws/maven-scm-publish-plugin/target/classes>
[INFO] [plugin:descriptor {execution: mojo-descriptor}]
[INFO] Using 'UTF-8' encoding to read mojo metadata.
[INFO] Applying mojo extractor for language: java
[INFO] Mojo extractor for language: java found 2 mojo descriptors.
[INFO] Applying mojo extractor for language: bsh
[INFO] Mojo extractor for language: bsh found 0 mojo descriptors.
[INFO] Applying mojo extractor for language: java-annotations
[INFO] Mojo extractor for language: java-annotations found 3 mojo descriptors.
[debug] execute contextualize
[INFO] [resources:testResources {execution: default-testResources}]
[INFO] Using 'UTF-8' encoding to copy filtered resources.
[INFO] skip non existing resourceDirectory <https://builds.apache.org/job/maven-plugins-ITs-m2/ws/maven-scm-publish-plugin/src/test/resources>
[INFO] Copying 3 resources
[INFO] [compiler:testCompile {execution: default-testCompile}]
[INFO] No sources to compile
[INFO] [surefire:test {execution: default-test}]
[INFO] Surefire report directory: <https://builds.apache.org/job/maven-plugins-ITs-m2/ws/maven-scm-publish-plugin/target/surefire-reports>
-------------------------------------------------------
T E S T S
-------------------------------------------------------
Results :
Tests run: 0, Failures: 0, Errors: 0, Skipped: 0
[INFO] [jar:jar {execution: default-jar}]
[INFO] Building jar: <https://builds.apache.org/job/maven-plugins-ITs-m2/ws/maven-scm-publish-plugin/target/maven-scm-publish-plugin-1.0-SNAPSHOT.jar>
[INFO] [plugin:addPluginArtifactMetadata {execution: default-addPluginArtifactMetadata}]
[INFO] [invoker:install {execution: integration-test}]
[INFO] Installing <https://builds.apache.org/job/maven-plugins-ITs-m2/ws/maven-scm-publish-plugin/pom.xml> to <https://builds.apache.org/job/maven-plugins-ITs-m2/ws/maven-scm-publish-plugin/target/local-repo/org/apache/maven/plugins/maven-scm-publish-plugin/1.0-SNAPSHOT/maven-scm-publish-plugin-1.0-SNAPSHOT.pom>
[INFO] Installing <https://builds.apache.org/job/maven-plugins-ITs-m2/ws/maven-scm-publish-plugin/target/maven-scm-publish-plugin-1.0-SNAPSHOT.jar> to <https://builds.apache.org/job/maven-plugins-ITs-m2/ws/maven-scm-publish-plugin/target/local-repo/org/apache/maven/plugins/maven-scm-publish-plugin/1.0-SNAPSHOT/maven-scm-publish-plugin-1.0-SNAPSHOT.jar>
[INFO] [invoker:integration-test {execution: integration-test}]
[INFO] Building: 006-site-multi-module/pom.xml
[INFO] run script setup.bsh
[INFO] ..SUCCESS (22.1 s)
[INFO] Building: 005-site-lifecycle/pom.xml
[INFO] run script setup.bsh
[INFO] ..SUCCESS (18.8 s)
[INFO] Building: 002-perform/pom.xml
[INFO] run script setup.bsh
[INFO] ..SUCCESS (19.0 s)
[INFO] Building: 001-prepare/pom.xml
[INFO] run script setup.bsh
[INFO] ..SUCCESS (5.1 s)
[INFO] Building: 004-publish-scm/pom.xml
[INFO] run script setup.bsh
[INFO] ..SUCCESS (18.9 s)
[INFO] Building: 003-lifecycle/pom.xml
[INFO] run script setup.bsh
[INFO] ..SUCCESS (4.5 s)
[INFO] [invoker:verify {execution: integration-test}]
[INFO] -------------------------------------------------
[INFO] Build Summary:
[INFO] Passed: 6, Failed: 0, Errors: 0, Skipped: 0
[INFO] -------------------------------------------------
[INFO] [install:install {execution: default-install}]
[INFO] Installing <https://builds.apache.org/job/maven-plugins-ITs-m2/ws/maven-scm-publish-plugin/target/maven-scm-publish-plugin-1.0-SNAPSHOT.jar> to /home/jenkins/.m2/repository/org/apache/maven/plugins/maven-scm-publish-plugin/1.0-SNAPSHOT/maven-scm-publish-plugin-1.0-SNAPSHOT.jar
[INFO] ------------------------------------------------------------------------
[INFO] Building Maven Plugins Aggregator
[INFO] task-segment: [clean, install]
[INFO] ------------------------------------------------------------------------
[INFO] [clean:clean {execution: default-clean}]
[INFO] Deleting <https://builds.apache.org/job/maven-plugins-ITs-m2/ws/target>
[INFO] [remote-resources:process {execution: default}]
[INFO] [site:attach-descriptor {execution: default-attach-descriptor}]
[INFO] [install:install {execution: default-install}]
[INFO] Installing <https://builds.apache.org/job/maven-plugins-ITs-m2/ws/pom.xml> to /home/jenkins/.m2/repository/org/apache/maven/plugins/maven-plugins-aggregator/1-SNAPSHOT/maven-plugins-aggregator-1-SNAPSHOT.pom
[INFO]
[INFO]
[INFO] ------------------------------------------------------------------------
[INFO] Reactor Summary:
[INFO] ------------------------------------------------------------------------
[INFO] Maven Plugins ......................................... SUCCESS [6.878s]
[INFO] Maven ACR Plugin ...................................... SUCCESS [28.858s]
[INFO] Maven Ant Plugin ...................................... SUCCESS [1:05.469s]
[INFO] Maven AntRun Plugin ................................... SUCCESS [51.178s]
[INFO] Maven Eclipse Plugin .................................. SUCCESS [6:36.362s]
[INFO] Maven Assembly Plugin ................................. SUCCESS [11:29.564s]
[INFO] Maven Changelog Plugin ................................ FAILED [8.020s]
[INFO] Maven Compiler Plugin ................................. SUCCESS [54.079s]
[INFO] Maven Changes Report Plugin ........................... SUCCESS [1:15.482s]
[INFO] Maven Checkstyle Plugin ............................... SUCCESS [1:59.588s]
[INFO] Maven Clean Plugin .................................... SUCCESS [16.101s]
[INFO] Maven Dependency Plugin ............................... SUCCESS [2:31.651s]
[INFO] Maven Deploy Plugin ................................... SUCCESS [59.191s]
[INFO] Maven DOAP Plugin ..................................... SUCCESS [16.708s]
[INFO] Maven Documentation Checker Plugin .................... SUCCESS [6.614s]
[INFO] Maven EAR Plugin ...................................... SUCCESS [3:37.876s]
[INFO] Maven EJB Plugin ...................................... SUCCESS [26.369s]
[INFO] Maven GPG Plugin ...................................... SUCCESS [9.463s]
[INFO] Maven Help Plugin ..................................... SUCCESS [30.032s]
[INFO] Maven IDEA Plugin ..................................... SUCCESS [8.842s]
[INFO] Maven Install Plugin .................................. SUCCESS [37.943s]
[INFO] Maven JAR Plugin ...................................... SUCCESS [1:03.849s]
[INFO] Maven Jarsigner Plugin ................................ SUCCESS [24.249s]
[INFO] Maven Javadoc Plugin .................................. FAILED [1:18.366s]
[INFO] Maven Linkcheck Plugin ................................ SUCCESS [2.940s]
[INFO] Maven One Plugin ...................................... SUCCESS [1.735s]
[INFO] Maven Patch Plugin .................................... SUCCESS [11.642s]
[INFO] Maven PDF Plugin ...................................... SUCCESS [44.721s]
[INFO] Maven PMD Plugin ...................................... SUCCESS [44.783s]
[INFO] Maven RAR Plugin ...................................... SUCCESS [10.186s]
[INFO] Maven Reactor Plugin .................................. SUCCESS [2.914s]
[INFO] Maven Repository Plugin ............................... SUCCESS [43.136s]
[INFO] Maven Resources Plugin ................................ SUCCESS [57.501s]
[INFO] Maven Site Plugin 3 ................................... SUCCESS [7:12.453s]
[INFO] Maven Source Plugin ................................... SUCCESS [46.834s]
[INFO] Maven Stage Plugin .................................... SUCCESS [2.247s]
[INFO] Maven Toolchains Plugin ............................... SUCCESS [2.387s]
[INFO] Maven Verifier Plugin ................................. SUCCESS [14.306s]
[INFO] Maven WAR Plugin ...................................... SUCCESS [1:15.786s]
[INFO] SCM Publish Maven Plugin .............................. SUCCESS [1:40.565s]
[INFO] Maven Plugins Aggregator .............................. SUCCESS [1.109s]
[INFO] ------------------------------------------------------------------------
[INFO] Error for project: Maven Changelog Plugin (during install)
[INFO] ------------------------------------------------------------------------
[INFO] There are test failures.
Please refer to <https://builds.apache.org/job/maven-plugins-ITs-m2/ws/maven-changelog-plugin/target/surefire-reports> for the individual test results.
[INFO] ------------------------------------------------------------------------
[INFO] Error for project: Maven Javadoc Plugin (during install)
[INFO] ------------------------------------------------------------------------
[INFO] There are test failures.
Please refer to <https://builds.apache.org/job/maven-plugins-ITs-m2/ws/maven-javadoc-plugin/target/surefire-reports> for the individual test results.
[INFO] ------------------------------------------------------------------------
[INFO] For more information, run Maven with the -e switch
[INFO] ------------------------------------------------------------------------
[INFO] BUILD ERRORS
[INFO] ------------------------------------------------------------------------
[INFO] Total time: 52 minutes 19 seconds
[INFO] Finished at: Thu Sep 27 14:59:36 UTC 2012
[INFO] Final Memory: 279M/1017M
[INFO] ------------------------------------------------------------------------
Build step 'Invoke top-level Maven targets' marked build as failure
Jenkins build is back to normal : maven-plugins-ITs-m2 #791
Posted by Apache Jenkins Server <je...@builds.apache.org>.
See <https://builds.apache.org/job/maven-plugins-ITs-m2/791/changes>
Re: Build failed in Jenkins: maven-plugins-ITs-m2 #790
Posted by Benson Margulies <bi...@gmail.com>.
On Fri, Sep 28, 2012 at 6:06 PM, Dennis Lundberg <de...@apache.org> wrote:
> Hi
>
> I had a look at why the Javadoc Plugin has started failing. At first it
> seemed weird since there had been no code changes, but then it hit me
> that a new version of said plugin had just been released, and therefor a
> new site had been published. After some digging I found out the reason
> for the failure.
>
> In version 2.8.1 the package-list looks like this:
> maven.apache.org/plugins/maven-javadoc-plugin-2.8.1/apidocs/package-list
>
> In version 2.9 (latest) the package-list looks like this:
> http://maven.apache.org/plugins/maven-javadoc-plugin/apidocs/package-list
how interesting. the javadoc command writes this. I would guess that
it has to do with the presence of the default package in the picture
somehow.
>
> Note the leading empty line in 2.9, which is causing JavadocUtil to deem
> the package-list invalid. I don't know where the blank line is coming
> from or why it has appeared now, but it seems to be a regression in
> Javadoc Plugin 2.9.
>
> On 2012-09-28 23:00, Apache Jenkins Server wrote:
>> See <https://builds.apache.org/job/maven-plugins-ITs-m2/790/changes>
>>
>> Changes:
>>
>> [krosenvold] Revert "added generics"
>>
>> This reverts commit 19ae2a8f731d39653450c89d830f25e7ecf691bf.
>>
>> [krosenvold] o Make asssembly compile on java7
>>
>> ------------------------------------------
>> [...truncated 10159 lines...]
>> [INFO] Exploding webapp
>> [INFO] Assembling webapp [maven-war-plugin-test] in [<https://builds.apache.org/job/maven-plugins-ITs-m2/ws/maven-war-plugin/target/test-classes/unit/warexplodedmojo/test-dir/ExplodedWarWithSourceModificationCheck]>
>> [INFO] Processing war project
>> [INFO] Copying webapp resources [<https://builds.apache.org/job/maven-plugins-ITs-m2/ws/maven-war-plugin/target/test-classes/unit/warexplodedmojo/test-dir/ExplodedWarWithSourceModificationCheck-test-data/source]>
>> [INFO] Webapp assembled in [2 msecs]
>> [INFO] Exploding webapp
>> [INFO] Assembling webapp [maven-war-plugin-test] in [<https://builds.apache.org/job/maven-plugins-ITs-m2/ws/maven-war-plugin/target/test-classes/unit/warexplodedmojo/test-dir/ExplodedWarWithFileNameMapping]>
>> [INFO] Processing war project
>> [INFO] Copying webapp resources [<https://builds.apache.org/job/maven-plugins-ITs-m2/ws/maven-war-plugin/target/test-classes/unit/warexplodedmojo/test-dir/ExplodedWarWithFileNameMapping-test-data/source]>
>> [INFO] Webapp assembled in [3 msecs]
>> [INFO] Exploding webapp
>> [INFO] Assembling webapp [maven-war-plugin-test] in [<https://builds.apache.org/job/maven-plugins-ITs-m2/ws/maven-war-plugin/target/test-classes/unit/warexplodedmojo/test-dir/ExplodedWarWithFileNameMappingAndDuplicateDependencies]>
>> [INFO] Processing war project
>> [INFO] Copying webapp resources [<https://builds.apache.org/job/maven-plugins-ITs-m2/ws/maven-war-plugin/target/test-classes/unit/warexplodedmojo/test-dir/ExplodedWarWithFileNameMappingAndDuplicateDependencies-test-data/source]>
>> [INFO] Webapp assembled in [3 msecs]
>> Tests run: 22, Failures: 0, Errors: 0, Skipped: 0, Time elapsed: 1.016 sec
>> Running org.apache.maven.plugin.war.WarInPlaceMojoTest
>> [INFO] Generating webapp in source directory [<https://builds.apache.org/job/maven-plugins-ITs-m2/ws/maven-war-plugin/target/test-classes/unit/warexplodedinplacemojo/test-dir/SimpleExplodedInplaceWar-test-data/source]>
>> [INFO] Assembling webapp [maven-war-plugin-test] in [<https://builds.apache.org/job/maven-plugins-ITs-m2/ws/maven-war-plugin/target/test-classes/unit/warexplodedinplacemojo/test-dir/SimpleExplodedInplaceWar-test-data/source]>
>> [INFO] Processing war project
>> [INFO] Copying webapp webResources [<https://builds.apache.org/job/maven-plugins-ITs-m2/ws/maven-war-plugin/target/test-classes/unit/warexplodedinplacemojo/test-dir/resources]> to [<https://builds.apache.org/job/maven-plugins-ITs-m2/ws/maven-war-plugin/target/test-classes/unit/warexplodedinplacemojo/test-dir/SimpleExplodedInplaceWar-test-data/source]>
>> [INFO] Webapp assembled in [1 msecs]
>> Tests run: 2, Failures: 0, Errors: 0, Skipped: 0, Time elapsed: 0.071 sec
>>
>> Results :
>>
>> Tests run: 85, Failures: 0, Errors: 0, Skipped: 0
>>
>> [INFO] [jar:jar {execution: default-jar}]
>> [INFO] Building jar: <https://builds.apache.org/job/maven-plugins-ITs-m2/ws/maven-war-plugin/target/maven-war-plugin-2.4-SNAPSHOT.jar>
>> [INFO] [plugin:addPluginArtifactMetadata {execution: default-addPluginArtifactMetadata}]
>> [INFO] [invoker:install {execution: integration-test}]
>> [INFO] Installing <https://builds.apache.org/job/maven-plugins-ITs-m2/ws/maven-war-plugin/pom.xml> to <https://builds.apache.org/job/maven-plugins-ITs-m2/ws/maven-war-plugin/target/local-repo/org/apache/maven/plugins/maven-war-plugin/2.4-SNAPSHOT/maven-war-plugin-2.4-SNAPSHOT.pom>
>> [INFO] Installing <https://builds.apache.org/job/maven-plugins-ITs-m2/ws/maven-war-plugin/target/maven-war-plugin-2.4-SNAPSHOT.jar> to <https://builds.apache.org/job/maven-plugins-ITs-m2/ws/maven-war-plugin/target/local-repo/org/apache/maven/plugins/maven-war-plugin/2.4-SNAPSHOT/maven-war-plugin-2.4-SNAPSHOT.jar>
>> [INFO] [invoker:integration-test {execution: integration-test}]
>> [INFO] Building: simple-war-project/pom.xml
>> [INFO] run script <https://builds.apache.org/job/maven-plugins-ITs-m2/ws/maven-war-plugin/target/it/simple-war-project/verify.bsh>
>> [INFO] ..SUCCESS (3.2 s)
>> [INFO] Building: MWAR-143/pom.xml
>> [INFO] run script <https://builds.apache.org/job/maven-plugins-ITs-m2/ws/maven-war-plugin/target/it/MWAR-143/verify.bsh>
>> [INFO] ..SUCCESS (7.7 s)
>> [INFO] Building: MWAR-139/pom.xml
>> [INFO] run script <https://builds.apache.org/job/maven-plugins-ITs-m2/ws/maven-war-plugin/target/it/MWAR-139/verify.bsh>
>> [INFO] ..SUCCESS (2.9 s)
>> [INFO] Building: MWAR-133/pom.xml
>> [INFO] run script <https://builds.apache.org/job/maven-plugins-ITs-m2/ws/maven-war-plugin/target/it/MWAR-133/verify.bsh>
>> [INFO] ..SUCCESS (2.5 s)
>> [INFO] Building: scoped-dependency-same-artifact/pom.xml
>> [INFO] run script <https://builds.apache.org/job/maven-plugins-ITs-m2/ws/maven-war-plugin/target/it/scoped-dependency-same-artifact/verify.bsh>
>> [INFO] ..SUCCESS (3.4 s)
>> [INFO] Building: overlay-excludes/pom.xml
>> [INFO] run script <https://builds.apache.org/job/maven-plugins-ITs-m2/ws/maven-war-plugin/target/it/overlay-excludes/verify.bsh>
>> [INFO] ..SUCCESS (4.1 s)
>> [INFO] Building: simple-war-no-webxml/pom.xml
>> [INFO] run script <https://builds.apache.org/job/maven-plugins-ITs-m2/ws/maven-war-plugin/target/it/simple-war-no-webxml/verify.bsh>
>> [INFO] ..SUCCESS (2.9 s)
>> [INFO] Building: MWAR-62/pom.xml
>> [INFO] run script <https://builds.apache.org/job/maven-plugins-ITs-m2/ws/maven-war-plugin/target/it/MWAR-62/verify.bsh>
>> [INFO] ..SUCCESS (2.3 s)
>> [INFO] Building: web-resources-filtering/pom.xml
>> [INFO] run script <https://builds.apache.org/job/maven-plugins-ITs-m2/ws/maven-war-plugin/target/it/web-resources-filtering/verify.bsh>
>> [INFO] ..SUCCESS (3.8 s)
>> [INFO] Building: MWAR-96/pom.xml
>> [INFO] run script <https://builds.apache.org/job/maven-plugins-ITs-m2/ws/maven-war-plugin/target/it/MWAR-96/verify.bsh>
>> [INFO] ..SUCCESS (2.9 s)
>> [INFO] Building: MWAR-240/pom.xml
>> [INFO] run script <https://builds.apache.org/job/maven-plugins-ITs-m2/ws/maven-war-plugin/target/it/MWAR-240/verify.bsh>
>> [INFO] ..SUCCESS (3.2 s)
>> [INFO] Building: MWAR-131/pom.xml
>> [INFO] run script <https://builds.apache.org/job/maven-plugins-ITs-m2/ws/maven-war-plugin/target/it/MWAR-131/verify.bsh>
>> [INFO] ..SUCCESS (6.4 s)
>> [INFO] Building: default/pom.xml
>> [INFO] run script <https://builds.apache.org/job/maven-plugins-ITs-m2/ws/maven-war-plugin/target/it/default/verify.bsh>
>> [INFO] ..SUCCESS (3.3 s)
>> [INFO] Building: manifest-content/pom.xml
>> [INFO] run script <https://builds.apache.org/job/maven-plugins-ITs-m2/ws/maven-war-plugin/target/it/manifest-content/verify.bsh>
>> [INFO] ..SUCCESS (3.0 s)
>> [INFO] Building: MWAR-129/pom.xml
>> [INFO] run script <https://builds.apache.org/job/maven-plugins-ITs-m2/ws/maven-war-plugin/target/it/MWAR-129/verify.bsh>
>> [INFO] ..SUCCESS (2.3 s)
>> [INFO] [invoker:verify {execution: integration-test}]
>> [INFO] -------------------------------------------------
>> [INFO] Build Summary:
>> [INFO] Passed: 15, Failed: 0, Errors: 0, Skipped: 0
>> [INFO] -------------------------------------------------
>> [INFO] [install:install {execution: default-install}]
>> [INFO] Installing <https://builds.apache.org/job/maven-plugins-ITs-m2/ws/maven-war-plugin/target/maven-war-plugin-2.4-SNAPSHOT.jar> to /home/jenkins/.m2/repository/org/apache/maven/plugins/maven-war-plugin/2.4-SNAPSHOT/maven-war-plugin-2.4-SNAPSHOT.jar
>> [INFO] ------------------------------------------------------------------------
>> [INFO] Building SCM Publish Maven Plugin
>> [INFO] task-segment: [clean, install]
>> [INFO] ------------------------------------------------------------------------
>> [INFO] [clean:clean {execution: default-clean}]
>> [INFO] Deleting <https://builds.apache.org/job/maven-plugins-ITs-m2/ws/maven-scm-publish-plugin/target>
>> [INFO] [enforcer:enforce {execution: ensure-no-container-api}]
>> [INFO] [plugin:helpmojo {execution: generated-helpmojo}]
>> [INFO] Using 'UTF-8' encoding to read mojo metadata.
>> [INFO] Applying mojo extractor for language: java
>> [INFO] Mojo extractor for language: java found 1 mojo descriptors.
>> [INFO] Applying mojo extractor for language: bsh
>> [INFO] Mojo extractor for language: bsh found 0 mojo descriptors.
>> [INFO] Applying mojo extractor for language: java-annotations
>> [INFO] Mojo extractor for language: java-annotations found 0 mojo descriptors.
>> [INFO] [plugin:descriptor {execution: default-descriptor}]
>> [INFO] Using 'UTF-8' encoding to read mojo metadata.
>> [INFO] Applying mojo extractor for language: java
>> [INFO] Mojo extractor for language: java found 2 mojo descriptors.
>> [INFO] Applying mojo extractor for language: bsh
>> [INFO] Mojo extractor for language: bsh found 0 mojo descriptors.
>> [INFO] Applying mojo extractor for language: java-annotations
>> [INFO] Mojo extractor for language: java-annotations found 0 mojo descriptors.
>> [WARNING] The parameter expression: 'project.build.resources' used in mojo: 'process' has been deprecated. Use 'project.resources' instead.
>> [INFO] [remote-resources:process {execution: default}]
>> [debug] execute contextualize
>> [INFO] [resources:resources {execution: default-resources}]
>> [INFO] Using 'UTF-8' encoding to copy filtered resources.
>> [INFO] Copying 2 resources
>> [INFO] Copying 3 resources
>> [INFO] [compiler:compile {execution: default-compile}]
>> [INFO] Compiling 7 source files to <https://builds.apache.org/job/maven-plugins-ITs-m2/ws/maven-scm-publish-plugin/target/classes>
>> [INFO] [plugin:descriptor {execution: mojo-descriptor}]
>> [INFO] Using 'UTF-8' encoding to read mojo metadata.
>> [INFO] Applying mojo extractor for language: java
>> [INFO] Mojo extractor for language: java found 2 mojo descriptors.
>> [INFO] Applying mojo extractor for language: bsh
>> [INFO] Mojo extractor for language: bsh found 0 mojo descriptors.
>> [INFO] Applying mojo extractor for language: java-annotations
>> [INFO] Mojo extractor for language: java-annotations found 3 mojo descriptors.
>> [debug] execute contextualize
>> [INFO] [resources:testResources {execution: default-testResources}]
>> [INFO] Using 'UTF-8' encoding to copy filtered resources.
>> [INFO] skip non existing resourceDirectory <https://builds.apache.org/job/maven-plugins-ITs-m2/ws/maven-scm-publish-plugin/src/test/resources>
>> [INFO] Copying 3 resources
>> [INFO] [compiler:testCompile {execution: default-testCompile}]
>> [INFO] No sources to compile
>> [INFO] [surefire:test {execution: default-test}]
>> [INFO] Surefire report directory: <https://builds.apache.org/job/maven-plugins-ITs-m2/ws/maven-scm-publish-plugin/target/surefire-reports>
>>
>> -------------------------------------------------------
>> T E S T S
>> -------------------------------------------------------
>>
>> Results :
>>
>> Tests run: 0, Failures: 0, Errors: 0, Skipped: 0
>>
>> [INFO] [jar:jar {execution: default-jar}]
>> [INFO] Building jar: <https://builds.apache.org/job/maven-plugins-ITs-m2/ws/maven-scm-publish-plugin/target/maven-scm-publish-plugin-1.0-SNAPSHOT.jar>
>> [INFO] [plugin:addPluginArtifactMetadata {execution: default-addPluginArtifactMetadata}]
>> [INFO] [invoker:install {execution: integration-test}]
>> [INFO] Installing <https://builds.apache.org/job/maven-plugins-ITs-m2/ws/maven-scm-publish-plugin/pom.xml> to <https://builds.apache.org/job/maven-plugins-ITs-m2/ws/maven-scm-publish-plugin/target/local-repo/org/apache/maven/plugins/maven-scm-publish-plugin/1.0-SNAPSHOT/maven-scm-publish-plugin-1.0-SNAPSHOT.pom>
>> [INFO] Installing <https://builds.apache.org/job/maven-plugins-ITs-m2/ws/maven-scm-publish-plugin/target/maven-scm-publish-plugin-1.0-SNAPSHOT.jar> to <https://builds.apache.org/job/maven-plugins-ITs-m2/ws/maven-scm-publish-plugin/target/local-repo/org/apache/maven/plugins/maven-scm-publish-plugin/1.0-SNAPSHOT/maven-scm-publish-plugin-1.0-SNAPSHOT.jar>
>> [INFO] [invoker:integration-test {execution: integration-test}]
>> [INFO] Building: 006-site-multi-module/pom.xml
>> [INFO] run script setup.bsh
>> [INFO] ..SUCCESS (22.3 s)
>> [INFO] Building: 005-site-lifecycle/pom.xml
>> [INFO] run script setup.bsh
>> [INFO] ..SUCCESS (18.8 s)
>> [INFO] Building: 002-perform/pom.xml
>> [INFO] run script setup.bsh
>> [INFO] ..SUCCESS (18.0 s)
>> [INFO] Building: 001-prepare/pom.xml
>> [INFO] run script setup.bsh
>> [INFO] ..SUCCESS (5.0 s)
>> [INFO] Building: 004-publish-scm/pom.xml
>> [INFO] run script setup.bsh
>> [INFO] ..SUCCESS (19.0 s)
>> [INFO] Building: 003-lifecycle/pom.xml
>> [INFO] run script setup.bsh
>> [INFO] ..SUCCESS (5.4 s)
>> [INFO] [invoker:verify {execution: integration-test}]
>> [INFO] -------------------------------------------------
>> [INFO] Build Summary:
>> [INFO] Passed: 6, Failed: 0, Errors: 0, Skipped: 0
>> [INFO] -------------------------------------------------
>> [INFO] [install:install {execution: default-install}]
>> [INFO] Installing <https://builds.apache.org/job/maven-plugins-ITs-m2/ws/maven-scm-publish-plugin/target/maven-scm-publish-plugin-1.0-SNAPSHOT.jar> to /home/jenkins/.m2/repository/org/apache/maven/plugins/maven-scm-publish-plugin/1.0-SNAPSHOT/maven-scm-publish-plugin-1.0-SNAPSHOT.jar
>> [INFO] ------------------------------------------------------------------------
>> [INFO] Building Maven Plugins Aggregator
>> [INFO] task-segment: [clean, install]
>> [INFO] ------------------------------------------------------------------------
>> [INFO] [clean:clean {execution: default-clean}]
>> [INFO] Deleting <https://builds.apache.org/job/maven-plugins-ITs-m2/ws/target>
>> [INFO] [remote-resources:process {execution: default}]
>> [INFO] [site:attach-descriptor {execution: default-attach-descriptor}]
>> [INFO] [install:install {execution: default-install}]
>> [INFO] Installing <https://builds.apache.org/job/maven-plugins-ITs-m2/ws/pom.xml> to /home/jenkins/.m2/repository/org/apache/maven/plugins/maven-plugins-aggregator/1-SNAPSHOT/maven-plugins-aggregator-1-SNAPSHOT.pom
>> [INFO]
>> [INFO]
>> [INFO] ------------------------------------------------------------------------
>> [INFO] Reactor Summary:
>> [INFO] ------------------------------------------------------------------------
>> [INFO] Maven Plugins ......................................... SUCCESS [9.458s]
>> [INFO] Maven ACR Plugin ...................................... SUCCESS [31.132s]
>> [INFO] Maven Ant Plugin ...................................... SUCCESS [1:09.782s]
>> [INFO] Maven AntRun Plugin ................................... SUCCESS [50.141s]
>> [INFO] Maven Eclipse Plugin .................................. SUCCESS [6:48.952s]
>> [INFO] Maven Assembly Plugin ................................. SUCCESS [11:24.057s]
>> [INFO] Maven Changelog Plugin ................................ SUCCESS [45.210s]
>> [INFO] Maven Compiler Plugin ................................. SUCCESS [52.048s]
>> [INFO] Maven Changes Report Plugin ........................... SUCCESS [1:12.411s]
>> [INFO] Maven Checkstyle Plugin ............................... SUCCESS [1:45.368s]
>> [INFO] Maven Clean Plugin .................................... SUCCESS [15.372s]
>> [INFO] Maven Dependency Plugin ............................... SUCCESS [2:34.281s]
>> [INFO] Maven Deploy Plugin ................................... SUCCESS [1:00.020s]
>> [INFO] Maven DOAP Plugin ..................................... SUCCESS [27.767s]
>> [INFO] Maven Documentation Checker Plugin .................... SUCCESS [7.400s]
>> [INFO] Maven EAR Plugin ...................................... SUCCESS [3:30.374s]
>> [INFO] Maven EJB Plugin ...................................... SUCCESS [26.652s]
>> [INFO] Maven GPG Plugin ...................................... SUCCESS [9.539s]
>> [INFO] Maven Help Plugin ..................................... SUCCESS [29.553s]
>> [INFO] Maven IDEA Plugin ..................................... SUCCESS [9.067s]
>> [INFO] Maven Install Plugin .................................. SUCCESS [37.187s]
>> [INFO] Maven JAR Plugin ...................................... SUCCESS [1:02.057s]
>> [INFO] Maven Jarsigner Plugin ................................ SUCCESS [24.451s]
>> [INFO] Maven Javadoc Plugin .................................. FAILED [1:17.830s]
>> [INFO] Maven Linkcheck Plugin ................................ SUCCESS [2.977s]
>> [INFO] Maven One Plugin ...................................... SUCCESS [1.646s]
>> [INFO] Maven Patch Plugin .................................... SUCCESS [11.297s]
>> [INFO] Maven PDF Plugin ...................................... SUCCESS [44.829s]
>> [INFO] Maven PMD Plugin ...................................... SUCCESS [43.237s]
>> [INFO] Maven RAR Plugin ...................................... SUCCESS [10.419s]
>> [INFO] Maven Reactor Plugin .................................. SUCCESS [3.183s]
>> [INFO] Maven Repository Plugin ............................... SUCCESS [40.604s]
>> [INFO] Maven Resources Plugin ................................ SUCCESS [57.709s]
>> [INFO] Maven Site Plugin 3 ................................... SUCCESS [7:16.525s]
>> [INFO] Maven Source Plugin ................................... SUCCESS [44.191s]
>> [INFO] Maven Stage Plugin .................................... SUCCESS [2.324s]
>> [INFO] Maven Toolchains Plugin ............................... SUCCESS [2.402s]
>> [INFO] Maven Verifier Plugin ................................. SUCCESS [13.866s]
>> [INFO] Maven WAR Plugin ...................................... SUCCESS [1:13.288s]
>> [INFO] SCM Publish Maven Plugin .............................. SUCCESS [1:39.899s]
>> [INFO] Maven Plugins Aggregator .............................. SUCCESS [1.031s]
>> [INFO] ------------------------------------------------------------------------
>> [INFO] Error for project: Maven Javadoc Plugin (during install)
>> [INFO] ------------------------------------------------------------------------
>> [INFO] There are test failures.
>>
>> Please refer to <https://builds.apache.org/job/maven-plugins-ITs-m2/ws/maven-javadoc-plugin/target/surefire-reports> for the individual test results.
>> [INFO] ------------------------------------------------------------------------
>> [INFO] For more information, run Maven with the -e switch
>> [INFO] ------------------------------------------------------------------------
>> [INFO] BUILD ERRORS
>> [INFO] ------------------------------------------------------------------------
>> [INFO] Total time: 52 minutes 51 seconds
>> [INFO] Finished at: Fri Sep 28 21:00:27 UTC 2012
>> [INFO] Final Memory: 281M/1017M
>> [INFO] ------------------------------------------------------------------------
>> Build step 'Invoke top-level Maven targets' marked build as failure
>>
>
>
> --
> Dennis Lundberg
>
> ---------------------------------------------------------------------
> To unsubscribe, e-mail: dev-unsubscribe@maven.apache.org
> For additional commands, e-mail: dev-help@maven.apache.org
>
---------------------------------------------------------------------
To unsubscribe, e-mail: dev-unsubscribe@maven.apache.org
For additional commands, e-mail: dev-help@maven.apache.org
Re: Build failed in Jenkins: maven-plugins-ITs-m2 #790
Posted by Benson Margulies <bi...@gmail.com>.
I captured the three command-arg files from 2.8 and 2.9, and compared
them. Here's the only difference. It looks to me as if this is a
difference at Oracle, and that the utils need to change to tolerate
that blank line.
20c20
< 'http://download.oracle.com/javase/1.5.0/docs/api'
'/Users/benson/asf/mvn/plugins/maven-javadoc-plugin/target/javadoc-bundle-options'
---
> 'http://docs.oracle.com/javase/1.5.0/docs/api' '/Users/benson/asf/mvn/plugins/maven-javadoc-plugin/target/javadoc-bundle-options'
On Fri, Sep 28, 2012 at 6:06 PM, Dennis Lundberg <de...@apache.org> wrote:
> Hi
>
> I had a look at why the Javadoc Plugin has started failing. At first it
> seemed weird since there had been no code changes, but then it hit me
> that a new version of said plugin had just been released, and therefor a
> new site had been published. After some digging I found out the reason
> for the failure.
>
> In version 2.8.1 the package-list looks like this:
> maven.apache.org/plugins/maven-javadoc-plugin-2.8.1/apidocs/package-list
>
> In version 2.9 (latest) the package-list looks like this:
> http://maven.apache.org/plugins/maven-javadoc-plugin/apidocs/package-list
>
> Note the leading empty line in 2.9, which is causing JavadocUtil to deem
> the package-list invalid. I don't know where the blank line is coming
> from or why it has appeared now, but it seems to be a regression in
> Javadoc Plugin 2.9.
>
> On 2012-09-28 23:00, Apache Jenkins Server wrote:
>> See <https://builds.apache.org/job/maven-plugins-ITs-m2/790/changes>
>>
>> Changes:
>>
>> [krosenvold] Revert "added generics"
>>
>> This reverts commit 19ae2a8f731d39653450c89d830f25e7ecf691bf.
>>
>> [krosenvold] o Make asssembly compile on java7
>>
>> ------------------------------------------
>> [...truncated 10159 lines...]
>> [INFO] Exploding webapp
>> [INFO] Assembling webapp [maven-war-plugin-test] in [<https://builds.apache.org/job/maven-plugins-ITs-m2/ws/maven-war-plugin/target/test-classes/unit/warexplodedmojo/test-dir/ExplodedWarWithSourceModificationCheck]>
>> [INFO] Processing war project
>> [INFO] Copying webapp resources [<https://builds.apache.org/job/maven-plugins-ITs-m2/ws/maven-war-plugin/target/test-classes/unit/warexplodedmojo/test-dir/ExplodedWarWithSourceModificationCheck-test-data/source]>
>> [INFO] Webapp assembled in [2 msecs]
>> [INFO] Exploding webapp
>> [INFO] Assembling webapp [maven-war-plugin-test] in [<https://builds.apache.org/job/maven-plugins-ITs-m2/ws/maven-war-plugin/target/test-classes/unit/warexplodedmojo/test-dir/ExplodedWarWithFileNameMapping]>
>> [INFO] Processing war project
>> [INFO] Copying webapp resources [<https://builds.apache.org/job/maven-plugins-ITs-m2/ws/maven-war-plugin/target/test-classes/unit/warexplodedmojo/test-dir/ExplodedWarWithFileNameMapping-test-data/source]>
>> [INFO] Webapp assembled in [3 msecs]
>> [INFO] Exploding webapp
>> [INFO] Assembling webapp [maven-war-plugin-test] in [<https://builds.apache.org/job/maven-plugins-ITs-m2/ws/maven-war-plugin/target/test-classes/unit/warexplodedmojo/test-dir/ExplodedWarWithFileNameMappingAndDuplicateDependencies]>
>> [INFO] Processing war project
>> [INFO] Copying webapp resources [<https://builds.apache.org/job/maven-plugins-ITs-m2/ws/maven-war-plugin/target/test-classes/unit/warexplodedmojo/test-dir/ExplodedWarWithFileNameMappingAndDuplicateDependencies-test-data/source]>
>> [INFO] Webapp assembled in [3 msecs]
>> Tests run: 22, Failures: 0, Errors: 0, Skipped: 0, Time elapsed: 1.016 sec
>> Running org.apache.maven.plugin.war.WarInPlaceMojoTest
>> [INFO] Generating webapp in source directory [<https://builds.apache.org/job/maven-plugins-ITs-m2/ws/maven-war-plugin/target/test-classes/unit/warexplodedinplacemojo/test-dir/SimpleExplodedInplaceWar-test-data/source]>
>> [INFO] Assembling webapp [maven-war-plugin-test] in [<https://builds.apache.org/job/maven-plugins-ITs-m2/ws/maven-war-plugin/target/test-classes/unit/warexplodedinplacemojo/test-dir/SimpleExplodedInplaceWar-test-data/source]>
>> [INFO] Processing war project
>> [INFO] Copying webapp webResources [<https://builds.apache.org/job/maven-plugins-ITs-m2/ws/maven-war-plugin/target/test-classes/unit/warexplodedinplacemojo/test-dir/resources]> to [<https://builds.apache.org/job/maven-plugins-ITs-m2/ws/maven-war-plugin/target/test-classes/unit/warexplodedinplacemojo/test-dir/SimpleExplodedInplaceWar-test-data/source]>
>> [INFO] Webapp assembled in [1 msecs]
>> Tests run: 2, Failures: 0, Errors: 0, Skipped: 0, Time elapsed: 0.071 sec
>>
>> Results :
>>
>> Tests run: 85, Failures: 0, Errors: 0, Skipped: 0
>>
>> [INFO] [jar:jar {execution: default-jar}]
>> [INFO] Building jar: <https://builds.apache.org/job/maven-plugins-ITs-m2/ws/maven-war-plugin/target/maven-war-plugin-2.4-SNAPSHOT.jar>
>> [INFO] [plugin:addPluginArtifactMetadata {execution: default-addPluginArtifactMetadata}]
>> [INFO] [invoker:install {execution: integration-test}]
>> [INFO] Installing <https://builds.apache.org/job/maven-plugins-ITs-m2/ws/maven-war-plugin/pom.xml> to <https://builds.apache.org/job/maven-plugins-ITs-m2/ws/maven-war-plugin/target/local-repo/org/apache/maven/plugins/maven-war-plugin/2.4-SNAPSHOT/maven-war-plugin-2.4-SNAPSHOT.pom>
>> [INFO] Installing <https://builds.apache.org/job/maven-plugins-ITs-m2/ws/maven-war-plugin/target/maven-war-plugin-2.4-SNAPSHOT.jar> to <https://builds.apache.org/job/maven-plugins-ITs-m2/ws/maven-war-plugin/target/local-repo/org/apache/maven/plugins/maven-war-plugin/2.4-SNAPSHOT/maven-war-plugin-2.4-SNAPSHOT.jar>
>> [INFO] [invoker:integration-test {execution: integration-test}]
>> [INFO] Building: simple-war-project/pom.xml
>> [INFO] run script <https://builds.apache.org/job/maven-plugins-ITs-m2/ws/maven-war-plugin/target/it/simple-war-project/verify.bsh>
>> [INFO] ..SUCCESS (3.2 s)
>> [INFO] Building: MWAR-143/pom.xml
>> [INFO] run script <https://builds.apache.org/job/maven-plugins-ITs-m2/ws/maven-war-plugin/target/it/MWAR-143/verify.bsh>
>> [INFO] ..SUCCESS (7.7 s)
>> [INFO] Building: MWAR-139/pom.xml
>> [INFO] run script <https://builds.apache.org/job/maven-plugins-ITs-m2/ws/maven-war-plugin/target/it/MWAR-139/verify.bsh>
>> [INFO] ..SUCCESS (2.9 s)
>> [INFO] Building: MWAR-133/pom.xml
>> [INFO] run script <https://builds.apache.org/job/maven-plugins-ITs-m2/ws/maven-war-plugin/target/it/MWAR-133/verify.bsh>
>> [INFO] ..SUCCESS (2.5 s)
>> [INFO] Building: scoped-dependency-same-artifact/pom.xml
>> [INFO] run script <https://builds.apache.org/job/maven-plugins-ITs-m2/ws/maven-war-plugin/target/it/scoped-dependency-same-artifact/verify.bsh>
>> [INFO] ..SUCCESS (3.4 s)
>> [INFO] Building: overlay-excludes/pom.xml
>> [INFO] run script <https://builds.apache.org/job/maven-plugins-ITs-m2/ws/maven-war-plugin/target/it/overlay-excludes/verify.bsh>
>> [INFO] ..SUCCESS (4.1 s)
>> [INFO] Building: simple-war-no-webxml/pom.xml
>> [INFO] run script <https://builds.apache.org/job/maven-plugins-ITs-m2/ws/maven-war-plugin/target/it/simple-war-no-webxml/verify.bsh>
>> [INFO] ..SUCCESS (2.9 s)
>> [INFO] Building: MWAR-62/pom.xml
>> [INFO] run script <https://builds.apache.org/job/maven-plugins-ITs-m2/ws/maven-war-plugin/target/it/MWAR-62/verify.bsh>
>> [INFO] ..SUCCESS (2.3 s)
>> [INFO] Building: web-resources-filtering/pom.xml
>> [INFO] run script <https://builds.apache.org/job/maven-plugins-ITs-m2/ws/maven-war-plugin/target/it/web-resources-filtering/verify.bsh>
>> [INFO] ..SUCCESS (3.8 s)
>> [INFO] Building: MWAR-96/pom.xml
>> [INFO] run script <https://builds.apache.org/job/maven-plugins-ITs-m2/ws/maven-war-plugin/target/it/MWAR-96/verify.bsh>
>> [INFO] ..SUCCESS (2.9 s)
>> [INFO] Building: MWAR-240/pom.xml
>> [INFO] run script <https://builds.apache.org/job/maven-plugins-ITs-m2/ws/maven-war-plugin/target/it/MWAR-240/verify.bsh>
>> [INFO] ..SUCCESS (3.2 s)
>> [INFO] Building: MWAR-131/pom.xml
>> [INFO] run script <https://builds.apache.org/job/maven-plugins-ITs-m2/ws/maven-war-plugin/target/it/MWAR-131/verify.bsh>
>> [INFO] ..SUCCESS (6.4 s)
>> [INFO] Building: default/pom.xml
>> [INFO] run script <https://builds.apache.org/job/maven-plugins-ITs-m2/ws/maven-war-plugin/target/it/default/verify.bsh>
>> [INFO] ..SUCCESS (3.3 s)
>> [INFO] Building: manifest-content/pom.xml
>> [INFO] run script <https://builds.apache.org/job/maven-plugins-ITs-m2/ws/maven-war-plugin/target/it/manifest-content/verify.bsh>
>> [INFO] ..SUCCESS (3.0 s)
>> [INFO] Building: MWAR-129/pom.xml
>> [INFO] run script <https://builds.apache.org/job/maven-plugins-ITs-m2/ws/maven-war-plugin/target/it/MWAR-129/verify.bsh>
>> [INFO] ..SUCCESS (2.3 s)
>> [INFO] [invoker:verify {execution: integration-test}]
>> [INFO] -------------------------------------------------
>> [INFO] Build Summary:
>> [INFO] Passed: 15, Failed: 0, Errors: 0, Skipped: 0
>> [INFO] -------------------------------------------------
>> [INFO] [install:install {execution: default-install}]
>> [INFO] Installing <https://builds.apache.org/job/maven-plugins-ITs-m2/ws/maven-war-plugin/target/maven-war-plugin-2.4-SNAPSHOT.jar> to /home/jenkins/.m2/repository/org/apache/maven/plugins/maven-war-plugin/2.4-SNAPSHOT/maven-war-plugin-2.4-SNAPSHOT.jar
>> [INFO] ------------------------------------------------------------------------
>> [INFO] Building SCM Publish Maven Plugin
>> [INFO] task-segment: [clean, install]
>> [INFO] ------------------------------------------------------------------------
>> [INFO] [clean:clean {execution: default-clean}]
>> [INFO] Deleting <https://builds.apache.org/job/maven-plugins-ITs-m2/ws/maven-scm-publish-plugin/target>
>> [INFO] [enforcer:enforce {execution: ensure-no-container-api}]
>> [INFO] [plugin:helpmojo {execution: generated-helpmojo}]
>> [INFO] Using 'UTF-8' encoding to read mojo metadata.
>> [INFO] Applying mojo extractor for language: java
>> [INFO] Mojo extractor for language: java found 1 mojo descriptors.
>> [INFO] Applying mojo extractor for language: bsh
>> [INFO] Mojo extractor for language: bsh found 0 mojo descriptors.
>> [INFO] Applying mojo extractor for language: java-annotations
>> [INFO] Mojo extractor for language: java-annotations found 0 mojo descriptors.
>> [INFO] [plugin:descriptor {execution: default-descriptor}]
>> [INFO] Using 'UTF-8' encoding to read mojo metadata.
>> [INFO] Applying mojo extractor for language: java
>> [INFO] Mojo extractor for language: java found 2 mojo descriptors.
>> [INFO] Applying mojo extractor for language: bsh
>> [INFO] Mojo extractor for language: bsh found 0 mojo descriptors.
>> [INFO] Applying mojo extractor for language: java-annotations
>> [INFO] Mojo extractor for language: java-annotations found 0 mojo descriptors.
>> [WARNING] The parameter expression: 'project.build.resources' used in mojo: 'process' has been deprecated. Use 'project.resources' instead.
>> [INFO] [remote-resources:process {execution: default}]
>> [debug] execute contextualize
>> [INFO] [resources:resources {execution: default-resources}]
>> [INFO] Using 'UTF-8' encoding to copy filtered resources.
>> [INFO] Copying 2 resources
>> [INFO] Copying 3 resources
>> [INFO] [compiler:compile {execution: default-compile}]
>> [INFO] Compiling 7 source files to <https://builds.apache.org/job/maven-plugins-ITs-m2/ws/maven-scm-publish-plugin/target/classes>
>> [INFO] [plugin:descriptor {execution: mojo-descriptor}]
>> [INFO] Using 'UTF-8' encoding to read mojo metadata.
>> [INFO] Applying mojo extractor for language: java
>> [INFO] Mojo extractor for language: java found 2 mojo descriptors.
>> [INFO] Applying mojo extractor for language: bsh
>> [INFO] Mojo extractor for language: bsh found 0 mojo descriptors.
>> [INFO] Applying mojo extractor for language: java-annotations
>> [INFO] Mojo extractor for language: java-annotations found 3 mojo descriptors.
>> [debug] execute contextualize
>> [INFO] [resources:testResources {execution: default-testResources}]
>> [INFO] Using 'UTF-8' encoding to copy filtered resources.
>> [INFO] skip non existing resourceDirectory <https://builds.apache.org/job/maven-plugins-ITs-m2/ws/maven-scm-publish-plugin/src/test/resources>
>> [INFO] Copying 3 resources
>> [INFO] [compiler:testCompile {execution: default-testCompile}]
>> [INFO] No sources to compile
>> [INFO] [surefire:test {execution: default-test}]
>> [INFO] Surefire report directory: <https://builds.apache.org/job/maven-plugins-ITs-m2/ws/maven-scm-publish-plugin/target/surefire-reports>
>>
>> -------------------------------------------------------
>> T E S T S
>> -------------------------------------------------------
>>
>> Results :
>>
>> Tests run: 0, Failures: 0, Errors: 0, Skipped: 0
>>
>> [INFO] [jar:jar {execution: default-jar}]
>> [INFO] Building jar: <https://builds.apache.org/job/maven-plugins-ITs-m2/ws/maven-scm-publish-plugin/target/maven-scm-publish-plugin-1.0-SNAPSHOT.jar>
>> [INFO] [plugin:addPluginArtifactMetadata {execution: default-addPluginArtifactMetadata}]
>> [INFO] [invoker:install {execution: integration-test}]
>> [INFO] Installing <https://builds.apache.org/job/maven-plugins-ITs-m2/ws/maven-scm-publish-plugin/pom.xml> to <https://builds.apache.org/job/maven-plugins-ITs-m2/ws/maven-scm-publish-plugin/target/local-repo/org/apache/maven/plugins/maven-scm-publish-plugin/1.0-SNAPSHOT/maven-scm-publish-plugin-1.0-SNAPSHOT.pom>
>> [INFO] Installing <https://builds.apache.org/job/maven-plugins-ITs-m2/ws/maven-scm-publish-plugin/target/maven-scm-publish-plugin-1.0-SNAPSHOT.jar> to <https://builds.apache.org/job/maven-plugins-ITs-m2/ws/maven-scm-publish-plugin/target/local-repo/org/apache/maven/plugins/maven-scm-publish-plugin/1.0-SNAPSHOT/maven-scm-publish-plugin-1.0-SNAPSHOT.jar>
>> [INFO] [invoker:integration-test {execution: integration-test}]
>> [INFO] Building: 006-site-multi-module/pom.xml
>> [INFO] run script setup.bsh
>> [INFO] ..SUCCESS (22.3 s)
>> [INFO] Building: 005-site-lifecycle/pom.xml
>> [INFO] run script setup.bsh
>> [INFO] ..SUCCESS (18.8 s)
>> [INFO] Building: 002-perform/pom.xml
>> [INFO] run script setup.bsh
>> [INFO] ..SUCCESS (18.0 s)
>> [INFO] Building: 001-prepare/pom.xml
>> [INFO] run script setup.bsh
>> [INFO] ..SUCCESS (5.0 s)
>> [INFO] Building: 004-publish-scm/pom.xml
>> [INFO] run script setup.bsh
>> [INFO] ..SUCCESS (19.0 s)
>> [INFO] Building: 003-lifecycle/pom.xml
>> [INFO] run script setup.bsh
>> [INFO] ..SUCCESS (5.4 s)
>> [INFO] [invoker:verify {execution: integration-test}]
>> [INFO] -------------------------------------------------
>> [INFO] Build Summary:
>> [INFO] Passed: 6, Failed: 0, Errors: 0, Skipped: 0
>> [INFO] -------------------------------------------------
>> [INFO] [install:install {execution: default-install}]
>> [INFO] Installing <https://builds.apache.org/job/maven-plugins-ITs-m2/ws/maven-scm-publish-plugin/target/maven-scm-publish-plugin-1.0-SNAPSHOT.jar> to /home/jenkins/.m2/repository/org/apache/maven/plugins/maven-scm-publish-plugin/1.0-SNAPSHOT/maven-scm-publish-plugin-1.0-SNAPSHOT.jar
>> [INFO] ------------------------------------------------------------------------
>> [INFO] Building Maven Plugins Aggregator
>> [INFO] task-segment: [clean, install]
>> [INFO] ------------------------------------------------------------------------
>> [INFO] [clean:clean {execution: default-clean}]
>> [INFO] Deleting <https://builds.apache.org/job/maven-plugins-ITs-m2/ws/target>
>> [INFO] [remote-resources:process {execution: default}]
>> [INFO] [site:attach-descriptor {execution: default-attach-descriptor}]
>> [INFO] [install:install {execution: default-install}]
>> [INFO] Installing <https://builds.apache.org/job/maven-plugins-ITs-m2/ws/pom.xml> to /home/jenkins/.m2/repository/org/apache/maven/plugins/maven-plugins-aggregator/1-SNAPSHOT/maven-plugins-aggregator-1-SNAPSHOT.pom
>> [INFO]
>> [INFO]
>> [INFO] ------------------------------------------------------------------------
>> [INFO] Reactor Summary:
>> [INFO] ------------------------------------------------------------------------
>> [INFO] Maven Plugins ......................................... SUCCESS [9.458s]
>> [INFO] Maven ACR Plugin ...................................... SUCCESS [31.132s]
>> [INFO] Maven Ant Plugin ...................................... SUCCESS [1:09.782s]
>> [INFO] Maven AntRun Plugin ................................... SUCCESS [50.141s]
>> [INFO] Maven Eclipse Plugin .................................. SUCCESS [6:48.952s]
>> [INFO] Maven Assembly Plugin ................................. SUCCESS [11:24.057s]
>> [INFO] Maven Changelog Plugin ................................ SUCCESS [45.210s]
>> [INFO] Maven Compiler Plugin ................................. SUCCESS [52.048s]
>> [INFO] Maven Changes Report Plugin ........................... SUCCESS [1:12.411s]
>> [INFO] Maven Checkstyle Plugin ............................... SUCCESS [1:45.368s]
>> [INFO] Maven Clean Plugin .................................... SUCCESS [15.372s]
>> [INFO] Maven Dependency Plugin ............................... SUCCESS [2:34.281s]
>> [INFO] Maven Deploy Plugin ................................... SUCCESS [1:00.020s]
>> [INFO] Maven DOAP Plugin ..................................... SUCCESS [27.767s]
>> [INFO] Maven Documentation Checker Plugin .................... SUCCESS [7.400s]
>> [INFO] Maven EAR Plugin ...................................... SUCCESS [3:30.374s]
>> [INFO] Maven EJB Plugin ...................................... SUCCESS [26.652s]
>> [INFO] Maven GPG Plugin ...................................... SUCCESS [9.539s]
>> [INFO] Maven Help Plugin ..................................... SUCCESS [29.553s]
>> [INFO] Maven IDEA Plugin ..................................... SUCCESS [9.067s]
>> [INFO] Maven Install Plugin .................................. SUCCESS [37.187s]
>> [INFO] Maven JAR Plugin ...................................... SUCCESS [1:02.057s]
>> [INFO] Maven Jarsigner Plugin ................................ SUCCESS [24.451s]
>> [INFO] Maven Javadoc Plugin .................................. FAILED [1:17.830s]
>> [INFO] Maven Linkcheck Plugin ................................ SUCCESS [2.977s]
>> [INFO] Maven One Plugin ...................................... SUCCESS [1.646s]
>> [INFO] Maven Patch Plugin .................................... SUCCESS [11.297s]
>> [INFO] Maven PDF Plugin ...................................... SUCCESS [44.829s]
>> [INFO] Maven PMD Plugin ...................................... SUCCESS [43.237s]
>> [INFO] Maven RAR Plugin ...................................... SUCCESS [10.419s]
>> [INFO] Maven Reactor Plugin .................................. SUCCESS [3.183s]
>> [INFO] Maven Repository Plugin ............................... SUCCESS [40.604s]
>> [INFO] Maven Resources Plugin ................................ SUCCESS [57.709s]
>> [INFO] Maven Site Plugin 3 ................................... SUCCESS [7:16.525s]
>> [INFO] Maven Source Plugin ................................... SUCCESS [44.191s]
>> [INFO] Maven Stage Plugin .................................... SUCCESS [2.324s]
>> [INFO] Maven Toolchains Plugin ............................... SUCCESS [2.402s]
>> [INFO] Maven Verifier Plugin ................................. SUCCESS [13.866s]
>> [INFO] Maven WAR Plugin ...................................... SUCCESS [1:13.288s]
>> [INFO] SCM Publish Maven Plugin .............................. SUCCESS [1:39.899s]
>> [INFO] Maven Plugins Aggregator .............................. SUCCESS [1.031s]
>> [INFO] ------------------------------------------------------------------------
>> [INFO] Error for project: Maven Javadoc Plugin (during install)
>> [INFO] ------------------------------------------------------------------------
>> [INFO] There are test failures.
>>
>> Please refer to <https://builds.apache.org/job/maven-plugins-ITs-m2/ws/maven-javadoc-plugin/target/surefire-reports> for the individual test results.
>> [INFO] ------------------------------------------------------------------------
>> [INFO] For more information, run Maven with the -e switch
>> [INFO] ------------------------------------------------------------------------
>> [INFO] BUILD ERRORS
>> [INFO] ------------------------------------------------------------------------
>> [INFO] Total time: 52 minutes 51 seconds
>> [INFO] Finished at: Fri Sep 28 21:00:27 UTC 2012
>> [INFO] Final Memory: 281M/1017M
>> [INFO] ------------------------------------------------------------------------
>> Build step 'Invoke top-level Maven targets' marked build as failure
>>
>
>
> --
> Dennis Lundberg
>
> ---------------------------------------------------------------------
> To unsubscribe, e-mail: dev-unsubscribe@maven.apache.org
> For additional commands, e-mail: dev-help@maven.apache.org
>
---------------------------------------------------------------------
To unsubscribe, e-mail: dev-unsubscribe@maven.apache.org
For additional commands, e-mail: dev-help@maven.apache.org
Re: Build failed in Jenkins: maven-plugins-ITs-m2 #790
Posted by Hervé BOUTEMY <he...@free.fr>.
thanks Denis for the analysis
I think the culprit is http://jira.codehaus.org/browse/MPLUGIN-227
and javadoc plugin is just intolerant at this case where there is some code in
"unnamed" package: not a regression, just a case that wasn't seen in real
world before the bug in plugin tools
I just created https://jira.codehaus.org/browse/MJAVADOC-354 which I should fix
immediately
Regards,
Hervé
Le samedi 29 septembre 2012 00:06:18 Dennis Lundberg a écrit :
> Hi
>
> I had a look at why the Javadoc Plugin has started failing. At first it
> seemed weird since there had been no code changes, but then it hit me
> that a new version of said plugin had just been released, and therefor a
> new site had been published. After some digging I found out the reason
> for the failure.
>
> In version 2.8.1 the package-list looks like this:
> maven.apache.org/plugins/maven-javadoc-plugin-2.8.1/apidocs/package-list
>
> In version 2.9 (latest) the package-list looks like this:
> http://maven.apache.org/plugins/maven-javadoc-plugin/apidocs/package-list
>
> Note the leading empty line in 2.9, which is causing JavadocUtil to deem
> the package-list invalid. I don't know where the blank line is coming
> from or why it has appeared now, but it seems to be a regression in
> Javadoc Plugin 2.9.
>
> On 2012-09-28 23:00, Apache Jenkins Server wrote:
> > See <https://builds.apache.org/job/maven-plugins-ITs-m2/790/changes>
> >
> > Changes:
> >
> > [krosenvold] Revert "added generics"
> >
> > This reverts commit 19ae2a8f731d39653450c89d830f25e7ecf691bf.
> >
> > [krosenvold] o Make asssembly compile on java7
> >
> > ------------------------------------------
> > [...truncated 10159 lines...]
> > [INFO] Exploding webapp
> > [INFO] Assembling webapp [maven-war-plugin-test] in
> > [<https://builds.apache.org/job/maven-plugins-ITs-m2/ws/maven-war-plugin/
> > target/test-classes/unit/warexplodedmojo/test-dir/ExplodedWarWithSourceMod
> > ificationCheck]> [INFO] Processing war project
> > [INFO] Copying webapp resources
> > [<https://builds.apache.org/job/maven-plugins-ITs-m2/ws/maven-war-plugin/
> > target/test-classes/unit/warexplodedmojo/test-dir/ExplodedWarWithSourceMod
> > ificationCheck-test-data/source]> [INFO] Webapp assembled in [2 msecs]
> > [INFO] Exploding webapp
> > [INFO] Assembling webapp [maven-war-plugin-test] in
> > [<https://builds.apache.org/job/maven-plugins-ITs-m2/ws/maven-war-plugin/
> > target/test-classes/unit/warexplodedmojo/test-dir/ExplodedWarWithFileNameM
> > apping]> [INFO] Processing war project
> > [INFO] Copying webapp resources
> > [<https://builds.apache.org/job/maven-plugins-ITs-m2/ws/maven-war-plugin/
> > target/test-classes/unit/warexplodedmojo/test-dir/ExplodedWarWithFileNameM
> > apping-test-data/source]> [INFO] Webapp assembled in [3 msecs]
> > [INFO] Exploding webapp
> > [INFO] Assembling webapp [maven-war-plugin-test] in
> > [<https://builds.apache.org/job/maven-plugins-ITs-m2/ws/maven-war-plugin/
> > target/test-classes/unit/warexplodedmojo/test-dir/ExplodedWarWithFileNameM
> > appingAndDuplicateDependencies]> [INFO] Processing war project
> > [INFO] Copying webapp resources
> > [<https://builds.apache.org/job/maven-plugins-ITs-m2/ws/maven-war-plugin/
> > target/test-classes/unit/warexplodedmojo/test-dir/ExplodedWarWithFileNameM
> > appingAndDuplicateDependencies-test-data/source]> [INFO] Webapp assembled
> > in [3 msecs]
> > Tests run: 22, Failures: 0, Errors: 0, Skipped: 0, Time elapsed: 1.016 sec
> > Running org.apache.maven.plugin.war.WarInPlaceMojoTest
> > [INFO] Generating webapp in source directory
> > [<https://builds.apache.org/job/maven-plugins-ITs-m2/ws/maven-war-plugin/
> > target/test-classes/unit/warexplodedinplacemojo/test-dir/SimpleExplodedInp
> > laceWar-test-data/source]> [INFO] Assembling webapp
> > [maven-war-plugin-test] in
> > [<https://builds.apache.org/job/maven-plugins-ITs-m2/ws/maven-war-plugin/
> > target/test-classes/unit/warexplodedinplacemojo/test-dir/SimpleExplodedInp
> > laceWar-test-data/source]> [INFO] Processing war project
> > [INFO] Copying webapp webResources
> > [<https://builds.apache.org/job/maven-plugins-ITs-m2/ws/maven-war-plugin/
> > target/test-classes/unit/warexplodedinplacemojo/test-dir/resources]> to
> > [<https://builds.apache.org/job/maven-plugins-ITs-m2/ws/maven-war-plugin/
> > target/test-classes/unit/warexplodedinplacemojo/test-dir/SimpleExplodedInp
> > laceWar-test-data/source]> [INFO] Webapp assembled in [1 msecs]
> > Tests run: 2, Failures: 0, Errors: 0, Skipped: 0, Time elapsed: 0.071 sec
> >
> > Results :
> >
> > Tests run: 85, Failures: 0, Errors: 0, Skipped: 0
> >
> > [INFO] [jar:jar {execution: default-jar}]
> > [INFO] Building jar:
> > <https://builds.apache.org/job/maven-plugins-ITs-m2/ws/maven-war-plugin/t
> > arget/maven-war-plugin-2.4-SNAPSHOT.jar> [INFO]
> > [plugin:addPluginArtifactMetadata {execution:
> > default-addPluginArtifactMetadata}] [INFO] [invoker:install {execution:
> > integration-test}]
> > [INFO] Installing
> > <https://builds.apache.org/job/maven-plugins-ITs-m2/ws/maven-war-plugin/p
> > om.xml> to
> > <https://builds.apache.org/job/maven-plugins-ITs-m2/ws/maven-war-plugin/t
> > arget/local-repo/org/apache/maven/plugins/maven-war-plugin/2.4-SNAPSHOT/ma
> > ven-war-plugin-2.4-SNAPSHOT.pom> [INFO] Installing
> > <https://builds.apache.org/job/maven-plugins-ITs-m2/ws/maven-war-plugin/t
> > arget/maven-war-plugin-2.4-SNAPSHOT.jar> to
> > <https://builds.apache.org/job/maven-plugins-ITs-m2/ws/maven-war-plugin/t
> > arget/local-repo/org/apache/maven/plugins/maven-war-plugin/2.4-SNAPSHOT/ma
> > ven-war-plugin-2.4-SNAPSHOT.jar> [INFO] [invoker:integration-test
> > {execution: integration-test}]
> > [INFO] Building: simple-war-project/pom.xml
> > [INFO] run script
> > <https://builds.apache.org/job/maven-plugins-ITs-m2/ws/maven-war-plugin/t
> > arget/it/simple-war-project/verify.bsh> [INFO] ..SUCCESS (3.2 s)
> > [INFO] Building: MWAR-143/pom.xml
> > [INFO] run script
> > <https://builds.apache.org/job/maven-plugins-ITs-m2/ws/maven-war-plugin/t
> > arget/it/MWAR-143/verify.bsh> [INFO] ..SUCCESS (7.7 s)
> > [INFO] Building: MWAR-139/pom.xml
> > [INFO] run script
> > <https://builds.apache.org/job/maven-plugins-ITs-m2/ws/maven-war-plugin/t
> > arget/it/MWAR-139/verify.bsh> [INFO] ..SUCCESS (2.9 s)
> > [INFO] Building: MWAR-133/pom.xml
> > [INFO] run script
> > <https://builds.apache.org/job/maven-plugins-ITs-m2/ws/maven-war-plugin/t
> > arget/it/MWAR-133/verify.bsh> [INFO] ..SUCCESS (2.5 s)
> > [INFO] Building: scoped-dependency-same-artifact/pom.xml
> > [INFO] run script
> > <https://builds.apache.org/job/maven-plugins-ITs-m2/ws/maven-war-plugin/t
> > arget/it/scoped-dependency-same-artifact/verify.bsh> [INFO] ..SUCCESS (3.4
> > s)
> > [INFO] Building: overlay-excludes/pom.xml
> > [INFO] run script
> > <https://builds.apache.org/job/maven-plugins-ITs-m2/ws/maven-war-plugin/t
> > arget/it/overlay-excludes/verify.bsh> [INFO] ..SUCCESS (4.1 s)
> > [INFO] Building: simple-war-no-webxml/pom.xml
> > [INFO] run script
> > <https://builds.apache.org/job/maven-plugins-ITs-m2/ws/maven-war-plugin/t
> > arget/it/simple-war-no-webxml/verify.bsh> [INFO] ..SUCCESS (2.9 s)
> > [INFO] Building: MWAR-62/pom.xml
> > [INFO] run script
> > <https://builds.apache.org/job/maven-plugins-ITs-m2/ws/maven-war-plugin/t
> > arget/it/MWAR-62/verify.bsh> [INFO] ..SUCCESS (2.3 s)
> > [INFO] Building: web-resources-filtering/pom.xml
> > [INFO] run script
> > <https://builds.apache.org/job/maven-plugins-ITs-m2/ws/maven-war-plugin/t
> > arget/it/web-resources-filtering/verify.bsh> [INFO] ..SUCCESS (3.8 s)
> > [INFO] Building: MWAR-96/pom.xml
> > [INFO] run script
> > <https://builds.apache.org/job/maven-plugins-ITs-m2/ws/maven-war-plugin/t
> > arget/it/MWAR-96/verify.bsh> [INFO] ..SUCCESS (2.9 s)
> > [INFO] Building: MWAR-240/pom.xml
> > [INFO] run script
> > <https://builds.apache.org/job/maven-plugins-ITs-m2/ws/maven-war-plugin/t
> > arget/it/MWAR-240/verify.bsh> [INFO] ..SUCCESS (3.2 s)
> > [INFO] Building: MWAR-131/pom.xml
> > [INFO] run script
> > <https://builds.apache.org/job/maven-plugins-ITs-m2/ws/maven-war-plugin/t
> > arget/it/MWAR-131/verify.bsh> [INFO] ..SUCCESS (6.4 s)
> > [INFO] Building: default/pom.xml
> > [INFO] run script
> > <https://builds.apache.org/job/maven-plugins-ITs-m2/ws/maven-war-plugin/t
> > arget/it/default/verify.bsh> [INFO] ..SUCCESS (3.3 s)
> > [INFO] Building: manifest-content/pom.xml
> > [INFO] run script
> > <https://builds.apache.org/job/maven-plugins-ITs-m2/ws/maven-war-plugin/t
> > arget/it/manifest-content/verify.bsh> [INFO] ..SUCCESS (3.0 s)
> > [INFO] Building: MWAR-129/pom.xml
> > [INFO] run script
> > <https://builds.apache.org/job/maven-plugins-ITs-m2/ws/maven-war-plugin/t
> > arget/it/MWAR-129/verify.bsh> [INFO] ..SUCCESS (2.3 s)
> > [INFO] [invoker:verify {execution: integration-test}]
> > [INFO] -------------------------------------------------
> > [INFO] Build Summary:
> > [INFO] Passed: 15, Failed: 0, Errors: 0, Skipped: 0
> > [INFO] -------------------------------------------------
> > [INFO] [install:install {execution: default-install}]
> > [INFO] Installing
> > <https://builds.apache.org/job/maven-plugins-ITs-m2/ws/maven-war-plugin/t
> > arget/maven-war-plugin-2.4-SNAPSHOT.jar> to
> > /home/jenkins/.m2/repository/org/apache/maven/plugins/maven-war-plugin/2.
> > 4-SNAPSHOT/maven-war-plugin-2.4-SNAPSHOT.jar [INFO]
> > ------------------------------------------------------------------------
> > [INFO] Building SCM Publish Maven Plugin
> > [INFO] task-segment: [clean, install]
> > [INFO]
> > ------------------------------------------------------------------------
> > [INFO] [clean:clean {execution: default-clean}]
> > [INFO] Deleting
> > <https://builds.apache.org/job/maven-plugins-ITs-m2/ws/maven-scm-publish-
> > plugin/target> [INFO] [enforcer:enforce {execution:
> > ensure-no-container-api}]
> > [INFO] [plugin:helpmojo {execution: generated-helpmojo}]
> > [INFO] Using 'UTF-8' encoding to read mojo metadata.
> > [INFO] Applying mojo extractor for language: java
> > [INFO] Mojo extractor for language: java found 1 mojo descriptors.
> > [INFO] Applying mojo extractor for language: bsh
> > [INFO] Mojo extractor for language: bsh found 0 mojo descriptors.
> > [INFO] Applying mojo extractor for language: java-annotations
> > [INFO] Mojo extractor for language: java-annotations found 0 mojo
> > descriptors. [INFO] [plugin:descriptor {execution: default-descriptor}]
> > [INFO] Using 'UTF-8' encoding to read mojo metadata.
> > [INFO] Applying mojo extractor for language: java
> > [INFO] Mojo extractor for language: java found 2 mojo descriptors.
> > [INFO] Applying mojo extractor for language: bsh
> > [INFO] Mojo extractor for language: bsh found 0 mojo descriptors.
> > [INFO] Applying mojo extractor for language: java-annotations
> > [INFO] Mojo extractor for language: java-annotations found 0 mojo
> > descriptors. [WARNING] The parameter expression:
> > 'project.build.resources' used in mojo: 'process' has been deprecated.
> > Use 'project.resources' instead. [INFO] [remote-resources:process
> > {execution: default}]
> > [debug] execute contextualize
> > [INFO] [resources:resources {execution: default-resources}]
> > [INFO] Using 'UTF-8' encoding to copy filtered resources.
> > [INFO] Copying 2 resources
> > [INFO] Copying 3 resources
> > [INFO] [compiler:compile {execution: default-compile}]
> > [INFO] Compiling 7 source files to
> > <https://builds.apache.org/job/maven-plugins-ITs-m2/ws/maven-scm-publish-
> > plugin/target/classes> [INFO] [plugin:descriptor {execution:
> > mojo-descriptor}]
> > [INFO] Using 'UTF-8' encoding to read mojo metadata.
> > [INFO] Applying mojo extractor for language: java
> > [INFO] Mojo extractor for language: java found 2 mojo descriptors.
> > [INFO] Applying mojo extractor for language: bsh
> > [INFO] Mojo extractor for language: bsh found 0 mojo descriptors.
> > [INFO] Applying mojo extractor for language: java-annotations
> > [INFO] Mojo extractor for language: java-annotations found 3 mojo
> > descriptors. [debug] execute contextualize
> > [INFO] [resources:testResources {execution: default-testResources}]
> > [INFO] Using 'UTF-8' encoding to copy filtered resources.
> > [INFO] skip non existing resourceDirectory
> > <https://builds.apache.org/job/maven-plugins-ITs-m2/ws/maven-scm-publish-
> > plugin/src/test/resources> [INFO] Copying 3 resources
> > [INFO] [compiler:testCompile {execution: default-testCompile}]
> > [INFO] No sources to compile
> > [INFO] [surefire:test {execution: default-test}]
> > [INFO] Surefire report directory:
> > <https://builds.apache.org/job/maven-plugins-ITs-m2/ws/maven-scm-publish-
> > plugin/target/surefire-reports>
> >
> > -------------------------------------------------------
> >
> > T E S T S
> >
> > -------------------------------------------------------
> >
> > Results :
> >
> > Tests run: 0, Failures: 0, Errors: 0, Skipped: 0
> >
> > [INFO] [jar:jar {execution: default-jar}]
> > [INFO] Building jar:
> > <https://builds.apache.org/job/maven-plugins-ITs-m2/ws/maven-scm-publish-
> > plugin/target/maven-scm-publish-plugin-1.0-SNAPSHOT.jar> [INFO]
> > [plugin:addPluginArtifactMetadata {execution:
> > default-addPluginArtifactMetadata}] [INFO] [invoker:install {execution:
> > integration-test}]
> > [INFO] Installing
> > <https://builds.apache.org/job/maven-plugins-ITs-m2/ws/maven-scm-publish-
> > plugin/pom.xml> to
> > <https://builds.apache.org/job/maven-plugins-ITs-m2/ws/maven-scm-publish-
> > plugin/target/local-repo/org/apache/maven/plugins/maven-scm-publish-plugin
> > /1.0-SNAPSHOT/maven-scm-publish-plugin-1.0-SNAPSHOT.pom> [INFO] Installing
> > <https://builds.apache.org/job/maven-plugins-ITs-m2/ws/maven-scm-publish-
> > plugin/target/maven-scm-publish-plugin-1.0-SNAPSHOT.jar> to
> > <https://builds.apache.org/job/maven-plugins-ITs-m2/ws/maven-scm-publish-
> > plugin/target/local-repo/org/apache/maven/plugins/maven-scm-publish-plugin
> > /1.0-SNAPSHOT/maven-scm-publish-plugin-1.0-SNAPSHOT.jar> [INFO]
> > [invoker:integration-test {execution: integration-test}]
> > [INFO] Building: 006-site-multi-module/pom.xml
> > [INFO] run script setup.bsh
> > [INFO] ..SUCCESS (22.3 s)
> > [INFO] Building: 005-site-lifecycle/pom.xml
> > [INFO] run script setup.bsh
> > [INFO] ..SUCCESS (18.8 s)
> > [INFO] Building: 002-perform/pom.xml
> > [INFO] run script setup.bsh
> > [INFO] ..SUCCESS (18.0 s)
> > [INFO] Building: 001-prepare/pom.xml
> > [INFO] run script setup.bsh
> > [INFO] ..SUCCESS (5.0 s)
> > [INFO] Building: 004-publish-scm/pom.xml
> > [INFO] run script setup.bsh
> > [INFO] ..SUCCESS (19.0 s)
> > [INFO] Building: 003-lifecycle/pom.xml
> > [INFO] run script setup.bsh
> > [INFO] ..SUCCESS (5.4 s)
> > [INFO] [invoker:verify {execution: integration-test}]
> > [INFO] -------------------------------------------------
> > [INFO] Build Summary:
> > [INFO] Passed: 6, Failed: 0, Errors: 0, Skipped: 0
> > [INFO] -------------------------------------------------
> > [INFO] [install:install {execution: default-install}]
> > [INFO] Installing
> > <https://builds.apache.org/job/maven-plugins-ITs-m2/ws/maven-scm-publish-
> > plugin/target/maven-scm-publish-plugin-1.0-SNAPSHOT.jar> to
> > /home/jenkins/.m2/repository/org/apache/maven/plugins/maven-scm-publish-p
> > lugin/1.0-SNAPSHOT/maven-scm-publish-plugin-1.0-SNAPSHOT.jar [INFO]
> > ------------------------------------------------------------------------
> > [INFO] Building Maven Plugins Aggregator
> > [INFO] task-segment: [clean, install]
> > [INFO]
> > ------------------------------------------------------------------------
> > [INFO] [clean:clean {execution: default-clean}]
> > [INFO] Deleting
> > <https://builds.apache.org/job/maven-plugins-ITs-m2/ws/target> [INFO]
> > [remote-resources:process {execution: default}]
> > [INFO] [site:attach-descriptor {execution: default-attach-descriptor}]
> > [INFO] [install:install {execution: default-install}]
> > [INFO] Installing
> > <https://builds.apache.org/job/maven-plugins-ITs-m2/ws/pom.xml> to
> > /home/jenkins/.m2/repository/org/apache/maven/plugins/maven-plugins-aggre
> > gator/1-SNAPSHOT/maven-plugins-aggregator-1-SNAPSHOT.pom [INFO]
> > [INFO]
> > [INFO]
> > ------------------------------------------------------------------------
> > [INFO] Reactor Summary:
> > [INFO]
> > ------------------------------------------------------------------------
> > [INFO] Maven Plugins ......................................... SUCCESS
> > [9.458s] [INFO] Maven ACR Plugin ......................................
> > SUCCESS [31.132s] [INFO] Maven Ant Plugin
> > ...................................... SUCCESS [1:09.782s] [INFO] Maven
> > AntRun Plugin ................................... SUCCESS [50.141s]
> > [INFO] Maven Eclipse Plugin .................................. SUCCESS
> > [6:48.952s] [INFO] Maven Assembly Plugin
> > ................................. SUCCESS [11:24.057s] [INFO] Maven
> > Changelog Plugin ................................ SUCCESS [45.210s]
> > [INFO] Maven Compiler Plugin ................................. SUCCESS
> > [52.048s] [INFO] Maven Changes Report Plugin ...........................
> > SUCCESS [1:12.411s] [INFO] Maven Checkstyle Plugin
> > ............................... SUCCESS [1:45.368s] [INFO] Maven Clean
> > Plugin .................................... SUCCESS [15.372s] [INFO]
> > Maven Dependency Plugin ............................... SUCCESS
> > [2:34.281s] [INFO] Maven Deploy Plugin
> > ................................... SUCCESS [1:00.020s] [INFO] Maven DOAP
> > Plugin ..................................... SUCCESS [27.767s] [INFO]
> > Maven Documentation Checker Plugin .................... SUCCESS [7.400s]
> > [INFO] Maven EAR Plugin ...................................... SUCCESS
> > [3:30.374s] [INFO] Maven EJB Plugin
> > ...................................... SUCCESS [26.652s] [INFO] Maven GPG
> > Plugin ...................................... SUCCESS [9.539s] [INFO]
> > Maven Help Plugin ..................................... SUCCESS [29.553s]
> > [INFO] Maven IDEA Plugin ..................................... SUCCESS
> > [9.067s] [INFO] Maven Install Plugin ..................................
> > SUCCESS [37.187s] [INFO] Maven JAR Plugin
> > ...................................... SUCCESS [1:02.057s] [INFO] Maven
> > Jarsigner Plugin ................................ SUCCESS [24.451s]
> > [INFO] Maven Javadoc Plugin .................................. FAILED
> > [1:17.830s] [INFO] Maven Linkcheck Plugin
> > ................................ SUCCESS [2.977s] [INFO] Maven One Plugin
> > ...................................... SUCCESS [1.646s] [INFO] Maven
> > Patch Plugin .................................... SUCCESS [11.297s]
> > [INFO] Maven PDF Plugin ...................................... SUCCESS
> > [44.829s] [INFO] Maven PMD Plugin ......................................
> > SUCCESS [43.237s] [INFO] Maven RAR Plugin
> > ...................................... SUCCESS [10.419s] [INFO] Maven
> > Reactor Plugin .................................. SUCCESS [3.183s] [INFO]
> > Maven Repository Plugin ............................... SUCCESS [40.604s]
> > [INFO] Maven Resources Plugin ................................ SUCCESS
> > [57.709s] [INFO] Maven Site Plugin 3 ...................................
> > SUCCESS [7:16.525s] [INFO] Maven Source Plugin
> > ................................... SUCCESS [44.191s] [INFO] Maven Stage
> > Plugin .................................... SUCCESS [2.324s] [INFO] Maven
> > Toolchains Plugin ............................... SUCCESS [2.402s] [INFO]
> > Maven Verifier Plugin ................................. SUCCESS [13.866s]
> > [INFO] Maven WAR Plugin ...................................... SUCCESS
> > [1:13.288s] [INFO] SCM Publish Maven Plugin
> > .............................. SUCCESS [1:39.899s] [INFO] Maven Plugins
> > Aggregator .............................. SUCCESS [1.031s] [INFO]
> > ------------------------------------------------------------------------
> > [INFO] Error for project: Maven Javadoc Plugin (during install)
> > [INFO]
> > ------------------------------------------------------------------------
> > [INFO] There are test failures.
> >
> > Please refer to
> > <https://builds.apache.org/job/maven-plugins-ITs-m2/ws/maven-javadoc-plug
> > in/target/surefire-reports> for the individual test results. [INFO]
> > ------------------------------------------------------------------------
> > [INFO] For more information, run Maven with the -e switch
> > [INFO]
> > ------------------------------------------------------------------------
> > [INFO] BUILD ERRORS
> > [INFO]
> > ------------------------------------------------------------------------
> > [INFO] Total time: 52 minutes 51 seconds
> > [INFO] Finished at: Fri Sep 28 21:00:27 UTC 2012
> > [INFO] Final Memory: 281M/1017M
> > [INFO]
> > ------------------------------------------------------------------------
> > Build step 'Invoke top-level Maven targets' marked build as failure
---------------------------------------------------------------------
To unsubscribe, e-mail: dev-unsubscribe@maven.apache.org
For additional commands, e-mail: dev-help@maven.apache.org
Re: Build failed in Jenkins: maven-plugins-ITs-m2 #790
Posted by Dennis Lundberg <de...@apache.org>.
Hi
I had a look at why the Javadoc Plugin has started failing. At first it
seemed weird since there had been no code changes, but then it hit me
that a new version of said plugin had just been released, and therefor a
new site had been published. After some digging I found out the reason
for the failure.
In version 2.8.1 the package-list looks like this:
maven.apache.org/plugins/maven-javadoc-plugin-2.8.1/apidocs/package-list
In version 2.9 (latest) the package-list looks like this:
http://maven.apache.org/plugins/maven-javadoc-plugin/apidocs/package-list
Note the leading empty line in 2.9, which is causing JavadocUtil to deem
the package-list invalid. I don't know where the blank line is coming
from or why it has appeared now, but it seems to be a regression in
Javadoc Plugin 2.9.
On 2012-09-28 23:00, Apache Jenkins Server wrote:
> See <https://builds.apache.org/job/maven-plugins-ITs-m2/790/changes>
>
> Changes:
>
> [krosenvold] Revert "added generics"
>
> This reverts commit 19ae2a8f731d39653450c89d830f25e7ecf691bf.
>
> [krosenvold] o Make asssembly compile on java7
>
> ------------------------------------------
> [...truncated 10159 lines...]
> [INFO] Exploding webapp
> [INFO] Assembling webapp [maven-war-plugin-test] in [<https://builds.apache.org/job/maven-plugins-ITs-m2/ws/maven-war-plugin/target/test-classes/unit/warexplodedmojo/test-dir/ExplodedWarWithSourceModificationCheck]>
> [INFO] Processing war project
> [INFO] Copying webapp resources [<https://builds.apache.org/job/maven-plugins-ITs-m2/ws/maven-war-plugin/target/test-classes/unit/warexplodedmojo/test-dir/ExplodedWarWithSourceModificationCheck-test-data/source]>
> [INFO] Webapp assembled in [2 msecs]
> [INFO] Exploding webapp
> [INFO] Assembling webapp [maven-war-plugin-test] in [<https://builds.apache.org/job/maven-plugins-ITs-m2/ws/maven-war-plugin/target/test-classes/unit/warexplodedmojo/test-dir/ExplodedWarWithFileNameMapping]>
> [INFO] Processing war project
> [INFO] Copying webapp resources [<https://builds.apache.org/job/maven-plugins-ITs-m2/ws/maven-war-plugin/target/test-classes/unit/warexplodedmojo/test-dir/ExplodedWarWithFileNameMapping-test-data/source]>
> [INFO] Webapp assembled in [3 msecs]
> [INFO] Exploding webapp
> [INFO] Assembling webapp [maven-war-plugin-test] in [<https://builds.apache.org/job/maven-plugins-ITs-m2/ws/maven-war-plugin/target/test-classes/unit/warexplodedmojo/test-dir/ExplodedWarWithFileNameMappingAndDuplicateDependencies]>
> [INFO] Processing war project
> [INFO] Copying webapp resources [<https://builds.apache.org/job/maven-plugins-ITs-m2/ws/maven-war-plugin/target/test-classes/unit/warexplodedmojo/test-dir/ExplodedWarWithFileNameMappingAndDuplicateDependencies-test-data/source]>
> [INFO] Webapp assembled in [3 msecs]
> Tests run: 22, Failures: 0, Errors: 0, Skipped: 0, Time elapsed: 1.016 sec
> Running org.apache.maven.plugin.war.WarInPlaceMojoTest
> [INFO] Generating webapp in source directory [<https://builds.apache.org/job/maven-plugins-ITs-m2/ws/maven-war-plugin/target/test-classes/unit/warexplodedinplacemojo/test-dir/SimpleExplodedInplaceWar-test-data/source]>
> [INFO] Assembling webapp [maven-war-plugin-test] in [<https://builds.apache.org/job/maven-plugins-ITs-m2/ws/maven-war-plugin/target/test-classes/unit/warexplodedinplacemojo/test-dir/SimpleExplodedInplaceWar-test-data/source]>
> [INFO] Processing war project
> [INFO] Copying webapp webResources [<https://builds.apache.org/job/maven-plugins-ITs-m2/ws/maven-war-plugin/target/test-classes/unit/warexplodedinplacemojo/test-dir/resources]> to [<https://builds.apache.org/job/maven-plugins-ITs-m2/ws/maven-war-plugin/target/test-classes/unit/warexplodedinplacemojo/test-dir/SimpleExplodedInplaceWar-test-data/source]>
> [INFO] Webapp assembled in [1 msecs]
> Tests run: 2, Failures: 0, Errors: 0, Skipped: 0, Time elapsed: 0.071 sec
>
> Results :
>
> Tests run: 85, Failures: 0, Errors: 0, Skipped: 0
>
> [INFO] [jar:jar {execution: default-jar}]
> [INFO] Building jar: <https://builds.apache.org/job/maven-plugins-ITs-m2/ws/maven-war-plugin/target/maven-war-plugin-2.4-SNAPSHOT.jar>
> [INFO] [plugin:addPluginArtifactMetadata {execution: default-addPluginArtifactMetadata}]
> [INFO] [invoker:install {execution: integration-test}]
> [INFO] Installing <https://builds.apache.org/job/maven-plugins-ITs-m2/ws/maven-war-plugin/pom.xml> to <https://builds.apache.org/job/maven-plugins-ITs-m2/ws/maven-war-plugin/target/local-repo/org/apache/maven/plugins/maven-war-plugin/2.4-SNAPSHOT/maven-war-plugin-2.4-SNAPSHOT.pom>
> [INFO] Installing <https://builds.apache.org/job/maven-plugins-ITs-m2/ws/maven-war-plugin/target/maven-war-plugin-2.4-SNAPSHOT.jar> to <https://builds.apache.org/job/maven-plugins-ITs-m2/ws/maven-war-plugin/target/local-repo/org/apache/maven/plugins/maven-war-plugin/2.4-SNAPSHOT/maven-war-plugin-2.4-SNAPSHOT.jar>
> [INFO] [invoker:integration-test {execution: integration-test}]
> [INFO] Building: simple-war-project/pom.xml
> [INFO] run script <https://builds.apache.org/job/maven-plugins-ITs-m2/ws/maven-war-plugin/target/it/simple-war-project/verify.bsh>
> [INFO] ..SUCCESS (3.2 s)
> [INFO] Building: MWAR-143/pom.xml
> [INFO] run script <https://builds.apache.org/job/maven-plugins-ITs-m2/ws/maven-war-plugin/target/it/MWAR-143/verify.bsh>
> [INFO] ..SUCCESS (7.7 s)
> [INFO] Building: MWAR-139/pom.xml
> [INFO] run script <https://builds.apache.org/job/maven-plugins-ITs-m2/ws/maven-war-plugin/target/it/MWAR-139/verify.bsh>
> [INFO] ..SUCCESS (2.9 s)
> [INFO] Building: MWAR-133/pom.xml
> [INFO] run script <https://builds.apache.org/job/maven-plugins-ITs-m2/ws/maven-war-plugin/target/it/MWAR-133/verify.bsh>
> [INFO] ..SUCCESS (2.5 s)
> [INFO] Building: scoped-dependency-same-artifact/pom.xml
> [INFO] run script <https://builds.apache.org/job/maven-plugins-ITs-m2/ws/maven-war-plugin/target/it/scoped-dependency-same-artifact/verify.bsh>
> [INFO] ..SUCCESS (3.4 s)
> [INFO] Building: overlay-excludes/pom.xml
> [INFO] run script <https://builds.apache.org/job/maven-plugins-ITs-m2/ws/maven-war-plugin/target/it/overlay-excludes/verify.bsh>
> [INFO] ..SUCCESS (4.1 s)
> [INFO] Building: simple-war-no-webxml/pom.xml
> [INFO] run script <https://builds.apache.org/job/maven-plugins-ITs-m2/ws/maven-war-plugin/target/it/simple-war-no-webxml/verify.bsh>
> [INFO] ..SUCCESS (2.9 s)
> [INFO] Building: MWAR-62/pom.xml
> [INFO] run script <https://builds.apache.org/job/maven-plugins-ITs-m2/ws/maven-war-plugin/target/it/MWAR-62/verify.bsh>
> [INFO] ..SUCCESS (2.3 s)
> [INFO] Building: web-resources-filtering/pom.xml
> [INFO] run script <https://builds.apache.org/job/maven-plugins-ITs-m2/ws/maven-war-plugin/target/it/web-resources-filtering/verify.bsh>
> [INFO] ..SUCCESS (3.8 s)
> [INFO] Building: MWAR-96/pom.xml
> [INFO] run script <https://builds.apache.org/job/maven-plugins-ITs-m2/ws/maven-war-plugin/target/it/MWAR-96/verify.bsh>
> [INFO] ..SUCCESS (2.9 s)
> [INFO] Building: MWAR-240/pom.xml
> [INFO] run script <https://builds.apache.org/job/maven-plugins-ITs-m2/ws/maven-war-plugin/target/it/MWAR-240/verify.bsh>
> [INFO] ..SUCCESS (3.2 s)
> [INFO] Building: MWAR-131/pom.xml
> [INFO] run script <https://builds.apache.org/job/maven-plugins-ITs-m2/ws/maven-war-plugin/target/it/MWAR-131/verify.bsh>
> [INFO] ..SUCCESS (6.4 s)
> [INFO] Building: default/pom.xml
> [INFO] run script <https://builds.apache.org/job/maven-plugins-ITs-m2/ws/maven-war-plugin/target/it/default/verify.bsh>
> [INFO] ..SUCCESS (3.3 s)
> [INFO] Building: manifest-content/pom.xml
> [INFO] run script <https://builds.apache.org/job/maven-plugins-ITs-m2/ws/maven-war-plugin/target/it/manifest-content/verify.bsh>
> [INFO] ..SUCCESS (3.0 s)
> [INFO] Building: MWAR-129/pom.xml
> [INFO] run script <https://builds.apache.org/job/maven-plugins-ITs-m2/ws/maven-war-plugin/target/it/MWAR-129/verify.bsh>
> [INFO] ..SUCCESS (2.3 s)
> [INFO] [invoker:verify {execution: integration-test}]
> [INFO] -------------------------------------------------
> [INFO] Build Summary:
> [INFO] Passed: 15, Failed: 0, Errors: 0, Skipped: 0
> [INFO] -------------------------------------------------
> [INFO] [install:install {execution: default-install}]
> [INFO] Installing <https://builds.apache.org/job/maven-plugins-ITs-m2/ws/maven-war-plugin/target/maven-war-plugin-2.4-SNAPSHOT.jar> to /home/jenkins/.m2/repository/org/apache/maven/plugins/maven-war-plugin/2.4-SNAPSHOT/maven-war-plugin-2.4-SNAPSHOT.jar
> [INFO] ------------------------------------------------------------------------
> [INFO] Building SCM Publish Maven Plugin
> [INFO] task-segment: [clean, install]
> [INFO] ------------------------------------------------------------------------
> [INFO] [clean:clean {execution: default-clean}]
> [INFO] Deleting <https://builds.apache.org/job/maven-plugins-ITs-m2/ws/maven-scm-publish-plugin/target>
> [INFO] [enforcer:enforce {execution: ensure-no-container-api}]
> [INFO] [plugin:helpmojo {execution: generated-helpmojo}]
> [INFO] Using 'UTF-8' encoding to read mojo metadata.
> [INFO] Applying mojo extractor for language: java
> [INFO] Mojo extractor for language: java found 1 mojo descriptors.
> [INFO] Applying mojo extractor for language: bsh
> [INFO] Mojo extractor for language: bsh found 0 mojo descriptors.
> [INFO] Applying mojo extractor for language: java-annotations
> [INFO] Mojo extractor for language: java-annotations found 0 mojo descriptors.
> [INFO] [plugin:descriptor {execution: default-descriptor}]
> [INFO] Using 'UTF-8' encoding to read mojo metadata.
> [INFO] Applying mojo extractor for language: java
> [INFO] Mojo extractor for language: java found 2 mojo descriptors.
> [INFO] Applying mojo extractor for language: bsh
> [INFO] Mojo extractor for language: bsh found 0 mojo descriptors.
> [INFO] Applying mojo extractor for language: java-annotations
> [INFO] Mojo extractor for language: java-annotations found 0 mojo descriptors.
> [WARNING] The parameter expression: 'project.build.resources' used in mojo: 'process' has been deprecated. Use 'project.resources' instead.
> [INFO] [remote-resources:process {execution: default}]
> [debug] execute contextualize
> [INFO] [resources:resources {execution: default-resources}]
> [INFO] Using 'UTF-8' encoding to copy filtered resources.
> [INFO] Copying 2 resources
> [INFO] Copying 3 resources
> [INFO] [compiler:compile {execution: default-compile}]
> [INFO] Compiling 7 source files to <https://builds.apache.org/job/maven-plugins-ITs-m2/ws/maven-scm-publish-plugin/target/classes>
> [INFO] [plugin:descriptor {execution: mojo-descriptor}]
> [INFO] Using 'UTF-8' encoding to read mojo metadata.
> [INFO] Applying mojo extractor for language: java
> [INFO] Mojo extractor for language: java found 2 mojo descriptors.
> [INFO] Applying mojo extractor for language: bsh
> [INFO] Mojo extractor for language: bsh found 0 mojo descriptors.
> [INFO] Applying mojo extractor for language: java-annotations
> [INFO] Mojo extractor for language: java-annotations found 3 mojo descriptors.
> [debug] execute contextualize
> [INFO] [resources:testResources {execution: default-testResources}]
> [INFO] Using 'UTF-8' encoding to copy filtered resources.
> [INFO] skip non existing resourceDirectory <https://builds.apache.org/job/maven-plugins-ITs-m2/ws/maven-scm-publish-plugin/src/test/resources>
> [INFO] Copying 3 resources
> [INFO] [compiler:testCompile {execution: default-testCompile}]
> [INFO] No sources to compile
> [INFO] [surefire:test {execution: default-test}]
> [INFO] Surefire report directory: <https://builds.apache.org/job/maven-plugins-ITs-m2/ws/maven-scm-publish-plugin/target/surefire-reports>
>
> -------------------------------------------------------
> T E S T S
> -------------------------------------------------------
>
> Results :
>
> Tests run: 0, Failures: 0, Errors: 0, Skipped: 0
>
> [INFO] [jar:jar {execution: default-jar}]
> [INFO] Building jar: <https://builds.apache.org/job/maven-plugins-ITs-m2/ws/maven-scm-publish-plugin/target/maven-scm-publish-plugin-1.0-SNAPSHOT.jar>
> [INFO] [plugin:addPluginArtifactMetadata {execution: default-addPluginArtifactMetadata}]
> [INFO] [invoker:install {execution: integration-test}]
> [INFO] Installing <https://builds.apache.org/job/maven-plugins-ITs-m2/ws/maven-scm-publish-plugin/pom.xml> to <https://builds.apache.org/job/maven-plugins-ITs-m2/ws/maven-scm-publish-plugin/target/local-repo/org/apache/maven/plugins/maven-scm-publish-plugin/1.0-SNAPSHOT/maven-scm-publish-plugin-1.0-SNAPSHOT.pom>
> [INFO] Installing <https://builds.apache.org/job/maven-plugins-ITs-m2/ws/maven-scm-publish-plugin/target/maven-scm-publish-plugin-1.0-SNAPSHOT.jar> to <https://builds.apache.org/job/maven-plugins-ITs-m2/ws/maven-scm-publish-plugin/target/local-repo/org/apache/maven/plugins/maven-scm-publish-plugin/1.0-SNAPSHOT/maven-scm-publish-plugin-1.0-SNAPSHOT.jar>
> [INFO] [invoker:integration-test {execution: integration-test}]
> [INFO] Building: 006-site-multi-module/pom.xml
> [INFO] run script setup.bsh
> [INFO] ..SUCCESS (22.3 s)
> [INFO] Building: 005-site-lifecycle/pom.xml
> [INFO] run script setup.bsh
> [INFO] ..SUCCESS (18.8 s)
> [INFO] Building: 002-perform/pom.xml
> [INFO] run script setup.bsh
> [INFO] ..SUCCESS (18.0 s)
> [INFO] Building: 001-prepare/pom.xml
> [INFO] run script setup.bsh
> [INFO] ..SUCCESS (5.0 s)
> [INFO] Building: 004-publish-scm/pom.xml
> [INFO] run script setup.bsh
> [INFO] ..SUCCESS (19.0 s)
> [INFO] Building: 003-lifecycle/pom.xml
> [INFO] run script setup.bsh
> [INFO] ..SUCCESS (5.4 s)
> [INFO] [invoker:verify {execution: integration-test}]
> [INFO] -------------------------------------------------
> [INFO] Build Summary:
> [INFO] Passed: 6, Failed: 0, Errors: 0, Skipped: 0
> [INFO] -------------------------------------------------
> [INFO] [install:install {execution: default-install}]
> [INFO] Installing <https://builds.apache.org/job/maven-plugins-ITs-m2/ws/maven-scm-publish-plugin/target/maven-scm-publish-plugin-1.0-SNAPSHOT.jar> to /home/jenkins/.m2/repository/org/apache/maven/plugins/maven-scm-publish-plugin/1.0-SNAPSHOT/maven-scm-publish-plugin-1.0-SNAPSHOT.jar
> [INFO] ------------------------------------------------------------------------
> [INFO] Building Maven Plugins Aggregator
> [INFO] task-segment: [clean, install]
> [INFO] ------------------------------------------------------------------------
> [INFO] [clean:clean {execution: default-clean}]
> [INFO] Deleting <https://builds.apache.org/job/maven-plugins-ITs-m2/ws/target>
> [INFO] [remote-resources:process {execution: default}]
> [INFO] [site:attach-descriptor {execution: default-attach-descriptor}]
> [INFO] [install:install {execution: default-install}]
> [INFO] Installing <https://builds.apache.org/job/maven-plugins-ITs-m2/ws/pom.xml> to /home/jenkins/.m2/repository/org/apache/maven/plugins/maven-plugins-aggregator/1-SNAPSHOT/maven-plugins-aggregator-1-SNAPSHOT.pom
> [INFO]
> [INFO]
> [INFO] ------------------------------------------------------------------------
> [INFO] Reactor Summary:
> [INFO] ------------------------------------------------------------------------
> [INFO] Maven Plugins ......................................... SUCCESS [9.458s]
> [INFO] Maven ACR Plugin ...................................... SUCCESS [31.132s]
> [INFO] Maven Ant Plugin ...................................... SUCCESS [1:09.782s]
> [INFO] Maven AntRun Plugin ................................... SUCCESS [50.141s]
> [INFO] Maven Eclipse Plugin .................................. SUCCESS [6:48.952s]
> [INFO] Maven Assembly Plugin ................................. SUCCESS [11:24.057s]
> [INFO] Maven Changelog Plugin ................................ SUCCESS [45.210s]
> [INFO] Maven Compiler Plugin ................................. SUCCESS [52.048s]
> [INFO] Maven Changes Report Plugin ........................... SUCCESS [1:12.411s]
> [INFO] Maven Checkstyle Plugin ............................... SUCCESS [1:45.368s]
> [INFO] Maven Clean Plugin .................................... SUCCESS [15.372s]
> [INFO] Maven Dependency Plugin ............................... SUCCESS [2:34.281s]
> [INFO] Maven Deploy Plugin ................................... SUCCESS [1:00.020s]
> [INFO] Maven DOAP Plugin ..................................... SUCCESS [27.767s]
> [INFO] Maven Documentation Checker Plugin .................... SUCCESS [7.400s]
> [INFO] Maven EAR Plugin ...................................... SUCCESS [3:30.374s]
> [INFO] Maven EJB Plugin ...................................... SUCCESS [26.652s]
> [INFO] Maven GPG Plugin ...................................... SUCCESS [9.539s]
> [INFO] Maven Help Plugin ..................................... SUCCESS [29.553s]
> [INFO] Maven IDEA Plugin ..................................... SUCCESS [9.067s]
> [INFO] Maven Install Plugin .................................. SUCCESS [37.187s]
> [INFO] Maven JAR Plugin ...................................... SUCCESS [1:02.057s]
> [INFO] Maven Jarsigner Plugin ................................ SUCCESS [24.451s]
> [INFO] Maven Javadoc Plugin .................................. FAILED [1:17.830s]
> [INFO] Maven Linkcheck Plugin ................................ SUCCESS [2.977s]
> [INFO] Maven One Plugin ...................................... SUCCESS [1.646s]
> [INFO] Maven Patch Plugin .................................... SUCCESS [11.297s]
> [INFO] Maven PDF Plugin ...................................... SUCCESS [44.829s]
> [INFO] Maven PMD Plugin ...................................... SUCCESS [43.237s]
> [INFO] Maven RAR Plugin ...................................... SUCCESS [10.419s]
> [INFO] Maven Reactor Plugin .................................. SUCCESS [3.183s]
> [INFO] Maven Repository Plugin ............................... SUCCESS [40.604s]
> [INFO] Maven Resources Plugin ................................ SUCCESS [57.709s]
> [INFO] Maven Site Plugin 3 ................................... SUCCESS [7:16.525s]
> [INFO] Maven Source Plugin ................................... SUCCESS [44.191s]
> [INFO] Maven Stage Plugin .................................... SUCCESS [2.324s]
> [INFO] Maven Toolchains Plugin ............................... SUCCESS [2.402s]
> [INFO] Maven Verifier Plugin ................................. SUCCESS [13.866s]
> [INFO] Maven WAR Plugin ...................................... SUCCESS [1:13.288s]
> [INFO] SCM Publish Maven Plugin .............................. SUCCESS [1:39.899s]
> [INFO] Maven Plugins Aggregator .............................. SUCCESS [1.031s]
> [INFO] ------------------------------------------------------------------------
> [INFO] Error for project: Maven Javadoc Plugin (during install)
> [INFO] ------------------------------------------------------------------------
> [INFO] There are test failures.
>
> Please refer to <https://builds.apache.org/job/maven-plugins-ITs-m2/ws/maven-javadoc-plugin/target/surefire-reports> for the individual test results.
> [INFO] ------------------------------------------------------------------------
> [INFO] For more information, run Maven with the -e switch
> [INFO] ------------------------------------------------------------------------
> [INFO] BUILD ERRORS
> [INFO] ------------------------------------------------------------------------
> [INFO] Total time: 52 minutes 51 seconds
> [INFO] Finished at: Fri Sep 28 21:00:27 UTC 2012
> [INFO] Final Memory: 281M/1017M
> [INFO] ------------------------------------------------------------------------
> Build step 'Invoke top-level Maven targets' marked build as failure
>
--
Dennis Lundberg
---------------------------------------------------------------------
To unsubscribe, e-mail: dev-unsubscribe@maven.apache.org
For additional commands, e-mail: dev-help@maven.apache.org
Build failed in Jenkins: maven-plugins-ITs-m2 #790
Posted by Apache Jenkins Server <je...@builds.apache.org>.
See <https://builds.apache.org/job/maven-plugins-ITs-m2/790/changes>
Changes:
[krosenvold] Revert "added generics"
This reverts commit 19ae2a8f731d39653450c89d830f25e7ecf691bf.
[krosenvold] o Make asssembly compile on java7
------------------------------------------
[...truncated 10159 lines...]
[INFO] Exploding webapp
[INFO] Assembling webapp [maven-war-plugin-test] in [<https://builds.apache.org/job/maven-plugins-ITs-m2/ws/maven-war-plugin/target/test-classes/unit/warexplodedmojo/test-dir/ExplodedWarWithSourceModificationCheck]>
[INFO] Processing war project
[INFO] Copying webapp resources [<https://builds.apache.org/job/maven-plugins-ITs-m2/ws/maven-war-plugin/target/test-classes/unit/warexplodedmojo/test-dir/ExplodedWarWithSourceModificationCheck-test-data/source]>
[INFO] Webapp assembled in [2 msecs]
[INFO] Exploding webapp
[INFO] Assembling webapp [maven-war-plugin-test] in [<https://builds.apache.org/job/maven-plugins-ITs-m2/ws/maven-war-plugin/target/test-classes/unit/warexplodedmojo/test-dir/ExplodedWarWithFileNameMapping]>
[INFO] Processing war project
[INFO] Copying webapp resources [<https://builds.apache.org/job/maven-plugins-ITs-m2/ws/maven-war-plugin/target/test-classes/unit/warexplodedmojo/test-dir/ExplodedWarWithFileNameMapping-test-data/source]>
[INFO] Webapp assembled in [3 msecs]
[INFO] Exploding webapp
[INFO] Assembling webapp [maven-war-plugin-test] in [<https://builds.apache.org/job/maven-plugins-ITs-m2/ws/maven-war-plugin/target/test-classes/unit/warexplodedmojo/test-dir/ExplodedWarWithFileNameMappingAndDuplicateDependencies]>
[INFO] Processing war project
[INFO] Copying webapp resources [<https://builds.apache.org/job/maven-plugins-ITs-m2/ws/maven-war-plugin/target/test-classes/unit/warexplodedmojo/test-dir/ExplodedWarWithFileNameMappingAndDuplicateDependencies-test-data/source]>
[INFO] Webapp assembled in [3 msecs]
Tests run: 22, Failures: 0, Errors: 0, Skipped: 0, Time elapsed: 1.016 sec
Running org.apache.maven.plugin.war.WarInPlaceMojoTest
[INFO] Generating webapp in source directory [<https://builds.apache.org/job/maven-plugins-ITs-m2/ws/maven-war-plugin/target/test-classes/unit/warexplodedinplacemojo/test-dir/SimpleExplodedInplaceWar-test-data/source]>
[INFO] Assembling webapp [maven-war-plugin-test] in [<https://builds.apache.org/job/maven-plugins-ITs-m2/ws/maven-war-plugin/target/test-classes/unit/warexplodedinplacemojo/test-dir/SimpleExplodedInplaceWar-test-data/source]>
[INFO] Processing war project
[INFO] Copying webapp webResources [<https://builds.apache.org/job/maven-plugins-ITs-m2/ws/maven-war-plugin/target/test-classes/unit/warexplodedinplacemojo/test-dir/resources]> to [<https://builds.apache.org/job/maven-plugins-ITs-m2/ws/maven-war-plugin/target/test-classes/unit/warexplodedinplacemojo/test-dir/SimpleExplodedInplaceWar-test-data/source]>
[INFO] Webapp assembled in [1 msecs]
Tests run: 2, Failures: 0, Errors: 0, Skipped: 0, Time elapsed: 0.071 sec
Results :
Tests run: 85, Failures: 0, Errors: 0, Skipped: 0
[INFO] [jar:jar {execution: default-jar}]
[INFO] Building jar: <https://builds.apache.org/job/maven-plugins-ITs-m2/ws/maven-war-plugin/target/maven-war-plugin-2.4-SNAPSHOT.jar>
[INFO] [plugin:addPluginArtifactMetadata {execution: default-addPluginArtifactMetadata}]
[INFO] [invoker:install {execution: integration-test}]
[INFO] Installing <https://builds.apache.org/job/maven-plugins-ITs-m2/ws/maven-war-plugin/pom.xml> to <https://builds.apache.org/job/maven-plugins-ITs-m2/ws/maven-war-plugin/target/local-repo/org/apache/maven/plugins/maven-war-plugin/2.4-SNAPSHOT/maven-war-plugin-2.4-SNAPSHOT.pom>
[INFO] Installing <https://builds.apache.org/job/maven-plugins-ITs-m2/ws/maven-war-plugin/target/maven-war-plugin-2.4-SNAPSHOT.jar> to <https://builds.apache.org/job/maven-plugins-ITs-m2/ws/maven-war-plugin/target/local-repo/org/apache/maven/plugins/maven-war-plugin/2.4-SNAPSHOT/maven-war-plugin-2.4-SNAPSHOT.jar>
[INFO] [invoker:integration-test {execution: integration-test}]
[INFO] Building: simple-war-project/pom.xml
[INFO] run script <https://builds.apache.org/job/maven-plugins-ITs-m2/ws/maven-war-plugin/target/it/simple-war-project/verify.bsh>
[INFO] ..SUCCESS (3.2 s)
[INFO] Building: MWAR-143/pom.xml
[INFO] run script <https://builds.apache.org/job/maven-plugins-ITs-m2/ws/maven-war-plugin/target/it/MWAR-143/verify.bsh>
[INFO] ..SUCCESS (7.7 s)
[INFO] Building: MWAR-139/pom.xml
[INFO] run script <https://builds.apache.org/job/maven-plugins-ITs-m2/ws/maven-war-plugin/target/it/MWAR-139/verify.bsh>
[INFO] ..SUCCESS (2.9 s)
[INFO] Building: MWAR-133/pom.xml
[INFO] run script <https://builds.apache.org/job/maven-plugins-ITs-m2/ws/maven-war-plugin/target/it/MWAR-133/verify.bsh>
[INFO] ..SUCCESS (2.5 s)
[INFO] Building: scoped-dependency-same-artifact/pom.xml
[INFO] run script <https://builds.apache.org/job/maven-plugins-ITs-m2/ws/maven-war-plugin/target/it/scoped-dependency-same-artifact/verify.bsh>
[INFO] ..SUCCESS (3.4 s)
[INFO] Building: overlay-excludes/pom.xml
[INFO] run script <https://builds.apache.org/job/maven-plugins-ITs-m2/ws/maven-war-plugin/target/it/overlay-excludes/verify.bsh>
[INFO] ..SUCCESS (4.1 s)
[INFO] Building: simple-war-no-webxml/pom.xml
[INFO] run script <https://builds.apache.org/job/maven-plugins-ITs-m2/ws/maven-war-plugin/target/it/simple-war-no-webxml/verify.bsh>
[INFO] ..SUCCESS (2.9 s)
[INFO] Building: MWAR-62/pom.xml
[INFO] run script <https://builds.apache.org/job/maven-plugins-ITs-m2/ws/maven-war-plugin/target/it/MWAR-62/verify.bsh>
[INFO] ..SUCCESS (2.3 s)
[INFO] Building: web-resources-filtering/pom.xml
[INFO] run script <https://builds.apache.org/job/maven-plugins-ITs-m2/ws/maven-war-plugin/target/it/web-resources-filtering/verify.bsh>
[INFO] ..SUCCESS (3.8 s)
[INFO] Building: MWAR-96/pom.xml
[INFO] run script <https://builds.apache.org/job/maven-plugins-ITs-m2/ws/maven-war-plugin/target/it/MWAR-96/verify.bsh>
[INFO] ..SUCCESS (2.9 s)
[INFO] Building: MWAR-240/pom.xml
[INFO] run script <https://builds.apache.org/job/maven-plugins-ITs-m2/ws/maven-war-plugin/target/it/MWAR-240/verify.bsh>
[INFO] ..SUCCESS (3.2 s)
[INFO] Building: MWAR-131/pom.xml
[INFO] run script <https://builds.apache.org/job/maven-plugins-ITs-m2/ws/maven-war-plugin/target/it/MWAR-131/verify.bsh>
[INFO] ..SUCCESS (6.4 s)
[INFO] Building: default/pom.xml
[INFO] run script <https://builds.apache.org/job/maven-plugins-ITs-m2/ws/maven-war-plugin/target/it/default/verify.bsh>
[INFO] ..SUCCESS (3.3 s)
[INFO] Building: manifest-content/pom.xml
[INFO] run script <https://builds.apache.org/job/maven-plugins-ITs-m2/ws/maven-war-plugin/target/it/manifest-content/verify.bsh>
[INFO] ..SUCCESS (3.0 s)
[INFO] Building: MWAR-129/pom.xml
[INFO] run script <https://builds.apache.org/job/maven-plugins-ITs-m2/ws/maven-war-plugin/target/it/MWAR-129/verify.bsh>
[INFO] ..SUCCESS (2.3 s)
[INFO] [invoker:verify {execution: integration-test}]
[INFO] -------------------------------------------------
[INFO] Build Summary:
[INFO] Passed: 15, Failed: 0, Errors: 0, Skipped: 0
[INFO] -------------------------------------------------
[INFO] [install:install {execution: default-install}]
[INFO] Installing <https://builds.apache.org/job/maven-plugins-ITs-m2/ws/maven-war-plugin/target/maven-war-plugin-2.4-SNAPSHOT.jar> to /home/jenkins/.m2/repository/org/apache/maven/plugins/maven-war-plugin/2.4-SNAPSHOT/maven-war-plugin-2.4-SNAPSHOT.jar
[INFO] ------------------------------------------------------------------------
[INFO] Building SCM Publish Maven Plugin
[INFO] task-segment: [clean, install]
[INFO] ------------------------------------------------------------------------
[INFO] [clean:clean {execution: default-clean}]
[INFO] Deleting <https://builds.apache.org/job/maven-plugins-ITs-m2/ws/maven-scm-publish-plugin/target>
[INFO] [enforcer:enforce {execution: ensure-no-container-api}]
[INFO] [plugin:helpmojo {execution: generated-helpmojo}]
[INFO] Using 'UTF-8' encoding to read mojo metadata.
[INFO] Applying mojo extractor for language: java
[INFO] Mojo extractor for language: java found 1 mojo descriptors.
[INFO] Applying mojo extractor for language: bsh
[INFO] Mojo extractor for language: bsh found 0 mojo descriptors.
[INFO] Applying mojo extractor for language: java-annotations
[INFO] Mojo extractor for language: java-annotations found 0 mojo descriptors.
[INFO] [plugin:descriptor {execution: default-descriptor}]
[INFO] Using 'UTF-8' encoding to read mojo metadata.
[INFO] Applying mojo extractor for language: java
[INFO] Mojo extractor for language: java found 2 mojo descriptors.
[INFO] Applying mojo extractor for language: bsh
[INFO] Mojo extractor for language: bsh found 0 mojo descriptors.
[INFO] Applying mojo extractor for language: java-annotations
[INFO] Mojo extractor for language: java-annotations found 0 mojo descriptors.
[WARNING] The parameter expression: 'project.build.resources' used in mojo: 'process' has been deprecated. Use 'project.resources' instead.
[INFO] [remote-resources:process {execution: default}]
[debug] execute contextualize
[INFO] [resources:resources {execution: default-resources}]
[INFO] Using 'UTF-8' encoding to copy filtered resources.
[INFO] Copying 2 resources
[INFO] Copying 3 resources
[INFO] [compiler:compile {execution: default-compile}]
[INFO] Compiling 7 source files to <https://builds.apache.org/job/maven-plugins-ITs-m2/ws/maven-scm-publish-plugin/target/classes>
[INFO] [plugin:descriptor {execution: mojo-descriptor}]
[INFO] Using 'UTF-8' encoding to read mojo metadata.
[INFO] Applying mojo extractor for language: java
[INFO] Mojo extractor for language: java found 2 mojo descriptors.
[INFO] Applying mojo extractor for language: bsh
[INFO] Mojo extractor for language: bsh found 0 mojo descriptors.
[INFO] Applying mojo extractor for language: java-annotations
[INFO] Mojo extractor for language: java-annotations found 3 mojo descriptors.
[debug] execute contextualize
[INFO] [resources:testResources {execution: default-testResources}]
[INFO] Using 'UTF-8' encoding to copy filtered resources.
[INFO] skip non existing resourceDirectory <https://builds.apache.org/job/maven-plugins-ITs-m2/ws/maven-scm-publish-plugin/src/test/resources>
[INFO] Copying 3 resources
[INFO] [compiler:testCompile {execution: default-testCompile}]
[INFO] No sources to compile
[INFO] [surefire:test {execution: default-test}]
[INFO] Surefire report directory: <https://builds.apache.org/job/maven-plugins-ITs-m2/ws/maven-scm-publish-plugin/target/surefire-reports>
-------------------------------------------------------
T E S T S
-------------------------------------------------------
Results :
Tests run: 0, Failures: 0, Errors: 0, Skipped: 0
[INFO] [jar:jar {execution: default-jar}]
[INFO] Building jar: <https://builds.apache.org/job/maven-plugins-ITs-m2/ws/maven-scm-publish-plugin/target/maven-scm-publish-plugin-1.0-SNAPSHOT.jar>
[INFO] [plugin:addPluginArtifactMetadata {execution: default-addPluginArtifactMetadata}]
[INFO] [invoker:install {execution: integration-test}]
[INFO] Installing <https://builds.apache.org/job/maven-plugins-ITs-m2/ws/maven-scm-publish-plugin/pom.xml> to <https://builds.apache.org/job/maven-plugins-ITs-m2/ws/maven-scm-publish-plugin/target/local-repo/org/apache/maven/plugins/maven-scm-publish-plugin/1.0-SNAPSHOT/maven-scm-publish-plugin-1.0-SNAPSHOT.pom>
[INFO] Installing <https://builds.apache.org/job/maven-plugins-ITs-m2/ws/maven-scm-publish-plugin/target/maven-scm-publish-plugin-1.0-SNAPSHOT.jar> to <https://builds.apache.org/job/maven-plugins-ITs-m2/ws/maven-scm-publish-plugin/target/local-repo/org/apache/maven/plugins/maven-scm-publish-plugin/1.0-SNAPSHOT/maven-scm-publish-plugin-1.0-SNAPSHOT.jar>
[INFO] [invoker:integration-test {execution: integration-test}]
[INFO] Building: 006-site-multi-module/pom.xml
[INFO] run script setup.bsh
[INFO] ..SUCCESS (22.3 s)
[INFO] Building: 005-site-lifecycle/pom.xml
[INFO] run script setup.bsh
[INFO] ..SUCCESS (18.8 s)
[INFO] Building: 002-perform/pom.xml
[INFO] run script setup.bsh
[INFO] ..SUCCESS (18.0 s)
[INFO] Building: 001-prepare/pom.xml
[INFO] run script setup.bsh
[INFO] ..SUCCESS (5.0 s)
[INFO] Building: 004-publish-scm/pom.xml
[INFO] run script setup.bsh
[INFO] ..SUCCESS (19.0 s)
[INFO] Building: 003-lifecycle/pom.xml
[INFO] run script setup.bsh
[INFO] ..SUCCESS (5.4 s)
[INFO] [invoker:verify {execution: integration-test}]
[INFO] -------------------------------------------------
[INFO] Build Summary:
[INFO] Passed: 6, Failed: 0, Errors: 0, Skipped: 0
[INFO] -------------------------------------------------
[INFO] [install:install {execution: default-install}]
[INFO] Installing <https://builds.apache.org/job/maven-plugins-ITs-m2/ws/maven-scm-publish-plugin/target/maven-scm-publish-plugin-1.0-SNAPSHOT.jar> to /home/jenkins/.m2/repository/org/apache/maven/plugins/maven-scm-publish-plugin/1.0-SNAPSHOT/maven-scm-publish-plugin-1.0-SNAPSHOT.jar
[INFO] ------------------------------------------------------------------------
[INFO] Building Maven Plugins Aggregator
[INFO] task-segment: [clean, install]
[INFO] ------------------------------------------------------------------------
[INFO] [clean:clean {execution: default-clean}]
[INFO] Deleting <https://builds.apache.org/job/maven-plugins-ITs-m2/ws/target>
[INFO] [remote-resources:process {execution: default}]
[INFO] [site:attach-descriptor {execution: default-attach-descriptor}]
[INFO] [install:install {execution: default-install}]
[INFO] Installing <https://builds.apache.org/job/maven-plugins-ITs-m2/ws/pom.xml> to /home/jenkins/.m2/repository/org/apache/maven/plugins/maven-plugins-aggregator/1-SNAPSHOT/maven-plugins-aggregator-1-SNAPSHOT.pom
[INFO]
[INFO]
[INFO] ------------------------------------------------------------------------
[INFO] Reactor Summary:
[INFO] ------------------------------------------------------------------------
[INFO] Maven Plugins ......................................... SUCCESS [9.458s]
[INFO] Maven ACR Plugin ...................................... SUCCESS [31.132s]
[INFO] Maven Ant Plugin ...................................... SUCCESS [1:09.782s]
[INFO] Maven AntRun Plugin ................................... SUCCESS [50.141s]
[INFO] Maven Eclipse Plugin .................................. SUCCESS [6:48.952s]
[INFO] Maven Assembly Plugin ................................. SUCCESS [11:24.057s]
[INFO] Maven Changelog Plugin ................................ SUCCESS [45.210s]
[INFO] Maven Compiler Plugin ................................. SUCCESS [52.048s]
[INFO] Maven Changes Report Plugin ........................... SUCCESS [1:12.411s]
[INFO] Maven Checkstyle Plugin ............................... SUCCESS [1:45.368s]
[INFO] Maven Clean Plugin .................................... SUCCESS [15.372s]
[INFO] Maven Dependency Plugin ............................... SUCCESS [2:34.281s]
[INFO] Maven Deploy Plugin ................................... SUCCESS [1:00.020s]
[INFO] Maven DOAP Plugin ..................................... SUCCESS [27.767s]
[INFO] Maven Documentation Checker Plugin .................... SUCCESS [7.400s]
[INFO] Maven EAR Plugin ...................................... SUCCESS [3:30.374s]
[INFO] Maven EJB Plugin ...................................... SUCCESS [26.652s]
[INFO] Maven GPG Plugin ...................................... SUCCESS [9.539s]
[INFO] Maven Help Plugin ..................................... SUCCESS [29.553s]
[INFO] Maven IDEA Plugin ..................................... SUCCESS [9.067s]
[INFO] Maven Install Plugin .................................. SUCCESS [37.187s]
[INFO] Maven JAR Plugin ...................................... SUCCESS [1:02.057s]
[INFO] Maven Jarsigner Plugin ................................ SUCCESS [24.451s]
[INFO] Maven Javadoc Plugin .................................. FAILED [1:17.830s]
[INFO] Maven Linkcheck Plugin ................................ SUCCESS [2.977s]
[INFO] Maven One Plugin ...................................... SUCCESS [1.646s]
[INFO] Maven Patch Plugin .................................... SUCCESS [11.297s]
[INFO] Maven PDF Plugin ...................................... SUCCESS [44.829s]
[INFO] Maven PMD Plugin ...................................... SUCCESS [43.237s]
[INFO] Maven RAR Plugin ...................................... SUCCESS [10.419s]
[INFO] Maven Reactor Plugin .................................. SUCCESS [3.183s]
[INFO] Maven Repository Plugin ............................... SUCCESS [40.604s]
[INFO] Maven Resources Plugin ................................ SUCCESS [57.709s]
[INFO] Maven Site Plugin 3 ................................... SUCCESS [7:16.525s]
[INFO] Maven Source Plugin ................................... SUCCESS [44.191s]
[INFO] Maven Stage Plugin .................................... SUCCESS [2.324s]
[INFO] Maven Toolchains Plugin ............................... SUCCESS [2.402s]
[INFO] Maven Verifier Plugin ................................. SUCCESS [13.866s]
[INFO] Maven WAR Plugin ...................................... SUCCESS [1:13.288s]
[INFO] SCM Publish Maven Plugin .............................. SUCCESS [1:39.899s]
[INFO] Maven Plugins Aggregator .............................. SUCCESS [1.031s]
[INFO] ------------------------------------------------------------------------
[INFO] Error for project: Maven Javadoc Plugin (during install)
[INFO] ------------------------------------------------------------------------
[INFO] There are test failures.
Please refer to <https://builds.apache.org/job/maven-plugins-ITs-m2/ws/maven-javadoc-plugin/target/surefire-reports> for the individual test results.
[INFO] ------------------------------------------------------------------------
[INFO] For more information, run Maven with the -e switch
[INFO] ------------------------------------------------------------------------
[INFO] BUILD ERRORS
[INFO] ------------------------------------------------------------------------
[INFO] Total time: 52 minutes 51 seconds
[INFO] Finished at: Fri Sep 28 21:00:27 UTC 2012
[INFO] Final Memory: 281M/1017M
[INFO] ------------------------------------------------------------------------
Build step 'Invoke top-level Maven targets' marked build as failure
Build failed in Jenkins: maven-plugins-ITs-m2 #789
Posted by Apache Jenkins Server <je...@builds.apache.org>.
See <https://builds.apache.org/job/maven-plugins-ITs-m2/789/changes>
Changes:
[dennisl] [maven-release-plugin] prepare for next development iteration
[dennisl] [maven-release-plugin] prepare release maven-war-plugin-2.3
[dennisl] [MWAR-164] Support for specifying which encoding to use when filtering resources
- Add more documentation.
------------------------------------------
[...truncated 10111 lines...]
[INFO] Assembling webapp [maven-war-plugin-test] in [<https://builds.apache.org/job/maven-plugins-ITs-m2/ws/maven-war-plugin/target/test-classes/unit/warexplodedmojo/test-dir/ExplodedWarWithFileNameMapping]>
[INFO] Processing war project
[INFO] Copying webapp resources [<https://builds.apache.org/job/maven-plugins-ITs-m2/ws/maven-war-plugin/target/test-classes/unit/warexplodedmojo/test-dir/ExplodedWarWithFileNameMapping-test-data/source]>
[INFO] Webapp assembled in [3 msecs]
[INFO] Exploding webapp
[INFO] Assembling webapp [maven-war-plugin-test] in [<https://builds.apache.org/job/maven-plugins-ITs-m2/ws/maven-war-plugin/target/test-classes/unit/warexplodedmojo/test-dir/ExplodedWarWithFileNameMappingAndDuplicateDependencies]>
[INFO] Processing war project
[INFO] Copying webapp resources [<https://builds.apache.org/job/maven-plugins-ITs-m2/ws/maven-war-plugin/target/test-classes/unit/warexplodedmojo/test-dir/ExplodedWarWithFileNameMappingAndDuplicateDependencies-test-data/source]>
[INFO] Webapp assembled in [3 msecs]
Tests run: 22, Failures: 0, Errors: 0, Skipped: 0, Time elapsed: 1.012 sec
Running org.apache.maven.plugin.war.WarInPlaceMojoTest
[INFO] Generating webapp in source directory [<https://builds.apache.org/job/maven-plugins-ITs-m2/ws/maven-war-plugin/target/test-classes/unit/warexplodedinplacemojo/test-dir/SimpleExplodedInplaceWar-test-data/source]>
[INFO] Assembling webapp [maven-war-plugin-test] in [<https://builds.apache.org/job/maven-plugins-ITs-m2/ws/maven-war-plugin/target/test-classes/unit/warexplodedinplacemojo/test-dir/SimpleExplodedInplaceWar-test-data/source]>
[INFO] Processing war project
[INFO] Copying webapp webResources [<https://builds.apache.org/job/maven-plugins-ITs-m2/ws/maven-war-plugin/target/test-classes/unit/warexplodedinplacemojo/test-dir/resources]> to [<https://builds.apache.org/job/maven-plugins-ITs-m2/ws/maven-war-plugin/target/test-classes/unit/warexplodedinplacemojo/test-dir/SimpleExplodedInplaceWar-test-data/source]>
[INFO] Webapp assembled in [1 msecs]
Tests run: 2, Failures: 0, Errors: 0, Skipped: 0, Time elapsed: 0.1 sec
Results :
Tests run: 85, Failures: 0, Errors: 0, Skipped: 0
[INFO] [jar:jar {execution: default-jar}]
[INFO] Building jar: <https://builds.apache.org/job/maven-plugins-ITs-m2/ws/maven-war-plugin/target/maven-war-plugin-2.4-SNAPSHOT.jar>
[INFO] [plugin:addPluginArtifactMetadata {execution: default-addPluginArtifactMetadata}]
[INFO] [invoker:install {execution: integration-test}]
[INFO] Installing <https://builds.apache.org/job/maven-plugins-ITs-m2/ws/maven-war-plugin/pom.xml> to <https://builds.apache.org/job/maven-plugins-ITs-m2/ws/maven-war-plugin/target/local-repo/org/apache/maven/plugins/maven-war-plugin/2.4-SNAPSHOT/maven-war-plugin-2.4-SNAPSHOT.pom>
[INFO] Installing <https://builds.apache.org/job/maven-plugins-ITs-m2/ws/maven-war-plugin/target/maven-war-plugin-2.4-SNAPSHOT.jar> to <https://builds.apache.org/job/maven-plugins-ITs-m2/ws/maven-war-plugin/target/local-repo/org/apache/maven/plugins/maven-war-plugin/2.4-SNAPSHOT/maven-war-plugin-2.4-SNAPSHOT.jar>
[INFO] [invoker:integration-test {execution: integration-test}]
[INFO] Building: simple-war-project/pom.xml
[INFO] run script <https://builds.apache.org/job/maven-plugins-ITs-m2/ws/maven-war-plugin/target/it/simple-war-project/verify.bsh>
[INFO] ..SUCCESS (3.3 s)
[INFO] Building: MWAR-143/pom.xml
[INFO] run script <https://builds.apache.org/job/maven-plugins-ITs-m2/ws/maven-war-plugin/target/it/MWAR-143/verify.bsh>
[INFO] ..SUCCESS (7.8 s)
[INFO] Building: MWAR-139/pom.xml
[INFO] run script <https://builds.apache.org/job/maven-plugins-ITs-m2/ws/maven-war-plugin/target/it/MWAR-139/verify.bsh>
[INFO] ..SUCCESS (3.1 s)
[INFO] Building: MWAR-133/pom.xml
[INFO] run script <https://builds.apache.org/job/maven-plugins-ITs-m2/ws/maven-war-plugin/target/it/MWAR-133/verify.bsh>
[INFO] ..SUCCESS (2.4 s)
[INFO] Building: scoped-dependency-same-artifact/pom.xml
[INFO] run script <https://builds.apache.org/job/maven-plugins-ITs-m2/ws/maven-war-plugin/target/it/scoped-dependency-same-artifact/verify.bsh>
[INFO] ..SUCCESS (3.3 s)
[INFO] Building: overlay-excludes/pom.xml
[INFO] run script <https://builds.apache.org/job/maven-plugins-ITs-m2/ws/maven-war-plugin/target/it/overlay-excludes/verify.bsh>
[INFO] ..SUCCESS (4.3 s)
[INFO] Building: simple-war-no-webxml/pom.xml
[INFO] run script <https://builds.apache.org/job/maven-plugins-ITs-m2/ws/maven-war-plugin/target/it/simple-war-no-webxml/verify.bsh>
[INFO] ..SUCCESS (3.0 s)
[INFO] Building: MWAR-62/pom.xml
[INFO] run script <https://builds.apache.org/job/maven-plugins-ITs-m2/ws/maven-war-plugin/target/it/MWAR-62/verify.bsh>
[INFO] ..SUCCESS (2.3 s)
[INFO] Building: web-resources-filtering/pom.xml
[INFO] run script <https://builds.apache.org/job/maven-plugins-ITs-m2/ws/maven-war-plugin/target/it/web-resources-filtering/verify.bsh>
[INFO] ..SUCCESS (4.1 s)
[INFO] Building: MWAR-96/pom.xml
[INFO] run script <https://builds.apache.org/job/maven-plugins-ITs-m2/ws/maven-war-plugin/target/it/MWAR-96/verify.bsh>
[INFO] ..SUCCESS (3.2 s)
[INFO] Building: MWAR-240/pom.xml
[INFO] run script <https://builds.apache.org/job/maven-plugins-ITs-m2/ws/maven-war-plugin/target/it/MWAR-240/verify.bsh>
[INFO] ..SUCCESS (3.5 s)
[INFO] Building: MWAR-131/pom.xml
[INFO] run script <https://builds.apache.org/job/maven-plugins-ITs-m2/ws/maven-war-plugin/target/it/MWAR-131/verify.bsh>
[INFO] ..SUCCESS (6.1 s)
[INFO] Building: default/pom.xml
[INFO] run script <https://builds.apache.org/job/maven-plugins-ITs-m2/ws/maven-war-plugin/target/it/default/verify.bsh>
[INFO] ..SUCCESS (3.4 s)
[INFO] Building: manifest-content/pom.xml
[INFO] run script <https://builds.apache.org/job/maven-plugins-ITs-m2/ws/maven-war-plugin/target/it/manifest-content/verify.bsh>
[INFO] ..SUCCESS (3.0 s)
[INFO] Building: MWAR-129/pom.xml
[INFO] run script <https://builds.apache.org/job/maven-plugins-ITs-m2/ws/maven-war-plugin/target/it/MWAR-129/verify.bsh>
[INFO] ..SUCCESS (2.4 s)
[INFO] [invoker:verify {execution: integration-test}]
[INFO] -------------------------------------------------
[INFO] Build Summary:
[INFO] Passed: 15, Failed: 0, Errors: 0, Skipped: 0
[INFO] -------------------------------------------------
[INFO] [install:install {execution: default-install}]
[INFO] Installing <https://builds.apache.org/job/maven-plugins-ITs-m2/ws/maven-war-plugin/target/maven-war-plugin-2.4-SNAPSHOT.jar> to /home/jenkins/.m2/repository/org/apache/maven/plugins/maven-war-plugin/2.4-SNAPSHOT/maven-war-plugin-2.4-SNAPSHOT.jar
[INFO] ------------------------------------------------------------------------
[INFO] Building SCM Publish Maven Plugin
[INFO] task-segment: [clean, install]
[INFO] ------------------------------------------------------------------------
[INFO] [clean:clean {execution: default-clean}]
[INFO] Deleting <https://builds.apache.org/job/maven-plugins-ITs-m2/ws/maven-scm-publish-plugin/target>
[INFO] [enforcer:enforce {execution: ensure-no-container-api}]
[INFO] [plugin:helpmojo {execution: generated-helpmojo}]
[INFO] Using 'UTF-8' encoding to read mojo metadata.
[INFO] Applying mojo extractor for language: java
[INFO] Mojo extractor for language: java found 1 mojo descriptors.
[INFO] Applying mojo extractor for language: bsh
[INFO] Mojo extractor for language: bsh found 0 mojo descriptors.
[INFO] Applying mojo extractor for language: java-annotations
[INFO] Mojo extractor for language: java-annotations found 0 mojo descriptors.
[INFO] [plugin:descriptor {execution: default-descriptor}]
[INFO] Using 'UTF-8' encoding to read mojo metadata.
[INFO] Applying mojo extractor for language: java
[INFO] Mojo extractor for language: java found 2 mojo descriptors.
[INFO] Applying mojo extractor for language: bsh
[INFO] Mojo extractor for language: bsh found 0 mojo descriptors.
[INFO] Applying mojo extractor for language: java-annotations
[INFO] Mojo extractor for language: java-annotations found 0 mojo descriptors.
[WARNING] The parameter expression: 'project.build.resources' used in mojo: 'process' has been deprecated. Use 'project.resources' instead.
[INFO] [remote-resources:process {execution: default}]
[debug] execute contextualize
[INFO] [resources:resources {execution: default-resources}]
[INFO] Using 'UTF-8' encoding to copy filtered resources.
[INFO] Copying 2 resources
[INFO] Copying 3 resources
[INFO] [compiler:compile {execution: default-compile}]
[INFO] Compiling 7 source files to <https://builds.apache.org/job/maven-plugins-ITs-m2/ws/maven-scm-publish-plugin/target/classes>
[INFO] [plugin:descriptor {execution: mojo-descriptor}]
[INFO] Using 'UTF-8' encoding to read mojo metadata.
[INFO] Applying mojo extractor for language: java
[INFO] Mojo extractor for language: java found 2 mojo descriptors.
[INFO] Applying mojo extractor for language: bsh
[INFO] Mojo extractor for language: bsh found 0 mojo descriptors.
[INFO] Applying mojo extractor for language: java-annotations
[INFO] Mojo extractor for language: java-annotations found 3 mojo descriptors.
[debug] execute contextualize
[INFO] [resources:testResources {execution: default-testResources}]
[INFO] Using 'UTF-8' encoding to copy filtered resources.
[INFO] skip non existing resourceDirectory <https://builds.apache.org/job/maven-plugins-ITs-m2/ws/maven-scm-publish-plugin/src/test/resources>
[INFO] Copying 3 resources
[INFO] [compiler:testCompile {execution: default-testCompile}]
[INFO] No sources to compile
[INFO] [surefire:test {execution: default-test}]
[INFO] Surefire report directory: <https://builds.apache.org/job/maven-plugins-ITs-m2/ws/maven-scm-publish-plugin/target/surefire-reports>
-------------------------------------------------------
T E S T S
-------------------------------------------------------
Results :
Tests run: 0, Failures: 0, Errors: 0, Skipped: 0
[INFO] [jar:jar {execution: default-jar}]
[INFO] Building jar: <https://builds.apache.org/job/maven-plugins-ITs-m2/ws/maven-scm-publish-plugin/target/maven-scm-publish-plugin-1.0-SNAPSHOT.jar>
[INFO] [plugin:addPluginArtifactMetadata {execution: default-addPluginArtifactMetadata}]
[INFO] [invoker:install {execution: integration-test}]
[INFO] Installing <https://builds.apache.org/job/maven-plugins-ITs-m2/ws/maven-scm-publish-plugin/pom.xml> to <https://builds.apache.org/job/maven-plugins-ITs-m2/ws/maven-scm-publish-plugin/target/local-repo/org/apache/maven/plugins/maven-scm-publish-plugin/1.0-SNAPSHOT/maven-scm-publish-plugin-1.0-SNAPSHOT.pom>
[INFO] Installing <https://builds.apache.org/job/maven-plugins-ITs-m2/ws/maven-scm-publish-plugin/target/maven-scm-publish-plugin-1.0-SNAPSHOT.jar> to <https://builds.apache.org/job/maven-plugins-ITs-m2/ws/maven-scm-publish-plugin/target/local-repo/org/apache/maven/plugins/maven-scm-publish-plugin/1.0-SNAPSHOT/maven-scm-publish-plugin-1.0-SNAPSHOT.jar>
[INFO] [invoker:integration-test {execution: integration-test}]
[INFO] Building: 006-site-multi-module/pom.xml
[INFO] run script setup.bsh
[INFO] ..SUCCESS (23.2 s)
[INFO] Building: 005-site-lifecycle/pom.xml
[INFO] run script setup.bsh
[INFO] ..SUCCESS (18.8 s)
[INFO] Building: 002-perform/pom.xml
[INFO] run script setup.bsh
[INFO] ..SUCCESS (19.0 s)
[INFO] Building: 001-prepare/pom.xml
[INFO] run script setup.bsh
[INFO] ..SUCCESS (5.1 s)
[INFO] Building: 004-publish-scm/pom.xml
[INFO] run script setup.bsh
[INFO] ..SUCCESS (18.9 s)
[INFO] Building: 003-lifecycle/pom.xml
[INFO] run script setup.bsh
[INFO] ..SUCCESS (4.6 s)
[INFO] [invoker:verify {execution: integration-test}]
[INFO] -------------------------------------------------
[INFO] Build Summary:
[INFO] Passed: 6, Failed: 0, Errors: 0, Skipped: 0
[INFO] -------------------------------------------------
[INFO] [install:install {execution: default-install}]
[INFO] Installing <https://builds.apache.org/job/maven-plugins-ITs-m2/ws/maven-scm-publish-plugin/target/maven-scm-publish-plugin-1.0-SNAPSHOT.jar> to /home/jenkins/.m2/repository/org/apache/maven/plugins/maven-scm-publish-plugin/1.0-SNAPSHOT/maven-scm-publish-plugin-1.0-SNAPSHOT.jar
[INFO] ------------------------------------------------------------------------
[INFO] Building Maven Plugins Aggregator
[INFO] task-segment: [clean, install]
[INFO] ------------------------------------------------------------------------
[INFO] [clean:clean {execution: default-clean}]
[INFO] Deleting <https://builds.apache.org/job/maven-plugins-ITs-m2/ws/target>
[INFO] [remote-resources:process {execution: default}]
[INFO] [site:attach-descriptor {execution: default-attach-descriptor}]
[INFO] [install:install {execution: default-install}]
[INFO] Installing <https://builds.apache.org/job/maven-plugins-ITs-m2/ws/pom.xml> to /home/jenkins/.m2/repository/org/apache/maven/plugins/maven-plugins-aggregator/1-SNAPSHOT/maven-plugins-aggregator-1-SNAPSHOT.pom
[INFO]
[INFO]
[INFO] ------------------------------------------------------------------------
[INFO] Reactor Summary:
[INFO] ------------------------------------------------------------------------
[INFO] Maven Plugins ......................................... SUCCESS [14.673s]
[INFO] Maven ACR Plugin ...................................... SUCCESS [32.888s]
[INFO] Maven Ant Plugin ...................................... SUCCESS [1:16.972s]
[INFO] Maven AntRun Plugin ................................... SUCCESS [49.312s]
[INFO] Maven Eclipse Plugin .................................. SUCCESS [7:22.901s]
[INFO] Maven Assembly Plugin ................................. SUCCESS [11:51.152s]
[INFO] Maven Changelog Plugin ................................ FAILED [6.651s]
[INFO] Maven Compiler Plugin ................................. SUCCESS [56.356s]
[INFO] Maven Changes Report Plugin ........................... SUCCESS [1:14.045s]
[INFO] Maven Checkstyle Plugin ............................... SUCCESS [2:05.167s]
[INFO] Maven Clean Plugin .................................... SUCCESS [16.834s]
[INFO] Maven Dependency Plugin ............................... SUCCESS [2:36.104s]
[INFO] Maven Deploy Plugin ................................... SUCCESS [1:03.237s]
[INFO] Maven DOAP Plugin ..................................... SUCCESS [18.567s]
[INFO] Maven Documentation Checker Plugin .................... SUCCESS [7.555s]
[INFO] Maven EAR Plugin ...................................... SUCCESS [3:38.523s]
[INFO] Maven EJB Plugin ...................................... SUCCESS [27.408s]
[INFO] Maven GPG Plugin ...................................... SUCCESS [11.658s]
[INFO] Maven Help Plugin ..................................... SUCCESS [30.325s]
[INFO] Maven IDEA Plugin ..................................... SUCCESS [9.098s]
[INFO] Maven Install Plugin .................................. SUCCESS [37.880s]
[INFO] Maven JAR Plugin ...................................... SUCCESS [1:05.096s]
[INFO] Maven Jarsigner Plugin ................................ SUCCESS [25.994s]
[INFO] Maven Javadoc Plugin .................................. FAILED [1:26.296s]
[INFO] Maven Linkcheck Plugin ................................ SUCCESS [3.124s]
[INFO] Maven One Plugin ...................................... SUCCESS [1.790s]
[INFO] Maven Patch Plugin .................................... SUCCESS [11.995s]
[INFO] Maven PDF Plugin ...................................... SUCCESS [2:12.508s]
[INFO] Maven PMD Plugin ...................................... SUCCESS [45.409s]
[INFO] Maven RAR Plugin ...................................... SUCCESS [11.121s]
[INFO] Maven Reactor Plugin .................................. SUCCESS [3.461s]
[INFO] Maven Repository Plugin ............................... SUCCESS [51.154s]
[INFO] Maven Resources Plugin ................................ SUCCESS [59.152s]
[INFO] Maven Site Plugin 3 ................................... SUCCESS [7:42.071s]
[INFO] Maven Source Plugin ................................... SUCCESS [45.426s]
[INFO] Maven Stage Plugin .................................... SUCCESS [1.897s]
[INFO] Maven Toolchains Plugin ............................... SUCCESS [2.143s]
[INFO] Maven Verifier Plugin ................................. SUCCESS [14.063s]
[INFO] Maven WAR Plugin ...................................... SUCCESS [1:13.668s]
[INFO] SCM Publish Maven Plugin .............................. SUCCESS [1:38.817s]
[INFO] Maven Plugins Aggregator .............................. SUCCESS [1.142s]
[INFO] ------------------------------------------------------------------------
[INFO] Error for project: Maven Changelog Plugin (during install)
[INFO] ------------------------------------------------------------------------
[INFO] There are test failures.
Please refer to <https://builds.apache.org/job/maven-plugins-ITs-m2/ws/maven-changelog-plugin/target/surefire-reports> for the individual test results.
[INFO] ------------------------------------------------------------------------
[INFO] Error for project: Maven Javadoc Plugin (during install)
[INFO] ------------------------------------------------------------------------
[INFO] There are test failures.
Please refer to <https://builds.apache.org/job/maven-plugins-ITs-m2/ws/maven-javadoc-plugin/target/surefire-reports> for the individual test results.
[INFO] ------------------------------------------------------------------------
[INFO] For more information, run Maven with the -e switch
[INFO] ------------------------------------------------------------------------
[INFO] BUILD ERRORS
[INFO] ------------------------------------------------------------------------
[INFO] Total time: 56 minutes 25 seconds
[INFO] Finished at: Fri Sep 28 07:15:35 UTC 2012
[INFO] Final Memory: 281M/1017M
[INFO] ------------------------------------------------------------------------
Build step 'Invoke top-level Maven targets' marked build as failure
Build failed in Jenkins: maven-plugins-ITs-m2 #788
Posted by Apache Jenkins Server <je...@builds.apache.org>.
See <https://builds.apache.org/job/maven-plugins-ITs-m2/788/changes>
Changes:
[dennisl] [MASSEMBLY-629] Explanation of default value for useAllReactorProjects is at best confusing, possibly wrong
The documentation was wrong regarding the default value. I went ahead and removed all "Default value is..." texts I could find from the <description>s. They are already there in the <defaultValue> elements which are generated in the site reference.
------------------------------------------
[...truncated 10112 lines...]
[INFO] Assembling webapp [maven-war-plugin-test] in [<https://builds.apache.org/job/maven-plugins-ITs-m2/ws/maven-war-plugin/target/test-classes/unit/warexplodedmojo/test-dir/ExplodedWarWithFileNameMapping]>
[INFO] Processing war project
[INFO] Copying webapp resources [<https://builds.apache.org/job/maven-plugins-ITs-m2/ws/maven-war-plugin/target/test-classes/unit/warexplodedmojo/test-dir/ExplodedWarWithFileNameMapping-test-data/source]>
[INFO] Webapp assembled in [3 msecs]
[INFO] Exploding webapp
[INFO] Assembling webapp [maven-war-plugin-test] in [<https://builds.apache.org/job/maven-plugins-ITs-m2/ws/maven-war-plugin/target/test-classes/unit/warexplodedmojo/test-dir/ExplodedWarWithFileNameMappingAndDuplicateDependencies]>
[INFO] Processing war project
[INFO] Copying webapp resources [<https://builds.apache.org/job/maven-plugins-ITs-m2/ws/maven-war-plugin/target/test-classes/unit/warexplodedmojo/test-dir/ExplodedWarWithFileNameMappingAndDuplicateDependencies-test-data/source]>
[INFO] Webapp assembled in [3 msecs]
Tests run: 22, Failures: 0, Errors: 0, Skipped: 0, Time elapsed: 1.09 sec
Running org.apache.maven.plugin.war.WarInPlaceMojoTest
[INFO] Generating webapp in source directory [<https://builds.apache.org/job/maven-plugins-ITs-m2/ws/maven-war-plugin/target/test-classes/unit/warexplodedinplacemojo/test-dir/SimpleExplodedInplaceWar-test-data/source]>
[INFO] Assembling webapp [maven-war-plugin-test] in [<https://builds.apache.org/job/maven-plugins-ITs-m2/ws/maven-war-plugin/target/test-classes/unit/warexplodedinplacemojo/test-dir/SimpleExplodedInplaceWar-test-data/source]>
[INFO] Processing war project
[INFO] Copying webapp webResources [<https://builds.apache.org/job/maven-plugins-ITs-m2/ws/maven-war-plugin/target/test-classes/unit/warexplodedinplacemojo/test-dir/resources]> to [<https://builds.apache.org/job/maven-plugins-ITs-m2/ws/maven-war-plugin/target/test-classes/unit/warexplodedinplacemojo/test-dir/SimpleExplodedInplaceWar-test-data/source]>
[INFO] Webapp assembled in [1 msecs]
Tests run: 2, Failures: 0, Errors: 0, Skipped: 0, Time elapsed: 0.071 sec
Results :
Tests run: 85, Failures: 0, Errors: 0, Skipped: 0
[INFO] [jar:jar {execution: default-jar}]
[INFO] Building jar: <https://builds.apache.org/job/maven-plugins-ITs-m2/ws/maven-war-plugin/target/maven-war-plugin-2.3-SNAPSHOT.jar>
[INFO] [plugin:addPluginArtifactMetadata {execution: default-addPluginArtifactMetadata}]
[INFO] [invoker:install {execution: integration-test}]
[INFO] Installing <https://builds.apache.org/job/maven-plugins-ITs-m2/ws/maven-war-plugin/pom.xml> to <https://builds.apache.org/job/maven-plugins-ITs-m2/ws/maven-war-plugin/target/local-repo/org/apache/maven/plugins/maven-war-plugin/2.3-SNAPSHOT/maven-war-plugin-2.3-SNAPSHOT.pom>
[INFO] Installing <https://builds.apache.org/job/maven-plugins-ITs-m2/ws/maven-war-plugin/target/maven-war-plugin-2.3-SNAPSHOT.jar> to <https://builds.apache.org/job/maven-plugins-ITs-m2/ws/maven-war-plugin/target/local-repo/org/apache/maven/plugins/maven-war-plugin/2.3-SNAPSHOT/maven-war-plugin-2.3-SNAPSHOT.jar>
[INFO] [invoker:integration-test {execution: integration-test}]
[INFO] Building: simple-war-project/pom.xml
[INFO] run script <https://builds.apache.org/job/maven-plugins-ITs-m2/ws/maven-war-plugin/target/it/simple-war-project/verify.bsh>
[INFO] ..SUCCESS (3.3 s)
[INFO] Building: MWAR-143/pom.xml
[INFO] run script <https://builds.apache.org/job/maven-plugins-ITs-m2/ws/maven-war-plugin/target/it/MWAR-143/verify.bsh>
[INFO] ..SUCCESS (7.8 s)
[INFO] Building: MWAR-139/pom.xml
[INFO] run script <https://builds.apache.org/job/maven-plugins-ITs-m2/ws/maven-war-plugin/target/it/MWAR-139/verify.bsh>
[INFO] ..SUCCESS (3.1 s)
[INFO] Building: MWAR-133/pom.xml
[INFO] run script <https://builds.apache.org/job/maven-plugins-ITs-m2/ws/maven-war-plugin/target/it/MWAR-133/verify.bsh>
[INFO] ..SUCCESS (2.4 s)
[INFO] Building: scoped-dependency-same-artifact/pom.xml
[INFO] run script <https://builds.apache.org/job/maven-plugins-ITs-m2/ws/maven-war-plugin/target/it/scoped-dependency-same-artifact/verify.bsh>
[INFO] ..SUCCESS (3.3 s)
[INFO] Building: overlay-excludes/pom.xml
[INFO] run script <https://builds.apache.org/job/maven-plugins-ITs-m2/ws/maven-war-plugin/target/it/overlay-excludes/verify.bsh>
[INFO] ..SUCCESS (4.5 s)
[INFO] Building: simple-war-no-webxml/pom.xml
[INFO] run script <https://builds.apache.org/job/maven-plugins-ITs-m2/ws/maven-war-plugin/target/it/simple-war-no-webxml/verify.bsh>
[INFO] ..SUCCESS (3.1 s)
[INFO] Building: MWAR-62/pom.xml
[INFO] run script <https://builds.apache.org/job/maven-plugins-ITs-m2/ws/maven-war-plugin/target/it/MWAR-62/verify.bsh>
[INFO] ..SUCCESS (2.4 s)
[INFO] Building: web-resources-filtering/pom.xml
[INFO] run script <https://builds.apache.org/job/maven-plugins-ITs-m2/ws/maven-war-plugin/target/it/web-resources-filtering/verify.bsh>
[INFO] ..SUCCESS (3.9 s)
[INFO] Building: MWAR-96/pom.xml
[INFO] run script <https://builds.apache.org/job/maven-plugins-ITs-m2/ws/maven-war-plugin/target/it/MWAR-96/verify.bsh>
[INFO] ..SUCCESS (3.1 s)
[INFO] Building: MWAR-240/pom.xml
[INFO] run script <https://builds.apache.org/job/maven-plugins-ITs-m2/ws/maven-war-plugin/target/it/MWAR-240/verify.bsh>
[INFO] ..SUCCESS (3.4 s)
[INFO] Building: MWAR-131/pom.xml
[INFO] run script <https://builds.apache.org/job/maven-plugins-ITs-m2/ws/maven-war-plugin/target/it/MWAR-131/verify.bsh>
[INFO] ..SUCCESS (6.1 s)
[INFO] Building: default/pom.xml
[INFO] run script <https://builds.apache.org/job/maven-plugins-ITs-m2/ws/maven-war-plugin/target/it/default/verify.bsh>
[INFO] ..SUCCESS (3.3 s)
[INFO] Building: manifest-content/pom.xml
[INFO] run script <https://builds.apache.org/job/maven-plugins-ITs-m2/ws/maven-war-plugin/target/it/manifest-content/verify.bsh>
[INFO] ..SUCCESS (3.0 s)
[INFO] Building: MWAR-129/pom.xml
[INFO] run script <https://builds.apache.org/job/maven-plugins-ITs-m2/ws/maven-war-plugin/target/it/MWAR-129/verify.bsh>
[INFO] ..SUCCESS (2.4 s)
[INFO] [invoker:verify {execution: integration-test}]
[INFO] -------------------------------------------------
[INFO] Build Summary:
[INFO] Passed: 15, Failed: 0, Errors: 0, Skipped: 0
[INFO] -------------------------------------------------
[INFO] [install:install {execution: default-install}]
[INFO] Installing <https://builds.apache.org/job/maven-plugins-ITs-m2/ws/maven-war-plugin/target/maven-war-plugin-2.3-SNAPSHOT.jar> to /home/jenkins/.m2/repository/org/apache/maven/plugins/maven-war-plugin/2.3-SNAPSHOT/maven-war-plugin-2.3-SNAPSHOT.jar
[INFO] ------------------------------------------------------------------------
[INFO] Building SCM Publish Maven Plugin
[INFO] task-segment: [clean, install]
[INFO] ------------------------------------------------------------------------
[INFO] [clean:clean {execution: default-clean}]
[INFO] Deleting <https://builds.apache.org/job/maven-plugins-ITs-m2/ws/maven-scm-publish-plugin/target>
[INFO] [enforcer:enforce {execution: ensure-no-container-api}]
[INFO] [plugin:helpmojo {execution: generated-helpmojo}]
[INFO] Using 'UTF-8' encoding to read mojo metadata.
[INFO] Applying mojo extractor for language: java
[INFO] Mojo extractor for language: java found 1 mojo descriptors.
[INFO] Applying mojo extractor for language: bsh
[INFO] Mojo extractor for language: bsh found 0 mojo descriptors.
[INFO] Applying mojo extractor for language: java-annotations
[INFO] Mojo extractor for language: java-annotations found 0 mojo descriptors.
[INFO] [plugin:descriptor {execution: default-descriptor}]
[INFO] Using 'UTF-8' encoding to read mojo metadata.
[INFO] Applying mojo extractor for language: java
[INFO] Mojo extractor for language: java found 2 mojo descriptors.
[INFO] Applying mojo extractor for language: bsh
[INFO] Mojo extractor for language: bsh found 0 mojo descriptors.
[INFO] Applying mojo extractor for language: java-annotations
[INFO] Mojo extractor for language: java-annotations found 0 mojo descriptors.
[WARNING] The parameter expression: 'project.build.resources' used in mojo: 'process' has been deprecated. Use 'project.resources' instead.
[INFO] [remote-resources:process {execution: default}]
[debug] execute contextualize
[INFO] [resources:resources {execution: default-resources}]
[INFO] Using 'UTF-8' encoding to copy filtered resources.
[INFO] Copying 2 resources
[INFO] Copying 3 resources
[INFO] [compiler:compile {execution: default-compile}]
[INFO] Compiling 7 source files to <https://builds.apache.org/job/maven-plugins-ITs-m2/ws/maven-scm-publish-plugin/target/classes>
[INFO] [plugin:descriptor {execution: mojo-descriptor}]
[INFO] Using 'UTF-8' encoding to read mojo metadata.
[INFO] Applying mojo extractor for language: java
[INFO] Mojo extractor for language: java found 2 mojo descriptors.
[INFO] Applying mojo extractor for language: bsh
[INFO] Mojo extractor for language: bsh found 0 mojo descriptors.
[INFO] Applying mojo extractor for language: java-annotations
[INFO] Mojo extractor for language: java-annotations found 3 mojo descriptors.
[debug] execute contextualize
[INFO] [resources:testResources {execution: default-testResources}]
[INFO] Using 'UTF-8' encoding to copy filtered resources.
[INFO] skip non existing resourceDirectory <https://builds.apache.org/job/maven-plugins-ITs-m2/ws/maven-scm-publish-plugin/src/test/resources>
[INFO] Copying 3 resources
[INFO] [compiler:testCompile {execution: default-testCompile}]
[INFO] No sources to compile
[INFO] [surefire:test {execution: default-test}]
[INFO] Surefire report directory: <https://builds.apache.org/job/maven-plugins-ITs-m2/ws/maven-scm-publish-plugin/target/surefire-reports>
-------------------------------------------------------
T E S T S
-------------------------------------------------------
Results :
Tests run: 0, Failures: 0, Errors: 0, Skipped: 0
[INFO] [jar:jar {execution: default-jar}]
[INFO] Building jar: <https://builds.apache.org/job/maven-plugins-ITs-m2/ws/maven-scm-publish-plugin/target/maven-scm-publish-plugin-1.0-SNAPSHOT.jar>
[INFO] [plugin:addPluginArtifactMetadata {execution: default-addPluginArtifactMetadata}]
[INFO] [invoker:install {execution: integration-test}]
[INFO] Installing <https://builds.apache.org/job/maven-plugins-ITs-m2/ws/maven-scm-publish-plugin/pom.xml> to <https://builds.apache.org/job/maven-plugins-ITs-m2/ws/maven-scm-publish-plugin/target/local-repo/org/apache/maven/plugins/maven-scm-publish-plugin/1.0-SNAPSHOT/maven-scm-publish-plugin-1.0-SNAPSHOT.pom>
[INFO] Installing <https://builds.apache.org/job/maven-plugins-ITs-m2/ws/maven-scm-publish-plugin/target/maven-scm-publish-plugin-1.0-SNAPSHOT.jar> to <https://builds.apache.org/job/maven-plugins-ITs-m2/ws/maven-scm-publish-plugin/target/local-repo/org/apache/maven/plugins/maven-scm-publish-plugin/1.0-SNAPSHOT/maven-scm-publish-plugin-1.0-SNAPSHOT.jar>
[INFO] [invoker:integration-test {execution: integration-test}]
[INFO] Building: 006-site-multi-module/pom.xml
[INFO] run script setup.bsh
[INFO] ..SUCCESS (22.2 s)
[INFO] Building: 005-site-lifecycle/pom.xml
[INFO] run script setup.bsh
[INFO] ..SUCCESS (18.9 s)
[INFO] Building: 002-perform/pom.xml
[INFO] run script setup.bsh
[INFO] ..SUCCESS (19.0 s)
[INFO] Building: 001-prepare/pom.xml
[INFO] run script setup.bsh
[INFO] ..SUCCESS (5.1 s)
[INFO] Building: 004-publish-scm/pom.xml
[INFO] run script setup.bsh
[INFO] ..SUCCESS (18.9 s)
[INFO] Building: 003-lifecycle/pom.xml
[INFO] run script setup.bsh
[INFO] ..SUCCESS (4.6 s)
[INFO] [invoker:verify {execution: integration-test}]
[INFO] -------------------------------------------------
[INFO] Build Summary:
[INFO] Passed: 6, Failed: 0, Errors: 0, Skipped: 0
[INFO] -------------------------------------------------
[INFO] [install:install {execution: default-install}]
[INFO] Installing <https://builds.apache.org/job/maven-plugins-ITs-m2/ws/maven-scm-publish-plugin/target/maven-scm-publish-plugin-1.0-SNAPSHOT.jar> to /home/jenkins/.m2/repository/org/apache/maven/plugins/maven-scm-publish-plugin/1.0-SNAPSHOT/maven-scm-publish-plugin-1.0-SNAPSHOT.jar
[INFO] ------------------------------------------------------------------------
[INFO] Building Maven Plugins Aggregator
[INFO] task-segment: [clean, install]
[INFO] ------------------------------------------------------------------------
[INFO] [clean:clean {execution: default-clean}]
[INFO] Deleting <https://builds.apache.org/job/maven-plugins-ITs-m2/ws/target>
[INFO] [remote-resources:process {execution: default}]
[INFO] [site:attach-descriptor {execution: default-attach-descriptor}]
[INFO] [install:install {execution: default-install}]
[INFO] Installing <https://builds.apache.org/job/maven-plugins-ITs-m2/ws/pom.xml> to /home/jenkins/.m2/repository/org/apache/maven/plugins/maven-plugins-aggregator/1-SNAPSHOT/maven-plugins-aggregator-1-SNAPSHOT.pom
[INFO]
[INFO]
[INFO] ------------------------------------------------------------------------
[INFO] Reactor Summary:
[INFO] ------------------------------------------------------------------------
[INFO] Maven Plugins ......................................... SUCCESS [8.767s]
[INFO] Maven ACR Plugin ...................................... SUCCESS [27.612s]
[INFO] Maven Ant Plugin ...................................... SUCCESS [1:05.826s]
[INFO] Maven AntRun Plugin ................................... SUCCESS [54.027s]
[INFO] Maven Eclipse Plugin .................................. SUCCESS [6:43.189s]
[INFO] Maven Assembly Plugin ................................. SUCCESS [11:33.396s]
[INFO] Maven Changelog Plugin ................................ FAILED [6.585s]
[INFO] Maven Compiler Plugin ................................. SUCCESS [51.950s]
[INFO] Maven Changes Report Plugin ........................... SUCCESS [1:15.403s]
[INFO] Maven Checkstyle Plugin ............................... SUCCESS [2:00.034s]
[INFO] Maven Clean Plugin .................................... SUCCESS [16.298s]
[INFO] Maven Dependency Plugin ............................... SUCCESS [2:37.677s]
[INFO] Maven Deploy Plugin ................................... SUCCESS [57.520s]
[INFO] Maven DOAP Plugin ..................................... SUCCESS [17.799s]
[INFO] Maven Documentation Checker Plugin .................... SUCCESS [7.265s]
[INFO] Maven EAR Plugin ...................................... SUCCESS [3:39.988s]
[INFO] Maven EJB Plugin ...................................... SUCCESS [27.453s]
[INFO] Maven GPG Plugin ...................................... SUCCESS [10.505s]
[INFO] Maven Help Plugin ..................................... SUCCESS [29.925s]
[INFO] Maven IDEA Plugin ..................................... SUCCESS [8.851s]
[INFO] Maven Install Plugin .................................. SUCCESS [38.275s]
[INFO] Maven JAR Plugin ...................................... SUCCESS [1:04.008s]
[INFO] Maven Jarsigner Plugin ................................ SUCCESS [24.738s]
[INFO] Maven Javadoc Plugin .................................. FAILED [1:18.342s]
[INFO] Maven Linkcheck Plugin ................................ SUCCESS [2.656s]
[INFO] Maven One Plugin ...................................... SUCCESS [1.685s]
[INFO] Maven Patch Plugin .................................... SUCCESS [11.271s]
[INFO] Maven PDF Plugin ...................................... SUCCESS [40.642s]
[INFO] Maven PMD Plugin ...................................... SUCCESS [44.166s]
[INFO] Maven RAR Plugin ...................................... SUCCESS [10.620s]
[INFO] Maven Reactor Plugin .................................. SUCCESS [2.647s]
[INFO] Maven Repository Plugin ............................... SUCCESS [41.739s]
[INFO] Maven Resources Plugin ................................ SUCCESS [57.207s]
[INFO] Maven Site Plugin 3 ................................... SUCCESS [7:19.353s]
[INFO] Maven Source Plugin ................................... SUCCESS [45.788s]
[INFO] Maven Stage Plugin .................................... SUCCESS [2.050s]
[INFO] Maven Toolchains Plugin ............................... SUCCESS [2.330s]
[INFO] Maven Verifier Plugin ................................. SUCCESS [13.873s]
[INFO] Maven WAR Plugin ...................................... SUCCESS [1:16.347s]
[INFO] SCM Publish Maven Plugin .............................. SUCCESS [1:40.354s]
[INFO] Maven Plugins Aggregator .............................. SUCCESS [1.063s]
[INFO] ------------------------------------------------------------------------
[INFO] Error for project: Maven Changelog Plugin (during install)
[INFO] ------------------------------------------------------------------------
[INFO] There are test failures.
Please refer to <https://builds.apache.org/job/maven-plugins-ITs-m2/ws/maven-changelog-plugin/target/surefire-reports> for the individual test results.
[INFO] ------------------------------------------------------------------------
[INFO] Error for project: Maven Javadoc Plugin (during install)
[INFO] ------------------------------------------------------------------------
[INFO] There are test failures.
Please refer to <https://builds.apache.org/job/maven-plugins-ITs-m2/ws/maven-javadoc-plugin/target/surefire-reports> for the individual test results.
[INFO] ------------------------------------------------------------------------
[INFO] For more information, run Maven with the -e switch
[INFO] ------------------------------------------------------------------------
[INFO] BUILD ERRORS
[INFO] ------------------------------------------------------------------------
[INFO] Total time: 52 minutes 40 seconds
[INFO] Finished at: Thu Sep 27 22:09:41 UTC 2012
[INFO] Final Memory: 280M/1018M
[INFO] ------------------------------------------------------------------------
Build step 'Invoke top-level Maven targets' marked build as failure
Build failed in Jenkins: maven-plugins-ITs-m2 #787
Posted by Apache Jenkins Server <je...@builds.apache.org>.
See <https://builds.apache.org/job/maven-plugins-ITs-m2/787/changes>
Changes:
[krosenvold] [MWAR-292] Added flag recompressZippedFiles
------------------------------------------
[...truncated 10137 lines...]
[INFO] Webapp assembled in [15 msecs]
line system_key_1=<https://builds.apache.org/job/maven-plugins-ITs-m2/ws/maven-war-plugin>
need <https://builds.apache.org/job/maven-plugins-ITs-m2/ws/maven-war-plugin>
line system_key_2=<https://builds.apache.org/job/maven-plugins-ITs-m2/ws/maven-war-plugin>
[INFO] Exploding webapp
[INFO] Assembling webapp [maven-war-plugin-test] in [<https://builds.apache.org/job/maven-plugins-ITs-m2/ws/maven-war-plugin/target/test-classes/unit/warexplodedmojo/test-dir/ExplodedWar_WithResourceFiltering]>
[INFO] Processing war project
[INFO] Copying webapp webResources [<https://builds.apache.org/job/maven-plugins-ITs-m2/ws/maven-war-plugin/target/test-classes/unit/warexplodedmojo/test-dir/ExplodedWar_WithResourceFiltering-test-data/resources]> to [<https://builds.apache.org/job/maven-plugins-ITs-m2/ws/maven-war-plugin/target/test-classes/unit/warexplodedmojo/test-dir/ExplodedWar_WithResourceFiltering]>
[INFO] Copying webapp resources [<https://builds.apache.org/job/maven-plugins-ITs-m2/ws/maven-war-plugin/target/test-classes/unit/warexplodedmojo/test-dir/ExplodedWar_WithResourceFiltering-test-data/source]>
[INFO] Webapp assembled in [4 msecs]
[INFO] Exploding webapp
[INFO] Assembling webapp [maven-war-plugin-test] in [<https://builds.apache.org/job/maven-plugins-ITs-m2/ws/maven-war-plugin/target/test-classes/unit/warexplodedmojo/test-dir/ExplodedWar_WithResourceFiltering]>
[INFO] Processing war project
[INFO] Copying webapp webResources [<https://builds.apache.org/job/maven-plugins-ITs-m2/ws/maven-war-plugin/target/test-classes/unit/warexplodedmojo/test-dir/ExplodedWar_WithResourceFiltering-test-data/resources]> to [<https://builds.apache.org/job/maven-plugins-ITs-m2/ws/maven-war-plugin/target/test-classes/unit/warexplodedmojo/test-dir/ExplodedWar_WithResourceFiltering]>
[INFO] Copying webapp resources [<https://builds.apache.org/job/maven-plugins-ITs-m2/ws/maven-war-plugin/target/test-classes/unit/warexplodedmojo/test-dir/ExplodedWar_WithResourceFiltering-test-data/source]>
[INFO] Webapp assembled in [6 msecs]
Tests run: 1, Failures: 0, Errors: 0, Skipped: 0, Time elapsed: 0.065 sec
Results :
Tests run: 85, Failures: 0, Errors: 0, Skipped: 0
[INFO] [jar:jar {execution: default-jar}]
[INFO] Building jar: <https://builds.apache.org/job/maven-plugins-ITs-m2/ws/maven-war-plugin/target/maven-war-plugin-2.3-SNAPSHOT.jar>
[INFO] [plugin:addPluginArtifactMetadata {execution: default-addPluginArtifactMetadata}]
[INFO] [invoker:install {execution: integration-test}]
[INFO] Installing <https://builds.apache.org/job/maven-plugins-ITs-m2/ws/maven-war-plugin/pom.xml> to <https://builds.apache.org/job/maven-plugins-ITs-m2/ws/maven-war-plugin/target/local-repo/org/apache/maven/plugins/maven-war-plugin/2.3-SNAPSHOT/maven-war-plugin-2.3-SNAPSHOT.pom>
[INFO] Installing <https://builds.apache.org/job/maven-plugins-ITs-m2/ws/maven-war-plugin/target/maven-war-plugin-2.3-SNAPSHOT.jar> to <https://builds.apache.org/job/maven-plugins-ITs-m2/ws/maven-war-plugin/target/local-repo/org/apache/maven/plugins/maven-war-plugin/2.3-SNAPSHOT/maven-war-plugin-2.3-SNAPSHOT.jar>
[INFO] [invoker:integration-test {execution: integration-test}]
[INFO] Building: scoped-dependency-same-artifact/pom.xml
[INFO] run script <https://builds.apache.org/job/maven-plugins-ITs-m2/ws/maven-war-plugin/target/it/scoped-dependency-same-artifact/verify.bsh>
[INFO] ..SUCCESS (3.4 s)
[INFO] Building: MWAR-96/pom.xml
[INFO] run script <https://builds.apache.org/job/maven-plugins-ITs-m2/ws/maven-war-plugin/target/it/MWAR-96/verify.bsh>
[INFO] ..SUCCESS (2.9 s)
[INFO] Building: MWAR-240/pom.xml
[INFO] run script <https://builds.apache.org/job/maven-plugins-ITs-m2/ws/maven-war-plugin/target/it/MWAR-240/verify.bsh>
[INFO] ..SUCCESS (3.3 s)
[INFO] Building: simple-war-no-webxml/pom.xml
[INFO] run script <https://builds.apache.org/job/maven-plugins-ITs-m2/ws/maven-war-plugin/target/it/simple-war-no-webxml/verify.bsh>
[INFO] ..SUCCESS (3.0 s)
[INFO] Building: MWAR-131/pom.xml
[INFO] run script <https://builds.apache.org/job/maven-plugins-ITs-m2/ws/maven-war-plugin/target/it/MWAR-131/verify.bsh>
[INFO] ..SUCCESS (6.7 s)
[INFO] Building: overlay-excludes/pom.xml
[INFO] run script <https://builds.apache.org/job/maven-plugins-ITs-m2/ws/maven-war-plugin/target/it/overlay-excludes/verify.bsh>
[INFO] ..SUCCESS (4.2 s)
[INFO] Building: MWAR-133/pom.xml
[INFO] run script <https://builds.apache.org/job/maven-plugins-ITs-m2/ws/maven-war-plugin/target/it/MWAR-133/verify.bsh>
[INFO] ..SUCCESS (2.4 s)
[INFO] Building: MWAR-129/pom.xml
[INFO] run script <https://builds.apache.org/job/maven-plugins-ITs-m2/ws/maven-war-plugin/target/it/MWAR-129/verify.bsh>
[INFO] ..SUCCESS (2.3 s)
[INFO] Building: manifest-content/pom.xml
[INFO] run script <https://builds.apache.org/job/maven-plugins-ITs-m2/ws/maven-war-plugin/target/it/manifest-content/verify.bsh>
[INFO] ..SUCCESS (2.9 s)
[INFO] Building: MWAR-62/pom.xml
[INFO] run script <https://builds.apache.org/job/maven-plugins-ITs-m2/ws/maven-war-plugin/target/it/MWAR-62/verify.bsh>
[INFO] ..SUCCESS (2.5 s)
[INFO] Building: default/pom.xml
[INFO] run script <https://builds.apache.org/job/maven-plugins-ITs-m2/ws/maven-war-plugin/target/it/default/verify.bsh>
[INFO] ..SUCCESS (4.0 s)
[INFO] Building: MWAR-143/pom.xml
[INFO] run script <https://builds.apache.org/job/maven-plugins-ITs-m2/ws/maven-war-plugin/target/it/MWAR-143/verify.bsh>
[INFO] ..SUCCESS (7.4 s)
[INFO] Building: web-resources-filtering/pom.xml
[INFO] run script <https://builds.apache.org/job/maven-plugins-ITs-m2/ws/maven-war-plugin/target/it/web-resources-filtering/verify.bsh>
[INFO] ..SUCCESS (3.9 s)
[INFO] Building: simple-war-project/pom.xml
[INFO] run script <https://builds.apache.org/job/maven-plugins-ITs-m2/ws/maven-war-plugin/target/it/simple-war-project/verify.bsh>
[INFO] ..SUCCESS (3.1 s)
[INFO] Building: MWAR-139/pom.xml
[INFO] run script <https://builds.apache.org/job/maven-plugins-ITs-m2/ws/maven-war-plugin/target/it/MWAR-139/verify.bsh>
[INFO] ..SUCCESS (3.4 s)
[INFO] [invoker:verify {execution: integration-test}]
[INFO] -------------------------------------------------
[INFO] Build Summary:
[INFO] Passed: 15, Failed: 0, Errors: 0, Skipped: 0
[INFO] -------------------------------------------------
[INFO] [install:install {execution: default-install}]
[INFO] Installing <https://builds.apache.org/job/maven-plugins-ITs-m2/ws/maven-war-plugin/target/maven-war-plugin-2.3-SNAPSHOT.jar> to /home/hudson/.m2/repository/org/apache/maven/plugins/maven-war-plugin/2.3-SNAPSHOT/maven-war-plugin-2.3-SNAPSHOT.jar
[INFO] ------------------------------------------------------------------------
[INFO] Building SCM Publish Maven Plugin
[INFO] task-segment: [clean, install]
[INFO] ------------------------------------------------------------------------
[INFO] [clean:clean {execution: default-clean}]
[INFO] Deleting <https://builds.apache.org/job/maven-plugins-ITs-m2/ws/maven-scm-publish-plugin/target>
[INFO] [enforcer:enforce {execution: ensure-no-container-api}]
[INFO] [plugin:helpmojo {execution: generated-helpmojo}]
[INFO] Using 'UTF-8' encoding to read mojo metadata.
[INFO] Applying mojo extractor for language: java
[INFO] Mojo extractor for language: java found 1 mojo descriptors.
[INFO] Applying mojo extractor for language: bsh
[INFO] Mojo extractor for language: bsh found 0 mojo descriptors.
[INFO] Applying mojo extractor for language: java-annotations
[INFO] Mojo extractor for language: java-annotations found 0 mojo descriptors.
[INFO] [plugin:descriptor {execution: default-descriptor}]
[INFO] Using 'UTF-8' encoding to read mojo metadata.
[INFO] Applying mojo extractor for language: java
[INFO] Mojo extractor for language: java found 2 mojo descriptors.
[INFO] Applying mojo extractor for language: bsh
[INFO] Mojo extractor for language: bsh found 0 mojo descriptors.
[INFO] Applying mojo extractor for language: java-annotations
[INFO] Mojo extractor for language: java-annotations found 0 mojo descriptors.
[WARNING] The parameter expression: 'project.build.resources' used in mojo: 'process' has been deprecated. Use 'project.resources' instead.
[INFO] [remote-resources:process {execution: default}]
[debug] execute contextualize
[INFO] [resources:resources {execution: default-resources}]
[INFO] Using 'UTF-8' encoding to copy filtered resources.
[INFO] Copying 2 resources
[INFO] Copying 3 resources
[INFO] [compiler:compile {execution: default-compile}]
[INFO] Compiling 7 source files to <https://builds.apache.org/job/maven-plugins-ITs-m2/ws/maven-scm-publish-plugin/target/classes>
[INFO] [plugin:descriptor {execution: mojo-descriptor}]
[INFO] Using 'UTF-8' encoding to read mojo metadata.
[INFO] Applying mojo extractor for language: java
[INFO] Mojo extractor for language: java found 2 mojo descriptors.
[INFO] Applying mojo extractor for language: bsh
[INFO] Mojo extractor for language: bsh found 0 mojo descriptors.
[INFO] Applying mojo extractor for language: java-annotations
[INFO] Mojo extractor for language: java-annotations found 3 mojo descriptors.
[debug] execute contextualize
[INFO] [resources:testResources {execution: default-testResources}]
[INFO] Using 'UTF-8' encoding to copy filtered resources.
[INFO] skip non existing resourceDirectory <https://builds.apache.org/job/maven-plugins-ITs-m2/ws/maven-scm-publish-plugin/src/test/resources>
[INFO] Copying 3 resources
[INFO] [compiler:testCompile {execution: default-testCompile}]
[INFO] No sources to compile
[INFO] [surefire:test {execution: default-test}]
[INFO] Surefire report directory: <https://builds.apache.org/job/maven-plugins-ITs-m2/ws/maven-scm-publish-plugin/target/surefire-reports>
-------------------------------------------------------
T E S T S
-------------------------------------------------------
Results :
Tests run: 0, Failures: 0, Errors: 0, Skipped: 0
[INFO] [jar:jar {execution: default-jar}]
[INFO] Building jar: <https://builds.apache.org/job/maven-plugins-ITs-m2/ws/maven-scm-publish-plugin/target/maven-scm-publish-plugin-1.0-SNAPSHOT.jar>
[INFO] [plugin:addPluginArtifactMetadata {execution: default-addPluginArtifactMetadata}]
[INFO] [invoker:install {execution: integration-test}]
[INFO] Installing <https://builds.apache.org/job/maven-plugins-ITs-m2/ws/maven-scm-publish-plugin/pom.xml> to <https://builds.apache.org/job/maven-plugins-ITs-m2/ws/maven-scm-publish-plugin/target/local-repo/org/apache/maven/plugins/maven-scm-publish-plugin/1.0-SNAPSHOT/maven-scm-publish-plugin-1.0-SNAPSHOT.pom>
[INFO] Installing <https://builds.apache.org/job/maven-plugins-ITs-m2/ws/maven-scm-publish-plugin/target/maven-scm-publish-plugin-1.0-SNAPSHOT.jar> to <https://builds.apache.org/job/maven-plugins-ITs-m2/ws/maven-scm-publish-plugin/target/local-repo/org/apache/maven/plugins/maven-scm-publish-plugin/1.0-SNAPSHOT/maven-scm-publish-plugin-1.0-SNAPSHOT.jar>
[INFO] [invoker:integration-test {execution: integration-test}]
[INFO] Building: 003-lifecycle/pom.xml
[INFO] run script setup.bsh
[INFO] ..SUCCESS (18.3 s)
[INFO] Building: 004-publish-scm/pom.xml
[INFO] run script setup.bsh
[INFO] ..SUCCESS (33.7 s)
[INFO] Building: 005-site-lifecycle/pom.xml
[INFO] run script setup.bsh
[INFO] ..SUCCESS (27.0 s)
[INFO] Building: 001-prepare/pom.xml
[INFO] run script setup.bsh
[INFO] ..SUCCESS (14.0 s)
[INFO] Building: 006-site-multi-module/pom.xml
[INFO] run script setup.bsh
[INFO] ..SUCCESS (28.0 s)
[INFO] Building: 002-perform/pom.xml
[INFO] run script setup.bsh
[INFO] ..SUCCESS (23.9 s)
[INFO] [invoker:verify {execution: integration-test}]
[INFO] -------------------------------------------------
[INFO] Build Summary:
[INFO] Passed: 6, Failed: 0, Errors: 0, Skipped: 0
[INFO] -------------------------------------------------
[INFO] [install:install {execution: default-install}]
[INFO] Installing <https://builds.apache.org/job/maven-plugins-ITs-m2/ws/maven-scm-publish-plugin/target/maven-scm-publish-plugin-1.0-SNAPSHOT.jar> to /home/hudson/.m2/repository/org/apache/maven/plugins/maven-scm-publish-plugin/1.0-SNAPSHOT/maven-scm-publish-plugin-1.0-SNAPSHOT.jar
[INFO] ------------------------------------------------------------------------
[INFO] Building Maven Plugins Aggregator
[INFO] task-segment: [clean, install]
[INFO] ------------------------------------------------------------------------
[INFO] [clean:clean {execution: default-clean}]
[INFO] Deleting <https://builds.apache.org/job/maven-plugins-ITs-m2/ws/target>
[INFO] [remote-resources:process {execution: default}]
[INFO] [site:attach-descriptor {execution: default-attach-descriptor}]
[INFO] [install:install {execution: default-install}]
[INFO] Installing <https://builds.apache.org/job/maven-plugins-ITs-m2/ws/pom.xml> to /home/hudson/.m2/repository/org/apache/maven/plugins/maven-plugins-aggregator/1-SNAPSHOT/maven-plugins-aggregator-1-SNAPSHOT.pom
[INFO]
[INFO]
[INFO] ------------------------------------------------------------------------
[INFO] Reactor Summary:
[INFO] ------------------------------------------------------------------------
[INFO] Maven Plugins ......................................... SUCCESS [22.416s]
[INFO] Maven ACR Plugin ...................................... SUCCESS [57.677s]
[INFO] Maven Ant Plugin ...................................... SUCCESS [1:03.318s]
[INFO] Maven AntRun Plugin ................................... SUCCESS [49.959s]
[INFO] Maven Eclipse Plugin .................................. SUCCESS [7:03.695s]
[INFO] Maven Assembly Plugin ................................. SUCCESS [12:05.800s]
[INFO] Maven Changelog Plugin ................................ FAILED [7.928s]
[INFO] Maven Compiler Plugin ................................. SUCCESS [56.009s]
[INFO] Maven Changes Report Plugin ........................... SUCCESS [1:21.496s]
[INFO] Maven Checkstyle Plugin ............................... SUCCESS [1:53.343s]
[INFO] Maven Clean Plugin .................................... SUCCESS [15.519s]
[INFO] Maven Dependency Plugin ............................... SUCCESS [2:37.238s]
[INFO] Maven Deploy Plugin ................................... SUCCESS [1:06.868s]
[INFO] Maven DOAP Plugin ..................................... SUCCESS [17.543s]
[INFO] Maven Documentation Checker Plugin .................... SUCCESS [6.318s]
[INFO] Maven EAR Plugin ...................................... SUCCESS [3:41.371s]
[INFO] Maven EJB Plugin ...................................... SUCCESS [28.085s]
[INFO] Maven GPG Plugin ...................................... SUCCESS [9.768s]
[INFO] Maven Help Plugin ..................................... SUCCESS [33.401s]
[INFO] Maven IDEA Plugin ..................................... SUCCESS [11.568s]
[INFO] Maven Install Plugin .................................. SUCCESS [39.743s]
[INFO] Maven JAR Plugin ...................................... SUCCESS [1:04.686s]
[INFO] Maven Jarsigner Plugin ................................ SUCCESS [25.636s]
[INFO] Maven Javadoc Plugin .................................. FAILED [1:19.637s]
[INFO] Maven Linkcheck Plugin ................................ SUCCESS [3.639s]
[INFO] Maven One Plugin ...................................... SUCCESS [2.110s]
[INFO] Maven Patch Plugin .................................... SUCCESS [11.378s]
[INFO] Maven PDF Plugin ...................................... SUCCESS [45.286s]
[INFO] Maven PMD Plugin ...................................... SUCCESS [52.038s]
[INFO] Maven RAR Plugin ...................................... SUCCESS [13.390s]
[INFO] Maven Reactor Plugin .................................. SUCCESS [2.704s]
[INFO] Maven Repository Plugin ............................... SUCCESS [43.427s]
[INFO] Maven Resources Plugin ................................ SUCCESS [57.997s]
[INFO] Maven Site Plugin 3 ................................... SUCCESS [7:10.347s]
[INFO] Maven Source Plugin ................................... SUCCESS [48.821s]
[INFO] Maven Stage Plugin .................................... SUCCESS [2.997s]
[INFO] Maven Toolchains Plugin ............................... SUCCESS [2.479s]
[INFO] Maven Verifier Plugin ................................. SUCCESS [19.742s]
[INFO] Maven WAR Plugin ...................................... SUCCESS [1:24.303s]
[INFO] SCM Publish Maven Plugin .............................. SUCCESS [2:38.321s]
[INFO] Maven Plugins Aggregator .............................. SUCCESS [1.083s]
[INFO] ------------------------------------------------------------------------
[INFO] Error for project: Maven Changelog Plugin (during install)
[INFO] ------------------------------------------------------------------------
[INFO] There are test failures.
Please refer to <https://builds.apache.org/job/maven-plugins-ITs-m2/ws/maven-changelog-plugin/target/surefire-reports> for the individual test results.
[INFO] ------------------------------------------------------------------------
[INFO] Error for project: Maven Javadoc Plugin (during install)
[INFO] ------------------------------------------------------------------------
[INFO] There are test failures.
Please refer to <https://builds.apache.org/job/maven-plugins-ITs-m2/ws/maven-javadoc-plugin/target/surefire-reports> for the individual test results.
[INFO] ------------------------------------------------------------------------
[INFO] For more information, run Maven with the -e switch
[INFO] ------------------------------------------------------------------------
[INFO] BUILD ERRORS
[INFO] ------------------------------------------------------------------------
[INFO] Total time: 56 minutes 11 seconds
[INFO] Finished at: Thu Sep 27 21:04:17 UTC 2012
[INFO] Final Memory: 280M/1018M
[INFO] ------------------------------------------------------------------------
Build step 'Invoke top-level Maven targets' marked build as failure