You are viewing a plain text version of this content. The canonical link for it is here.
Posted to dev@lucene.apache.org by Apache Jenkins Server <je...@builds.apache.org> on 2016/01/14 03:21:46 UTC

[JENKINS-MAVEN] Lucene-Solr-Maven-5.3 #13: POMs out of sync

Build: https://builds.apache.org/job/Lucene-Solr-Maven-5.3/13/

No tests ran.

Build Log:
[...truncated 26171 lines...]
BUILD FAILED
/x1/jenkins/jenkins-slave/workspace/Lucene-Solr-Maven-5.3/build.xml:742: The following error occurred while executing this line:
/x1/jenkins/jenkins-slave/workspace/Lucene-Solr-Maven-5.3/build.xml:231: The following error occurred while executing this line:
/x1/jenkins/jenkins-slave/workspace/Lucene-Solr-Maven-5.3/lucene/build.xml:415: The following error occurred while executing this line:
/x1/jenkins/jenkins-slave/workspace/Lucene-Solr-Maven-5.3/lucene/common-build.xml:2245: The following error occurred while executing this line:
/x1/jenkins/jenkins-slave/workspace/Lucene-Solr-Maven-5.3/lucene/common-build.xml:1673: The following error occurred while executing this line:
/x1/jenkins/jenkins-slave/workspace/Lucene-Solr-Maven-5.3/lucene/common-build.xml:589: Error deploying artifact 'org.apache.lucene:lucene-grouping:jar': Error deploying artifact: Error transferring file

Total time: 29 minutes 56 seconds
Build step 'Invoke Ant' marked build as failure
Email was triggered for: Failure - Any
Sending email for trigger: Failure - Any



[JENKINS-MAVEN] Lucene-Solr-Maven-5.3 #18: POMs out of sync

Posted by Apache Jenkins Server <je...@builds.apache.org>.
Build: https://builds.apache.org/job/Lucene-Solr-Maven-5.3/18/

No tests ran.

Build Log:
[...truncated 25012 lines...]
BUILD FAILED
/x1/jenkins/jenkins-slave/workspace/Lucene-Solr-Maven-5.3/build.xml:742: The following error occurred while executing this line:
/x1/jenkins/jenkins-slave/workspace/Lucene-Solr-Maven-5.3/build.xml:231: The following error occurred while executing this line:
/x1/jenkins/jenkins-slave/workspace/Lucene-Solr-Maven-5.3/lucene/build.xml:410: The following error occurred while executing this line:
/x1/jenkins/jenkins-slave/workspace/Lucene-Solr-Maven-5.3/lucene/common-build.xml:1696: The following error occurred while executing this line:
/x1/jenkins/jenkins-slave/workspace/Lucene-Solr-Maven-5.3/lucene/common-build.xml:589: Error deploying artifact 'org.apache.lucene:lucene-core:jar': Error deploying artifact: Error transferring file

Total time: 26 minutes 2 seconds
Build step 'Invoke Ant' marked build as failure
Email was triggered for: Failure - Any
Sending email for trigger: Failure - Any



[JENKINS-MAVEN] Lucene-Solr-Maven-5.3 #17: POMs out of sync

Posted by Apache Jenkins Server <je...@builds.apache.org>.
Build: https://builds.apache.org/job/Lucene-Solr-Maven-5.3/17/

No tests ran.

Build Log:
[...truncated 25325 lines...]
BUILD FAILED
/x1/jenkins/jenkins-slave/workspace/Lucene-Solr-Maven-5.3/build.xml:742: The following error occurred while executing this line:
/x1/jenkins/jenkins-slave/workspace/Lucene-Solr-Maven-5.3/build.xml:231: The following error occurred while executing this line:
/x1/jenkins/jenkins-slave/workspace/Lucene-Solr-Maven-5.3/lucene/build.xml:415: The following error occurred while executing this line:
/x1/jenkins/jenkins-slave/workspace/Lucene-Solr-Maven-5.3/lucene/common-build.xml:2245: The following error occurred while executing this line:
/x1/jenkins/jenkins-slave/workspace/Lucene-Solr-Maven-5.3/lucene/analysis/build.xml:122: The following error occurred while executing this line:
/x1/jenkins/jenkins-slave/workspace/Lucene-Solr-Maven-5.3/lucene/analysis/build.xml:38: The following error occurred while executing this line:
/x1/jenkins/jenkins-slave/workspace/Lucene-Solr-Maven-5.3/lucene/common-build.xml:1673: The following error occurred while executing this line:
/x1/jenkins/jenkins-slave/workspace/Lucene-Solr-Maven-5.3/lucene/common-build.xml:589: Error deploying artifact 'org.apache.lucene:lucene-analyzers-morfologik:jar': Error deploying artifact: Error transferring file

Total time: 26 minutes 24 seconds
Build step 'Invoke Ant' marked build as failure
Email was triggered for: Failure - Any
Sending email for trigger: Failure - Any



[JENKINS-MAVEN] Lucene-Solr-Maven-5.3 #16: POMs out of sync

Posted by Apache Jenkins Server <je...@builds.apache.org>.
Build: https://builds.apache.org/job/Lucene-Solr-Maven-5.3/16/

No tests ran.

Build Log:
[...truncated 25455 lines...]
BUILD FAILED
/x1/jenkins/jenkins-slave/workspace/Lucene-Solr-Maven-5.3/build.xml:742: The following error occurred while executing this line:
/x1/jenkins/jenkins-slave/workspace/Lucene-Solr-Maven-5.3/build.xml:231: The following error occurred while executing this line:
/x1/jenkins/jenkins-slave/workspace/Lucene-Solr-Maven-5.3/lucene/build.xml:415: The following error occurred while executing this line:
/x1/jenkins/jenkins-slave/workspace/Lucene-Solr-Maven-5.3/lucene/common-build.xml:2245: The following error occurred while executing this line:
/x1/jenkins/jenkins-slave/workspace/Lucene-Solr-Maven-5.3/lucene/analysis/build.xml:122: The following error occurred while executing this line:
/x1/jenkins/jenkins-slave/workspace/Lucene-Solr-Maven-5.3/lucene/analysis/build.xml:38: The following error occurred while executing this line:
/x1/jenkins/jenkins-slave/workspace/Lucene-Solr-Maven-5.3/lucene/common-build.xml:1673: The following error occurred while executing this line:
/x1/jenkins/jenkins-slave/workspace/Lucene-Solr-Maven-5.3/lucene/common-build.xml:589: Error deploying artifact 'org.apache.lucene:lucene-analyzers-smartcn:jar': Error installing artifact's metadata: Error while deploying metadata: Error transferring file

Total time: 28 minutes 40 seconds
Build step 'Invoke Ant' marked build as failure
Email was triggered for: Failure - Any
Sending email for trigger: Failure - Any



[JENKINS-MAVEN] Lucene-Solr-Maven-5.3 #15: POMs out of sync

Posted by Apache Jenkins Server <je...@builds.apache.org>.
Build: https://builds.apache.org/job/Lucene-Solr-Maven-5.3/15/

No tests ran.

Build Log:
[...truncated 25062 lines...]
BUILD FAILED
/x1/jenkins/jenkins-slave/workspace/Lucene-Solr-Maven-5.3/build.xml:742: The following error occurred while executing this line:
/x1/jenkins/jenkins-slave/workspace/Lucene-Solr-Maven-5.3/build.xml:231: The following error occurred while executing this line:
/x1/jenkins/jenkins-slave/workspace/Lucene-Solr-Maven-5.3/lucene/build.xml:410: The following error occurred while executing this line:
/x1/jenkins/jenkins-slave/workspace/Lucene-Solr-Maven-5.3/lucene/common-build.xml:1673: The following error occurred while executing this line:
/x1/jenkins/jenkins-slave/workspace/Lucene-Solr-Maven-5.3/lucene/common-build.xml:589: Error deploying artifact 'org.apache.lucene:lucene-test-framework:jar': Error installing artifact's metadata: Error while deploying metadata: Error transferring file

Total time: 10 minutes 6 seconds
Build step 'Invoke Ant' marked build as failure
Email was triggered for: Failure - Any
Sending email for trigger: Failure - Any



[JENKINS-MAVEN] Lucene-Solr-Maven-5.3 #14: POMs out of sync

Posted by Apache Jenkins Server <je...@builds.apache.org>.
Build: https://builds.apache.org/job/Lucene-Solr-Maven-5.3/14/

No tests ran.

Build Log:
[...truncated 25654 lines...]
BUILD FAILED
/x1/jenkins/jenkins-slave/workspace/Lucene-Solr-Maven-5.3/build.xml:742: The following error occurred while executing this line:
/x1/jenkins/jenkins-slave/workspace/Lucene-Solr-Maven-5.3/build.xml:231: The following error occurred while executing this line:
/x1/jenkins/jenkins-slave/workspace/Lucene-Solr-Maven-5.3/lucene/build.xml:415: The following error occurred while executing this line:
/x1/jenkins/jenkins-slave/workspace/Lucene-Solr-Maven-5.3/lucene/common-build.xml:2245: The following error occurred while executing this line:
/x1/jenkins/jenkins-slave/workspace/Lucene-Solr-Maven-5.3/lucene/common-build.xml:1673: The following error occurred while executing this line:
/x1/jenkins/jenkins-slave/workspace/Lucene-Solr-Maven-5.3/lucene/common-build.xml:589: Error deploying artifact 'org.apache.lucene:lucene-backward-codecs:jar': Error installing artifact's metadata: Error while deploying metadata: Error transferring file

Total time: 26 minutes 27 seconds
Build step 'Invoke Ant' marked build as failure
Email was triggered for: Failure - Any
Sending email for trigger: Failure - Any