You are viewing a plain text version of this content. The canonical link for it is here.
Posted to yarn-dev@hadoop.apache.org by Apache Jenkins Server <je...@builds.apache.org> on 2014/10/07 13:40:07 UTC
Hadoop-Yarn-trunk - Build # 704 - Still Failing
See https://builds.apache.org/job/Hadoop-Yarn-trunk/704/
###################################################################################
########################## LAST 60 LINES OF THE CONSOLE ###########################
[...truncated 7805 lines...]
Tests run: 3, Failures: 0, Errors: 0, Skipped: 0, Time elapsed: 1.033 sec - in org.apache.hadoop.yarn.server.resourcemanager.TestRMAuditLogger
Running org.apache.hadoop.yarn.server.resourcemanager.TestFifoScheduler
Tests run: 10, Failures: 0, Errors: 0, Skipped: 0, Time elapsed: 31.05 sec - in org.apache.hadoop.yarn.server.resourcemanager.TestFifoScheduler
Running org.apache.hadoop.yarn.server.resourcemanager.TestAMAuthorization
Tests run: 4, Failures: 0, Errors: 0, Skipped: 0, Time elapsed: 14.667 sec - in org.apache.hadoop.yarn.server.resourcemanager.TestAMAuthorization
Results :
Tests run: 888, Failures: 0, Errors: 0, Skipped: 1
[INFO] ------------------------------------------------------------------------
[INFO] Reactor Summary:
[INFO]
[INFO] hadoop-yarn ....................................... SUCCESS [ 3.216 s]
[INFO] hadoop-yarn-api ................................... SUCCESS [02:28 min]
[INFO] hadoop-yarn-common ................................ SUCCESS [02:09 min]
[INFO] hadoop-yarn-server ................................ SUCCESS [ 0.094 s]
[INFO] hadoop-yarn-server-common ......................... SUCCESS [ 34.894 s]
[INFO] hadoop-yarn-server-nodemanager .................... SUCCESS [05:13 min]
[INFO] hadoop-yarn-server-web-proxy ...................... SUCCESS [ 17.218 s]
[INFO] hadoop-yarn-server-applicationhistoryservice ...... SUCCESS [02:18 min]
[INFO] hadoop-yarn-server-resourcemanager ................ FAILURE [53:56 min]
[INFO] hadoop-yarn-server-tests .......................... SKIPPED
[INFO] hadoop-yarn-client ................................ SKIPPED
[INFO] hadoop-yarn-server-sharedcachemanager ............. SKIPPED
[INFO] hadoop-yarn-applications .......................... SKIPPED
[INFO] hadoop-yarn-applications-distributedshell ......... SKIPPED
[INFO] hadoop-yarn-applications-unmanaged-am-launcher .... SKIPPED
[INFO] hadoop-yarn-site .................................. SKIPPED
[INFO] hadoop-yarn-project ............................... SKIPPED
[INFO] ------------------------------------------------------------------------
[INFO] BUILD FAILURE
[INFO] ------------------------------------------------------------------------
[INFO] Total time: 01:07 h
[INFO] Finished at: 2014-10-07T11:39:56+00:00
[INFO] Final Memory: 76M/736M
[INFO] ------------------------------------------------------------------------
[ERROR] Failed to execute goal org.apache.maven.plugins:maven-surefire-plugin:2.16:test (default-test) on project hadoop-yarn-server-resourcemanager: There was a timeout or other error in the fork -> [Help 1]
[ERROR]
[ERROR] To see the full stack trace of the errors, re-run Maven with the -e switch.
[ERROR] Re-run Maven using the -X switch to enable full debug logging.
[ERROR]
[ERROR] For more information about the errors and possible solutions, please read the following articles:
[ERROR] [Help 1] http://cwiki.apache.org/confluence/display/MAVEN/MojoFailureException
[ERROR]
[ERROR] After correcting the problems, you can resume the build with the command
[ERROR] mvn <goals> -rf :hadoop-yarn-server-resourcemanager
Build step 'Execute shell' marked build as failure
Archiving artifacts
Updating HADOOP-11168
Updating HADOOP-10404
Updating HDFS-7194
Updating YARN-2615
Updating YARN-2644
Updating YARN-1051
Updating HDFS-7169
Sending e-mails to: yarn-dev@hadoop.apache.org
Email was triggered for: Failure
Sending email for trigger: Failure
###################################################################################
############################## FAILED TESTS (if any) ##############################
No tests ran.