You are viewing a plain text version of this content. The canonical link for it is here.
Posted to builds@solr.apache.org by Apache Jenkins Server <je...@builds.apache.org> on 2022/08/25 06:50:32 UTC
[JENKINS] Solr » Solr-Check-9.x - Build # 1915 - Still Unstable!
Build: https://ci-builds.apache.org/job/Solr/job/Solr-Check-9.x/1915/
1 tests failed.
FAILED: org.apache.solr.cloud.OverseerRolesTest.classMethod
Error Message:
com.carrotsearch.randomizedtesting.ThreadLeakError: 3 threads leaked from SUITE scope at org.apache.solr.cloud.OverseerRolesTest:
1) Thread[id=13255, name=OverseerPrioritizationThread, state=TIMED_WAITING, group=Overseer collection creation process.]
at java.base@11.0.12/java.lang.Thread.sleep(Native Method)
at app//org.apache.solr.common.cloud.ZkCmdExecutor.retryDelay(ZkCmdExecutor.java:161)
at app//org.apache.solr.common.cloud.ZkCmdExecutor.retryOperation(ZkCmdExecutor.java:82)
at app//org.apache.solr.common.cloud.SolrZkClient.exists(SolrZkClient.java:328)
at app//org.apache.solr.cloud.OverseerNodePrioritizer.prioritizeOverseerNodes(OverseerNodePrioritizer.java:68)
at app//org.apache.solr.cloud.api.collections.OverseerRoleCmd.lambda$runPrioritizer$1(OverseerRoleCmd.java:113)
at app//org.apache.solr.cloud.api.collections.OverseerRoleCmd$$Lambda$1791/0x0000000100de8440.run(Unknown Source)
at java.base@11.0.12/java.lang.Thread.run(Thread.java:834)
2) Thread[id=13253, name=OverseerPrioritizationThread, state=BLOCKED, group=Overseer collection creation process.]
at app//org.apache.solr.cloud.OverseerNodePrioritizer.prioritizeOverseerNodes(OverseerNodePrioritizer.java:66)
at app//org.apache.solr.cloud.api.collections.OverseerRoleCmd.lambda$runPrioritizer$1(OverseerRoleCmd.java:113)
at app//org.apache.solr.cloud.api.collections.OverseerRoleCmd$$Lambda$1791/0x0000000100de8440.run(Unknown Source)
at java.base@11.0.12/java.lang.Thread.run(Thread.java:834)
3) Thread[id=13251, name=OverseerPrioritizationThread, state=BLOCKED, group=Overseer collection creation process.]
at app//org.apache.solr.cloud.OverseerNodePrioritizer.prioritizeOverseerNodes(OverseerNodePrioritizer.java:66)
at app//org.apache.solr.cloud.api.collections.OverseerRoleCmd.lambda$runPrioritizer$1(OverseerRoleCmd.java:113)
at app//org.apache.solr.cloud.api.collections.OverseerRoleCmd$$Lambda$1791/0x0000000100de8440.run(Unknown Source)
at java.base@11.0.12/java.lang.Thread.run(Thread.java:834)
Stack Trace:
com.carrotsearch.randomizedtesting.ThreadLeakError: 3 threads leaked from SUITE scope at org.apache.solr.cloud.OverseerRolesTest:
1) Thread[id=13255, name=OverseerPrioritizationThread, state=TIMED_WAITING, group=Overseer collection creation process.]
at java.base@11.0.12/java.lang.Thread.sleep(Native Method)
at app//org.apache.solr.common.cloud.ZkCmdExecutor.retryDelay(ZkCmdExecutor.java:161)
at app//org.apache.solr.common.cloud.ZkCmdExecutor.retryOperation(ZkCmdExecutor.java:82)
at app//org.apache.solr.common.cloud.SolrZkClient.exists(SolrZkClient.java:328)
at app//org.apache.solr.cloud.OverseerNodePrioritizer.prioritizeOverseerNodes(OverseerNodePrioritizer.java:68)
at app//org.apache.solr.cloud.api.collections.OverseerRoleCmd.lambda$runPrioritizer$1(OverseerRoleCmd.java:113)
at app//org.apache.solr.cloud.api.collections.OverseerRoleCmd$$Lambda$1791/0x0000000100de8440.run(Unknown Source)
at java.base@11.0.12/java.lang.Thread.run(Thread.java:834)
2) Thread[id=13253, name=OverseerPrioritizationThread, state=BLOCKED, group=Overseer collection creation process.]
at app//org.apache.solr.cloud.OverseerNodePrioritizer.prioritizeOverseerNodes(OverseerNodePrioritizer.java:66)
at app//org.apache.solr.cloud.api.collections.OverseerRoleCmd.lambda$runPrioritizer$1(OverseerRoleCmd.java:113)
at app//org.apache.solr.cloud.api.collections.OverseerRoleCmd$$Lambda$1791/0x0000000100de8440.run(Unknown Source)
at java.base@11.0.12/java.lang.Thread.run(Thread.java:834)
3) Thread[id=13251, name=OverseerPrioritizationThread, state=BLOCKED, group=Overseer collection creation process.]
at app//org.apache.solr.cloud.OverseerNodePrioritizer.prioritizeOverseerNodes(OverseerNodePrioritizer.java:66)
at app//org.apache.solr.cloud.api.collections.OverseerRoleCmd.lambda$runPrioritizer$1(OverseerRoleCmd.java:113)
at app//org.apache.solr.cloud.api.collections.OverseerRoleCmd$$Lambda$1791/0x0000000100de8440.run(Unknown Source)
at java.base@11.0.12/java.lang.Thread.run(Thread.java:834)
at __randomizedtesting.SeedInfo.seed([D5D5DD689D69D82D]:0)
Build Log:
[...truncated 1887 lines...]
ERROR: The following test(s) have failed:
- org.apache.solr.cloud.OverseerRolesTest.classMethod (:solr:core)
Test output: /home/jenkins/jenkins-slave/workspace/Solr/Solr-Check-9.x/solr/core/build/test-results/test/outputs/OUTPUT-org.apache.solr.cloud.OverseerRolesTest.txt
Reproduce with: gradlew :solr:core:test --tests "org.apache.solr.cloud.OverseerRolesTest.classMethod" -Ptests.jvms=4 -Ptests.haltonfailure=false "-Ptests.jvmargs=-XX:TieredStopAtLevel=1 -XX:ReservedCodeCacheSize=120m" -Ptests.seed=D5D5DD689D69D82D -Ptests.multiplier=2 -Ptests.badapples=false -Ptests.file.encoding=US-ASCII
Deprecated Gradle features were used in this build, making it incompatible with Gradle 8.0.
You can use '--warning-mode all' to show the individual deprecation warnings and determine if they come from your own scripts or plugins.
See https://docs.gradle.org/7.2/userguide/command_line_interface.html#sec:command_line_warnings
BUILD SUCCESSFUL in 45m 42s
543 actionable tasks: 543 executed
Build step 'Invoke Gradle script' changed build result to SUCCESS
Archiving artifacts
hudson.FilePath$ValidateAntFileMask$1Cancel
at hudson.FilePath$ValidateAntFileMask$1.isCaseSensitive(FilePath.java:3209)
at org.apache.tools.ant.DirectoryScanner.couldHoldIncluded(DirectoryScanner.java:1413)
at org.apache.tools.ant.DirectoryScanner.lambda$couldHoldIncluded$4(DirectoryScanner.java:1400)
at java.base/java.util.stream.MatchOps$1MatchSink.accept(MatchOps.java:90)
at java.base/java.util.Spliterators$ArraySpliterator.tryAdvance(Spliterators.java:958)
at java.base/java.util.stream.Streams$ConcatSpliterator.tryAdvance(Streams.java:720)
at java.base/java.util.stream.ReferencePipeline.forEachWithCancel(ReferencePipeline.java:127)
at java.base/java.util.stream.AbstractPipeline.copyIntoWithCancel(AbstractPipeline.java:502)
at java.base/java.util.stream.AbstractPipeline.copyInto(AbstractPipeline.java:488)
at java.base/java.util.stream.AbstractPipeline.wrapAndCopyInto(AbstractPipeline.java:474)
at java.base/java.util.stream.MatchOps$MatchOp.evaluateSequential(MatchOps.java:230)
at java.base/java.util.stream.MatchOps$MatchOp.evaluateSequential(MatchOps.java:196)
at java.base/java.util.stream.AbstractPipeline.evaluate(AbstractPipeline.java:234)
at java.base/java.util.stream.ReferencePipeline.anyMatch(ReferencePipeline.java:528)
at org.apache.tools.ant.DirectoryScanner.couldHoldIncluded(DirectoryScanner.java:1400)
at org.apache.tools.ant.DirectoryScanner.scandir(DirectoryScanner.java:1266)
at org.apache.tools.ant.DirectoryScanner.scandir(DirectoryScanner.java:1267)
at org.apache.tools.ant.DirectoryScanner.scandir(DirectoryScanner.java:1267)
at org.apache.tools.ant.DirectoryScanner.scandir(DirectoryScanner.java:1267)
at org.apache.tools.ant.DirectoryScanner.scandir(DirectoryScanner.java:1267)
at org.apache.tools.ant.DirectoryScanner.scandir(DirectoryScanner.java:1267)
at org.apache.tools.ant.DirectoryScanner.scandir(DirectoryScanner.java:1267)
at org.apache.tools.ant.DirectoryScanner.scandir(DirectoryScanner.java:1194)
at org.apache.tools.ant.DirectoryScanner.scandir(DirectoryScanner.java:1156)
at org.apache.tools.ant.DirectoryScanner.checkIncludePatterns(DirectoryScanner.java:954)
at org.apache.tools.ant.DirectoryScanner.scan(DirectoryScanner.java:912)
at hudson.FilePath$ValidateAntFileMask.hasMatch(FilePath.java:3222)
Caused: java.lang.InterruptedException: no matches found within 10000
at hudson.FilePath$ValidateAntFileMask.hasMatch(FilePath.java:3227)
at hudson.FilePath$ValidateAntFileMask.invoke(FilePath.java:3105)
at hudson.FilePath$ValidateAntFileMask.invoke(FilePath.java:3083)
at hudson.FilePath$FileCallableWrapper.call(FilePath.java:3487)
Also: hudson.remoting.Channel$CallSiteStackTrace: Remote call to lucene-solr-1
at hudson.remoting.Channel.attachCallSiteStackTrace(Channel.java:1784)
at hudson.remoting.UserRequest$ExceptionResponse.retrieve(UserRequest.java:356)
at hudson.remoting.Channel.call(Channel.java:1000)
at hudson.FilePath.act(FilePath.java:1194)
at hudson.FilePath.act(FilePath.java:1183)
at hudson.FilePath.validateAntFileMask(FilePath.java:3080)
at hudson.tasks.ArtifactArchiver.perform(ArtifactArchiver.java:269)
at hudson.tasks.BuildStepCompatibilityLayer.perform(BuildStepCompatibilityLayer.java:79)
at hudson.tasks.BuildStepMonitor$1.perform(BuildStepMonitor.java:20)
at hudson.model.AbstractBuild$AbstractBuildExecution.perform(AbstractBuild.java:814)
at hudson.model.AbstractBuild$AbstractBuildExecution.performAllBuildSteps(AbstractBuild.java:763)
at hudson.model.Build$BuildExecution.post2(Build.java:179)
at hudson.model.AbstractBuild$AbstractBuildExecution.post(AbstractBuild.java:707)
at hudson.model.Run.execute(Run.java:1921)
at hudson.model.FreeStyleBuild.run(FreeStyleBuild.java:44)
at hudson.model.ResourceController.execute(ResourceController.java:101)
at hudson.model.Executor.run(Executor.java:442)
Caused: hudson.FilePath$TunneledInterruptedException
at hudson.FilePath$FileCallableWrapper.call(FilePath.java:3489)
at hudson.remoting.UserRequest.perform(UserRequest.java:211)
at hudson.remoting.UserRequest.perform(UserRequest.java:54)
at hudson.remoting.Request$2.run(Request.java:376)
at hudson.remoting.InterceptingExecutorService.lambda$wrap$0(InterceptingExecutorService.java:78)
at java.base/java.util.concurrent.FutureTask.run(FutureTask.java:264)
at java.base/java.util.concurrent.ThreadPoolExecutor.runWorker(ThreadPoolExecutor.java:1128)
at java.base/java.util.concurrent.ThreadPoolExecutor$Worker.run(ThreadPoolExecutor.java:628)
at java.base/java.lang.Thread.run(Thread.java:834)
Caused: java.lang.InterruptedException: java.lang.InterruptedException: no matches found within 10000
at hudson.FilePath.act(FilePath.java:1196)
at hudson.FilePath.act(FilePath.java:1183)
at hudson.FilePath.validateAntFileMask(FilePath.java:3080)
at hudson.tasks.ArtifactArchiver.perform(ArtifactArchiver.java:269)
at hudson.tasks.BuildStepCompatibilityLayer.perform(BuildStepCompatibilityLayer.java:79)
at hudson.tasks.BuildStepMonitor$1.perform(BuildStepMonitor.java:20)
at hudson.model.AbstractBuild$AbstractBuildExecution.perform(AbstractBuild.java:814)
at hudson.model.AbstractBuild$AbstractBuildExecution.performAllBuildSteps(AbstractBuild.java:763)
at hudson.model.Build$BuildExecution.post2(Build.java:179)
at hudson.model.AbstractBuild$AbstractBuildExecution.post(AbstractBuild.java:707)
at hudson.model.Run.execute(Run.java:1921)
at hudson.model.FreeStyleBuild.run(FreeStyleBuild.java:44)
at hudson.model.ResourceController.execute(ResourceController.java:101)
at hudson.model.Executor.run(Executor.java:442)
No artifacts found that match the file pattern "**/*.events,heapdumps/**,**/hs_err_pid*". Configuration error?
Recording test results
[Checks API] No suitable checks publisher found.
Build step 'Publish JUnit test result report' changed build result to UNSTABLE
Email was triggered for: Unstable (Test Failures)
Sending email for trigger: Unstable (Test Failures)