You are viewing a plain text version of this content. The canonical link for it is here.
Posted to dev@lucene.apache.org by Policeman Jenkins Server <je...@thetaphi.de> on 2015/08/17 11:58:58 UTC

[JENKINS] Lucene-Solr-5.x-Linux (64bit/jdk1.7.0_80) - Build # 13640 - Failure!

Build: http://jenkins.thetaphi.de/job/Lucene-Solr-5.x-Linux/13640/
Java: 64bit/jdk1.7.0_80 -XX:+UseCompressedOops -XX:+UseG1GC

1 tests failed.
FAILED:  org.apache.solr.cloud.HttpPartitionTest.test

Error Message:
Didn't see all replicas for shard shard1 in c8n_1x2 come up within 30000 ms! ClusterState: {   "c8n_1x2":{     "shards":{"shard1":{         "range":"80000000-7fffffff",         "state":"active",         "replicas":{           "core_node1":{             "base_url":"http://127.0.0.1:43415/o_/wq",             "core":"c8n_1x2_shard1_replica1",             "node_name":"127.0.0.1:43415_o_%2Fwq",             "state":"active",             "leader":"true"},           "core_node2":{             "base_url":"http://127.0.0.1:41211/o_/wq",             "core":"c8n_1x2_shard1_replica2",             "node_name":"127.0.0.1:41211_o_%2Fwq",             "state":"active"}}}},     "router":{"name":"compositeId"},     "maxShardsPerNode":"1",     "autoAddReplicas":"false",     "replicationFactor":"2"},   "collection1":{     "shards":{       "shard1":{         "range":"80000000-ffffffff",         "state":"active",         "replicas":{           "core_node1":{             "base_url":"http://127.0.0.1:41211/o_/wq",             "core":"collection1",             "node_name":"127.0.0.1:41211_o_%2Fwq",             "state":"active",             "leader":"true"},           "core_node3":{             "base_url":"http://127.0.0.1:40576/o_/wq",             "core":"collection1",             "node_name":"127.0.0.1:40576_o_%2Fwq",             "state":"active"}}},       "shard2":{         "range":"0-7fffffff",         "state":"active",         "replicas":{"core_node2":{             "base_url":"http://127.0.0.1:43415/o_/wq",             "core":"collection1",             "node_name":"127.0.0.1:43415_o_%2Fwq",             "state":"active",             "leader":"true"}}}},     "router":{"name":"compositeId"},     "maxShardsPerNode":"1",     "autoAddReplicas":"false",     "autoCreated":"true",     "replicationFactor":"1"},   "control_collection":{     "shards":{"shard1":{         "range":"80000000-7fffffff",         "state":"active",         "replicas":{"core_node1":{             "base_url":"http://127.0.0.1:46370/o_/wq",             "core":"collection1",             "node_name":"127.0.0.1:46370_o_%2Fwq",             "state":"active",             "leader":"true"}}}},     "router":{"name":"compositeId"},     "maxShardsPerNode":"1",     "autoAddReplicas":"false",     "autoCreated":"true",     "replicationFactor":"1"}}

Stack Trace:
java.lang.AssertionError: Didn't see all replicas for shard shard1 in c8n_1x2 come up within 30000 ms! ClusterState: {
  "c8n_1x2":{
    "shards":{"shard1":{
        "range":"80000000-7fffffff",
        "state":"active",
        "replicas":{
          "core_node1":{
            "base_url":"http://127.0.0.1:43415/o_/wq",
            "core":"c8n_1x2_shard1_replica1",
            "node_name":"127.0.0.1:43415_o_%2Fwq",
            "state":"active",
            "leader":"true"},
          "core_node2":{
            "base_url":"http://127.0.0.1:41211/o_/wq",
            "core":"c8n_1x2_shard1_replica2",
            "node_name":"127.0.0.1:41211_o_%2Fwq",
            "state":"active"}}}},
    "router":{"name":"compositeId"},
    "maxShardsPerNode":"1",
    "autoAddReplicas":"false",
    "replicationFactor":"2"},
  "collection1":{
    "shards":{
      "shard1":{
        "range":"80000000-ffffffff",
        "state":"active",
        "replicas":{
          "core_node1":{
            "base_url":"http://127.0.0.1:41211/o_/wq",
            "core":"collection1",
            "node_name":"127.0.0.1:41211_o_%2Fwq",
            "state":"active",
            "leader":"true"},
          "core_node3":{
            "base_url":"http://127.0.0.1:40576/o_/wq",
            "core":"collection1",
            "node_name":"127.0.0.1:40576_o_%2Fwq",
            "state":"active"}}},
      "shard2":{
        "range":"0-7fffffff",
        "state":"active",
        "replicas":{"core_node2":{
            "base_url":"http://127.0.0.1:43415/o_/wq",
            "core":"collection1",
            "node_name":"127.0.0.1:43415_o_%2Fwq",
            "state":"active",
            "leader":"true"}}}},
    "router":{"name":"compositeId"},
    "maxShardsPerNode":"1",
    "autoAddReplicas":"false",
    "autoCreated":"true",
    "replicationFactor":"1"},
  "control_collection":{
    "shards":{"shard1":{
        "range":"80000000-7fffffff",
        "state":"active",
        "replicas":{"core_node1":{
            "base_url":"http://127.0.0.1:46370/o_/wq",
            "core":"collection1",
            "node_name":"127.0.0.1:46370_o_%2Fwq",
            "state":"active",
            "leader":"true"}}}},
    "router":{"name":"compositeId"},
    "maxShardsPerNode":"1",
    "autoAddReplicas":"false",
    "autoCreated":"true",
    "replicationFactor":"1"}}
	at __randomizedtesting.SeedInfo.seed([47D2483C1DE5BF5B:CF8677E6B319D2A3]:0)
	at org.junit.Assert.fail(Assert.java:93)
	at org.apache.solr.cloud.AbstractFullDistribZkTestBase.ensureAllReplicasAreActive(AbstractFullDistribZkTestBase.java:1844)
	at org.apache.solr.cloud.HttpPartitionTest.testRf2(HttpPartitionTest.java:249)
	at org.apache.solr.cloud.HttpPartitionTest.test(HttpPartitionTest.java:103)
	at sun.reflect.NativeMethodAccessorImpl.invoke0(Native Method)
	at sun.reflect.NativeMethodAccessorImpl.invoke(NativeMethodAccessorImpl.java:57)
	at sun.reflect.DelegatingMethodAccessorImpl.invoke(DelegatingMethodAccessorImpl.java:43)
	at java.lang.reflect.Method.invoke(Method.java:606)
	at com.carrotsearch.randomizedtesting.RandomizedRunner.invoke(RandomizedRunner.java:1627)
	at com.carrotsearch.randomizedtesting.RandomizedRunner$6.evaluate(RandomizedRunner.java:836)
	at com.carrotsearch.randomizedtesting.RandomizedRunner$7.evaluate(RandomizedRunner.java:872)
	at com.carrotsearch.randomizedtesting.RandomizedRunner$8.evaluate(RandomizedRunner.java:886)
	at org.apache.solr.BaseDistributedSearchTestCase$ShardsRepeatRule$ShardsFixedStatement.callStatement(BaseDistributedSearchTestCase.java:963)
	at org.apache.solr.BaseDistributedSearchTestCase$ShardsRepeatRule$ShardsStatement.evaluate(BaseDistributedSearchTestCase.java:938)
	at com.carrotsearch.randomizedtesting.rules.SystemPropertiesRestoreRule$1.evaluate(SystemPropertiesRestoreRule.java:57)
	at org.apache.lucene.util.TestRuleSetupTeardownChained$1.evaluate(TestRuleSetupTeardownChained.java:50)
	at org.apache.lucene.util.AbstractBeforeAfterRule$1.evaluate(AbstractBeforeAfterRule.java:46)
	at org.apache.lucene.util.TestRuleThreadAndTestName$1.evaluate(TestRuleThreadAndTestName.java:49)
	at org.apache.lucene.util.TestRuleIgnoreAfterMaxFailures$1.evaluate(TestRuleIgnoreAfterMaxFailures.java:65)
	at org.apache.lucene.util.TestRuleMarkFailure$1.evaluate(TestRuleMarkFailure.java:48)
	at com.carrotsearch.randomizedtesting.rules.StatementAdapter.evaluate(StatementAdapter.java:36)
	at com.carrotsearch.randomizedtesting.ThreadLeakControl$StatementRunner.run(ThreadLeakControl.java:365)
	at com.carrotsearch.randomizedtesting.ThreadLeakControl.forkTimeoutingTask(ThreadLeakControl.java:798)
	at com.carrotsearch.randomizedtesting.ThreadLeakControl$3.evaluate(ThreadLeakControl.java:458)
	at com.carrotsearch.randomizedtesting.RandomizedRunner.runSingleTest(RandomizedRunner.java:845)
	at com.carrotsearch.randomizedtesting.RandomizedRunner$3.evaluate(RandomizedRunner.java:747)
	at com.carrotsearch.randomizedtesting.RandomizedRunner$4.evaluate(RandomizedRunner.java:781)
	at com.carrotsearch.randomizedtesting.RandomizedRunner$5.evaluate(RandomizedRunner.java:792)
	at com.carrotsearch.randomizedtesting.rules.StatementAdapter.evaluate(StatementAdapter.java:36)
	at com.carrotsearch.randomizedtesting.rules.SystemPropertiesRestoreRule$1.evaluate(SystemPropertiesRestoreRule.java:57)
	at org.apache.lucene.util.AbstractBeforeAfterRule$1.evaluate(AbstractBeforeAfterRule.java:46)
	at com.carrotsearch.randomizedtesting.rules.StatementAdapter.evaluate(StatementAdapter.java:36)
	at org.apache.lucene.util.TestRuleStoreClassName$1.evaluate(TestRuleStoreClassName.java:42)
	at com.carrotsearch.randomizedtesting.rules.NoShadowingOrOverridesOnMethodsRule$1.evaluate(NoShadowingOrOverridesOnMethodsRule.java:39)
	at com.carrotsearch.randomizedtesting.rules.NoShadowingOrOverridesOnMethodsRule$1.evaluate(NoShadowingOrOverridesOnMethodsRule.java:39)
	at com.carrotsearch.randomizedtesting.rules.StatementAdapter.evaluate(StatementAdapter.java:36)
	at com.carrotsearch.randomizedtesting.rules.StatementAdapter.evaluate(StatementAdapter.java:36)
	at com.carrotsearch.randomizedtesting.rules.StatementAdapter.evaluate(StatementAdapter.java:36)
	at org.apache.lucene.util.TestRuleAssertionsRequired$1.evaluate(TestRuleAssertionsRequired.java:54)
	at org.apache.lucene.util.TestRuleMarkFailure$1.evaluate(TestRuleMarkFailure.java:48)
	at org.apache.lucene.util.TestRuleIgnoreAfterMaxFailures$1.evaluate(TestRuleIgnoreAfterMaxFailures.java:65)
	at org.apache.lucene.util.TestRuleIgnoreTestSuites$1.evaluate(TestRuleIgnoreTestSuites.java:55)
	at com.carrotsearch.randomizedtesting.rules.StatementAdapter.evaluate(StatementAdapter.java:36)
	at com.carrotsearch.randomizedtesting.ThreadLeakControl$StatementRunner.run(ThreadLeakControl.java:365)
	at java.lang.Thread.run(Thread.java:745)




Build Log:
[...truncated 10209 lines...]
   [junit4] Suite: org.apache.solr.cloud.HttpPartitionTest
   [junit4]   2> Creating dataDir: /home/jenkins/workspace/Lucene-Solr-5.x-Linux/solr/build/solr-core/test/J2/temp/solr.cloud.HttpPartitionTest_47D2483C1DE5BF5B-001/init-core-data-001
   [junit4]   2> 485401 INFO  (SUITE-HttpPartitionTest-seed#[47D2483C1DE5BF5B]-worker) [    ] o.a.s.BaseDistributedSearchTestCase Setting hostContext system property: /o_/wq
   [junit4]   2> 485405 INFO  (TEST-HttpPartitionTest.test-seed#[47D2483C1DE5BF5B]) [    ] o.a.s.c.ZkTestServer STARTING ZK TEST SERVER
   [junit4]   2> 485405 INFO  (Thread-1541) [    ] o.a.s.c.ZkTestServer client port:0.0.0.0/0.0.0.0:0
   [junit4]   2> 485405 INFO  (Thread-1541) [    ] o.a.s.c.ZkTestServer Starting server
   [junit4]   2> 485505 INFO  (TEST-HttpPartitionTest.test-seed#[47D2483C1DE5BF5B]) [    ] o.a.s.c.ZkTestServer start zk server on port:56213
   [junit4]   2> 485506 INFO  (TEST-HttpPartitionTest.test-seed#[47D2483C1DE5BF5B]) [    ] o.a.s.c.c.SolrZkClient Using default ZkCredentialsProvider
   [junit4]   2> 485506 INFO  (TEST-HttpPartitionTest.test-seed#[47D2483C1DE5BF5B]) [    ] o.a.s.c.c.ConnectionManager Waiting for client to connect to ZooKeeper
   [junit4]   2> 485510 INFO  (zkCallback-325-thread-1) [    ] o.a.s.c.c.ConnectionManager Watcher org.apache.solr.common.cloud.ConnectionManager@4de7b2ed name:ZooKeeperConnection Watcher:127.0.0.1:56213 got event WatchedEvent state:SyncConnected type:None path:null path:null type:None
   [junit4]   2> 485510 INFO  (TEST-HttpPartitionTest.test-seed#[47D2483C1DE5BF5B]) [    ] o.a.s.c.c.ConnectionManager Client is connected to ZooKeeper
   [junit4]   2> 485510 INFO  (TEST-HttpPartitionTest.test-seed#[47D2483C1DE5BF5B]) [    ] o.a.s.c.c.SolrZkClient Using default ZkACLProvider
   [junit4]   2> 485510 INFO  (TEST-HttpPartitionTest.test-seed#[47D2483C1DE5BF5B]) [    ] o.a.s.c.c.SolrZkClient makePath: /solr
   [junit4]   2> 485513 INFO  (TEST-HttpPartitionTest.test-seed#[47D2483C1DE5BF5B]) [    ] o.a.s.c.c.SolrZkClient Using default ZkCredentialsProvider
   [junit4]   2> 485514 INFO  (TEST-HttpPartitionTest.test-seed#[47D2483C1DE5BF5B]) [    ] o.a.s.c.c.ConnectionManager Waiting for client to connect to ZooKeeper
   [junit4]   2> 485515 INFO  (zkCallback-326-thread-1) [    ] o.a.s.c.c.ConnectionManager Watcher org.apache.solr.common.cloud.ConnectionManager@4eb75f9e name:ZooKeeperConnection Watcher:127.0.0.1:56213/solr got event WatchedEvent state:SyncConnected type:None path:null path:null type:None
   [junit4]   2> 485515 INFO  (TEST-HttpPartitionTest.test-seed#[47D2483C1DE5BF5B]) [    ] o.a.s.c.c.ConnectionManager Client is connected to ZooKeeper
   [junit4]   2> 485515 INFO  (TEST-HttpPartitionTest.test-seed#[47D2483C1DE5BF5B]) [    ] o.a.s.c.c.SolrZkClient Using default ZkACLProvider
   [junit4]   2> 485516 INFO  (TEST-HttpPartitionTest.test-seed#[47D2483C1DE5BF5B]) [    ] o.a.s.c.c.SolrZkClient makePath: /collections/collection1
   [junit4]   2> 485517 INFO  (TEST-HttpPartitionTest.test-seed#[47D2483C1DE5BF5B]) [    ] o.a.s.c.c.SolrZkClient makePath: /collections/collection1/shards
   [junit4]   2> 485518 INFO  (TEST-HttpPartitionTest.test-seed#[47D2483C1DE5BF5B]) [    ] o.a.s.c.c.SolrZkClient makePath: /collections/control_collection
   [junit4]   2> 485518 INFO  (TEST-HttpPartitionTest.test-seed#[47D2483C1DE5BF5B]) [    ] o.a.s.c.c.SolrZkClient makePath: /collections/control_collection/shards
   [junit4]   2> 485519 INFO  (TEST-HttpPartitionTest.test-seed#[47D2483C1DE5BF5B]) [    ] o.a.s.c.AbstractZkTestCase put /home/jenkins/workspace/Lucene-Solr-5.x-Linux/solr/core/src/test-files/solr/collection1/conf/solrconfig-tlog.xml to /configs/conf1/solrconfig.xml
   [junit4]   2> 485519 INFO  (TEST-HttpPartitionTest.test-seed#[47D2483C1DE5BF5B]) [    ] o.a.s.c.c.SolrZkClient makePath: /configs/conf1/solrconfig.xml
   [junit4]   2> 485520 INFO  (TEST-HttpPartitionTest.test-seed#[47D2483C1DE5BF5B]) [    ] o.a.s.c.AbstractZkTestCase put /home/jenkins/workspace/Lucene-Solr-5.x-Linux/solr/core/src/test-files/solr/collection1/conf/schema.xml to /configs/conf1/schema.xml
   [junit4]   2> 485520 INFO  (TEST-HttpPartitionTest.test-seed#[47D2483C1DE5BF5B]) [    ] o.a.s.c.c.SolrZkClient makePath: /configs/conf1/schema.xml
   [junit4]   2> 485521 INFO  (TEST-HttpPartitionTest.test-seed#[47D2483C1DE5BF5B]) [    ] o.a.s.c.AbstractZkTestCase put /home/jenkins/workspace/Lucene-Solr-5.x-Linux/solr/core/src/test-files/solr/collection1/conf/solrconfig.snippet.randomindexconfig.xml to /configs/conf1/solrconfig.snippet.randomindexconfig.xml
   [junit4]   2> 485522 INFO  (TEST-HttpPartitionTest.test-seed#[47D2483C1DE5BF5B]) [    ] o.a.s.c.c.SolrZkClient makePath: /configs/conf1/solrconfig.snippet.randomindexconfig.xml
   [junit4]   2> 485522 INFO  (TEST-HttpPartitionTest.test-seed#[47D2483C1DE5BF5B]) [    ] o.a.s.c.AbstractZkTestCase put /home/jenkins/workspace/Lucene-Solr-5.x-Linux/solr/core/src/test-files/solr/collection1/conf/stopwords.txt to /configs/conf1/stopwords.txt
   [junit4]   2> 485522 INFO  (TEST-HttpPartitionTest.test-seed#[47D2483C1DE5BF5B]) [    ] o.a.s.c.c.SolrZkClient makePath: /configs/conf1/stopwords.txt
   [junit4]   2> 485523 INFO  (TEST-HttpPartitionTest.test-seed#[47D2483C1DE5BF5B]) [    ] o.a.s.c.AbstractZkTestCase put /home/jenkins/workspace/Lucene-Solr-5.x-Linux/solr/core/src/test-files/solr/collection1/conf/protwords.txt to /configs/conf1/protwords.txt
   [junit4]   2> 485523 INFO  (TEST-HttpPartitionTest.test-seed#[47D2483C1DE5BF5B]) [    ] o.a.s.c.c.SolrZkClient makePath: /configs/conf1/protwords.txt
   [junit4]   2> 485524 INFO  (TEST-HttpPartitionTest.test-seed#[47D2483C1DE5BF5B]) [    ] o.a.s.c.AbstractZkTestCase put /home/jenkins/workspace/Lucene-Solr-5.x-Linux/solr/core/src/test-files/solr/collection1/conf/currency.xml to /configs/conf1/currency.xml
   [junit4]   2> 485524 INFO  (TEST-HttpPartitionTest.test-seed#[47D2483C1DE5BF5B]) [    ] o.a.s.c.c.SolrZkClient makePath: /configs/conf1/currency.xml
   [junit4]   2> 485525 INFO  (TEST-HttpPartitionTest.test-seed#[47D2483C1DE5BF5B]) [    ] o.a.s.c.AbstractZkTestCase put /home/jenkins/workspace/Lucene-Solr-5.x-Linux/solr/core/src/test-files/solr/collection1/conf/enumsConfig.xml to /configs/conf1/enumsConfig.xml
   [junit4]   2> 485525 INFO  (TEST-HttpPartitionTest.test-seed#[47D2483C1DE5BF5B]) [    ] o.a.s.c.c.SolrZkClient makePath: /configs/conf1/enumsConfig.xml
   [junit4]   2> 485526 INFO  (TEST-HttpPartitionTest.test-seed#[47D2483C1DE5BF5B]) [    ] o.a.s.c.AbstractZkTestCase put /home/jenkins/workspace/Lucene-Solr-5.x-Linux/solr/core/src/test-files/solr/collection1/conf/open-exchange-rates.json to /configs/conf1/open-exchange-rates.json
   [junit4]   2> 485526 INFO  (TEST-HttpPartitionTest.test-seed#[47D2483C1DE5BF5B]) [    ] o.a.s.c.c.SolrZkClient makePath: /configs/conf1/open-exchange-rates.json
   [junit4]   2> 485527 INFO  (TEST-HttpPartitionTest.test-seed#[47D2483C1DE5BF5B]) [    ] o.a.s.c.AbstractZkTestCase put /home/jenkins/workspace/Lucene-Solr-5.x-Linux/solr/core/src/test-files/solr/collection1/conf/mapping-ISOLatin1Accent.txt to /configs/conf1/mapping-ISOLatin1Accent.txt
   [junit4]   2> 485527 INFO  (TEST-HttpPartitionTest.test-seed#[47D2483C1DE5BF5B]) [    ] o.a.s.c.c.SolrZkClient makePath: /configs/conf1/mapping-ISOLatin1Accent.txt
   [junit4]   2> 485528 INFO  (TEST-HttpPartitionTest.test-seed#[47D2483C1DE5BF5B]) [    ] o.a.s.c.AbstractZkTestCase put /home/jenkins/workspace/Lucene-Solr-5.x-Linux/solr/core/src/test-files/solr/collection1/conf/old_synonyms.txt to /configs/conf1/old_synonyms.txt
   [junit4]   2> 485528 INFO  (TEST-HttpPartitionTest.test-seed#[47D2483C1DE5BF5B]) [    ] o.a.s.c.c.SolrZkClient makePath: /configs/conf1/old_synonyms.txt
   [junit4]   2> 485529 INFO  (TEST-HttpPartitionTest.test-seed#[47D2483C1DE5BF5B]) [    ] o.a.s.c.AbstractZkTestCase put /home/jenkins/workspace/Lucene-Solr-5.x-Linux/solr/core/src/test-files/solr/collection1/conf/synonyms.txt to /configs/conf1/synonyms.txt
   [junit4]   2> 485529 INFO  (TEST-HttpPartitionTest.test-seed#[47D2483C1DE5BF5B]) [    ] o.a.s.c.c.SolrZkClient makePath: /configs/conf1/synonyms.txt
   [junit4]   2> 485578 INFO  (TEST-HttpPartitionTest.test-seed#[47D2483C1DE5BF5B]) [    ] o.a.s.SolrTestCaseJ4 Writing core.properties file to /home/jenkins/workspace/Lucene-Solr-5.x-Linux/solr/build/solr-core/test/J2/temp/solr.cloud.HttpPartitionTest_47D2483C1DE5BF5B-001/control-001/cores/collection1
   [junit4]   2> 485581 INFO  (TEST-HttpPartitionTest.test-seed#[47D2483C1DE5BF5B]) [    ] o.e.j.s.Server jetty-9.2.11.v20150529
   [junit4]   2> 485582 INFO  (TEST-HttpPartitionTest.test-seed#[47D2483C1DE5BF5B]) [    ] o.e.j.s.h.ContextHandler Started o.e.j.s.ServletContextHandler@be13195{/o_/wq,null,AVAILABLE}
   [junit4]   2> 485584 INFO  (TEST-HttpPartitionTest.test-seed#[47D2483C1DE5BF5B]) [    ] o.e.j.s.ServerConnector Started ServerConnector@4e16fa07{HTTP/1.1}{127.0.0.1:45178}
   [junit4]   2> 485584 INFO  (TEST-HttpPartitionTest.test-seed#[47D2483C1DE5BF5B]) [    ] o.e.j.s.Server Started @487838ms
   [junit4]   2> 485584 INFO  (TEST-HttpPartitionTest.test-seed#[47D2483C1DE5BF5B]) [    ] o.a.s.c.s.e.JettySolrRunner Jetty properties: {hostContext=/o_/wq, coreRootDirectory=/home/jenkins/workspace/Lucene-Solr-5.x-Linux/solr/build/solr-core/test/J2/temp/solr.cloud.HttpPartitionTest_47D2483C1DE5BF5B-001/control-001/cores, hostPort=46370, solr.data.dir=/home/jenkins/workspace/Lucene-Solr-5.x-Linux/solr/build/solr-core/test/J2/temp/solr.cloud.HttpPartitionTest_47D2483C1DE5BF5B-001/tempDir-001/control/data}
   [junit4]   2> 485584 INFO  (TEST-HttpPartitionTest.test-seed#[47D2483C1DE5BF5B]) [    ] o.a.s.s.SolrDispatchFilter SolrDispatchFilter.init(): sun.misc.Launcher$AppClassLoader@321ea24
   [junit4]   2> 485584 INFO  (TEST-HttpPartitionTest.test-seed#[47D2483C1DE5BF5B]) [    ] o.a.s.c.SolrResourceLoader new SolrResourceLoader for directory: '/home/jenkins/workspace/Lucene-Solr-5.x-Linux/solr/build/solr-core/test/J2/temp/solr.cloud.HttpPartitionTest_47D2483C1DE5BF5B-001/control-001/'
   [junit4]   2> 485597 INFO  (TEST-HttpPartitionTest.test-seed#[47D2483C1DE5BF5B]) [    ] o.a.s.c.c.SolrZkClient Using default ZkCredentialsProvider
   [junit4]   2> 485597 INFO  (TEST-HttpPartitionTest.test-seed#[47D2483C1DE5BF5B]) [    ] o.a.s.c.c.ConnectionManager Waiting for client to connect to ZooKeeper
   [junit4]   2> 485598 INFO  (zkCallback-327-thread-1) [    ] o.a.s.c.c.ConnectionManager Watcher org.apache.solr.common.cloud.ConnectionManager@791bdaf0 name:ZooKeeperConnection Watcher:127.0.0.1:56213/solr got event WatchedEvent state:SyncConnected type:None path:null path:null type:None
   [junit4]   2> 485598 INFO  (TEST-HttpPartitionTest.test-seed#[47D2483C1DE5BF5B]) [    ] o.a.s.c.c.ConnectionManager Client is connected to ZooKeeper
   [junit4]   2> 485599 INFO  (TEST-HttpPartitionTest.test-seed#[47D2483C1DE5BF5B]) [    ] o.a.s.c.c.SolrZkClient Using default ZkACLProvider
   [junit4]   2> 485600 INFO  (TEST-HttpPartitionTest.test-seed#[47D2483C1DE5BF5B]) [    ] o.a.s.s.SolrDispatchFilter Loading solr.xml from SolrHome (not found in ZooKeeper)
   [junit4]   2> 485600 INFO  (TEST-HttpPartitionTest.test-seed#[47D2483C1DE5BF5B]) [    ] o.a.s.c.SolrXmlConfig Loading container configuration from /home/jenkins/workspace/Lucene-Solr-5.x-Linux/solr/build/solr-core/test/J2/temp/solr.cloud.HttpPartitionTest_47D2483C1DE5BF5B-001/control-001/solr.xml
   [junit4]   2> 485609 INFO  (TEST-HttpPartitionTest.test-seed#[47D2483C1DE5BF5B]) [    ] o.a.s.c.CoresLocator Config-defined core root directory: /home/jenkins/workspace/Lucene-Solr-5.x-Linux/solr/build/solr-core/test/J2/temp/solr.cloud.HttpPartitionTest_47D2483C1DE5BF5B-001/control-001/cores
   [junit4]   2> 485609 INFO  (TEST-HttpPartitionTest.test-seed#[47D2483C1DE5BF5B]) [    ] o.a.s.c.CoreContainer New CoreContainer 1616016963
   [junit4]   2> 485610 INFO  (TEST-HttpPartitionTest.test-seed#[47D2483C1DE5BF5B]) [    ] o.a.s.c.CoreContainer Loading cores into CoreContainer [instanceDir=/home/jenkins/workspace/Lucene-Solr-5.x-Linux/solr/build/solr-core/test/J2/temp/solr.cloud.HttpPartitionTest_47D2483C1DE5BF5B-001/control-001/]
   [junit4]   2> 485610 INFO  (TEST-HttpPartitionTest.test-seed#[47D2483C1DE5BF5B]) [    ] o.a.s.c.CoreContainer loading shared library: /home/jenkins/workspace/Lucene-Solr-5.x-Linux/solr/build/solr-core/test/J2/temp/solr.cloud.HttpPartitionTest_47D2483C1DE5BF5B-001/control-001/lib
   [junit4]   2> 485610 WARN  (TEST-HttpPartitionTest.test-seed#[47D2483C1DE5BF5B]) [    ] o.a.s.c.SolrResourceLoader Can't find (or read) directory to add to classloader: lib (resolved as: /home/jenkins/workspace/Lucene-Solr-5.x-Linux/solr/build/solr-core/test/J2/temp/solr.cloud.HttpPartitionTest_47D2483C1DE5BF5B-001/control-001/lib).
   [junit4]   2> 485615 INFO  (TEST-HttpPartitionTest.test-seed#[47D2483C1DE5BF5B]) [    ] o.a.s.h.c.HttpShardHandlerFactory created with socketTimeout : 90000,urlScheme : ,connTimeout : 15000,maxConnectionsPerHost : 20,maxConnections : 10000,corePoolSize : 0,maximumPoolSize : 2147483647,maxThreadIdleTime : 5,sizeOfQueue : -1,fairnessPolicy : false,useRetries : false,
   [junit4]   2> 485616 INFO  (TEST-HttpPartitionTest.test-seed#[47D2483C1DE5BF5B]) [    ] o.a.s.u.UpdateShardHandler Creating UpdateShardHandler HTTP client with params: socketTimeout=340000&connTimeout=45000&retry=true
   [junit4]   2> 485617 INFO  (TEST-HttpPartitionTest.test-seed#[47D2483C1DE5BF5B]) [    ] o.a.s.l.LogWatcher SLF4J impl is org.slf4j.impl.Log4jLoggerFactory
   [junit4]   2> 485617 INFO  (TEST-HttpPartitionTest.test-seed#[47D2483C1DE5BF5B]) [    ] o.a.s.l.LogWatcher Registering Log Listener [Log4j (org.slf4j.impl.Log4jLoggerFactory)]
   [junit4]   2> 485617 INFO  (TEST-HttpPartitionTest.test-seed#[47D2483C1DE5BF5B]) [    ] o.a.s.c.ZkContainer Zookeeper client=127.0.0.1:56213/solr
   [junit4]   2> 485617 INFO  (TEST-HttpPartitionTest.test-seed#[47D2483C1DE5BF5B]) [    ] o.a.s.c.ZkController zkHost includes chroot
   [junit4]   2> 485617 INFO  (TEST-HttpPartitionTest.test-seed#[47D2483C1DE5BF5B]) [    ] o.a.s.c.c.SolrZkClient Using default ZkCredentialsProvider
   [junit4]   2> 485618 INFO  (TEST-HttpPartitionTest.test-seed#[47D2483C1DE5BF5B]) [    ] o.a.s.c.c.ConnectionManager Waiting for client to connect to ZooKeeper
   [junit4]   2> 485619 INFO  (zkCallback-329-thread-1) [    ] o.a.s.c.c.ConnectionManager Watcher org.apache.solr.common.cloud.ConnectionManager@5efe2f0b name:ZooKeeperConnection Watcher:127.0.0.1:56213 got event WatchedEvent state:SyncConnected type:None path:null path:null type:None
   [junit4]   2> 485620 INFO  (TEST-HttpPartitionTest.test-seed#[47D2483C1DE5BF5B]) [    ] o.a.s.c.c.ConnectionManager Client is connected to ZooKeeper
   [junit4]   2> 485620 INFO  (TEST-HttpPartitionTest.test-seed#[47D2483C1DE5BF5B]) [    ] o.a.s.c.c.SolrZkClient Using default ZkACLProvider
   [junit4]   2> 485622 INFO  (TEST-HttpPartitionTest.test-seed#[47D2483C1DE5BF5B]) [n:127.0.0.1:46370_o_%2Fwq    ] o.a.s.c.c.ConnectionManager Waiting for client to connect to ZooKeeper
   [junit4]   2> 485623 INFO  (zkCallback-330-thread-1-processing-n:127.0.0.1:46370_o_%2Fwq) [n:127.0.0.1:46370_o_%2Fwq    ] o.a.s.c.c.ConnectionManager Watcher org.apache.solr.common.cloud.ConnectionManager@33bac1ca name:ZooKeeperConnection Watcher:127.0.0.1:56213/solr got event WatchedEvent state:SyncConnected type:None path:null path:null type:None
   [junit4]   2> 485623 INFO  (TEST-HttpPartitionTest.test-seed#[47D2483C1DE5BF5B]) [n:127.0.0.1:46370_o_%2Fwq    ] o.a.s.c.c.ConnectionManager Client is connected to ZooKeeper
   [junit4]   2> 485625 INFO  (TEST-HttpPartitionTest.test-seed#[47D2483C1DE5BF5B]) [n:127.0.0.1:46370_o_%2Fwq    ] o.a.s.c.c.SolrZkClient makePath: /overseer/queue
   [junit4]   2> 485626 INFO  (TEST-HttpPartitionTest.test-seed#[47D2483C1DE5BF5B]) [n:127.0.0.1:46370_o_%2Fwq    ] o.a.s.c.c.SolrZkClient makePath: /overseer/collection-queue-work
   [junit4]   2> 485626 INFO  (TEST-HttpPartitionTest.test-seed#[47D2483C1DE5BF5B]) [n:127.0.0.1:46370_o_%2Fwq    ] o.a.s.c.c.SolrZkClient makePath: /overseer/collection-map-running
   [junit4]   2> 485627 INFO  (TEST-HttpPartitionTest.test-seed#[47D2483C1DE5BF5B]) [n:127.0.0.1:46370_o_%2Fwq    ] o.a.s.c.c.SolrZkClient makePath: /overseer/collection-map-completed
   [junit4]   2> 485628 INFO  (TEST-HttpPartitionTest.test-seed#[47D2483C1DE5BF5B]) [n:127.0.0.1:46370_o_%2Fwq    ] o.a.s.c.c.SolrZkClient makePath: /overseer/collection-map-failure
   [junit4]   2> 485629 INFO  (TEST-HttpPartitionTest.test-seed#[47D2483C1DE5BF5B]) [n:127.0.0.1:46370_o_%2Fwq    ] o.a.s.c.c.SolrZkClient makePath: /live_nodes
   [junit4]   2> 485629 INFO  (TEST-HttpPartitionTest.test-seed#[47D2483C1DE5BF5B]) [n:127.0.0.1:46370_o_%2Fwq    ] o.a.s.c.c.SolrZkClient makePath: /aliases.json
   [junit4]   2> 485631 INFO  (TEST-HttpPartitionTest.test-seed#[47D2483C1DE5BF5B]) [n:127.0.0.1:46370_o_%2Fwq    ] o.a.s.c.c.SolrZkClient makePath: /clusterstate.json
   [junit4]   2> 485632 INFO  (TEST-HttpPartitionTest.test-seed#[47D2483C1DE5BF5B]) [n:127.0.0.1:46370_o_%2Fwq    ] o.a.s.c.c.SolrZkClient makePath: /security.json
   [junit4]   2> 485632 INFO  (TEST-HttpPartitionTest.test-seed#[47D2483C1DE5BF5B]) [n:127.0.0.1:46370_o_%2Fwq    ] o.a.s.c.ZkController Register node as live in ZooKeeper:/live_nodes/127.0.0.1:46370_o_%2Fwq
   [junit4]   2> 485632 INFO  (TEST-HttpPartitionTest.test-seed#[47D2483C1DE5BF5B]) [n:127.0.0.1:46370_o_%2Fwq    ] o.a.s.c.c.SolrZkClient makePath: /live_nodes/127.0.0.1:46370_o_%2Fwq
   [junit4]   2> 485633 INFO  (TEST-HttpPartitionTest.test-seed#[47D2483C1DE5BF5B]) [n:127.0.0.1:46370_o_%2Fwq    ] o.a.s.c.c.SolrZkClient makePath: /overseer_elect
   [junit4]   2> 485633 INFO  (TEST-HttpPartitionTest.test-seed#[47D2483C1DE5BF5B]) [n:127.0.0.1:46370_o_%2Fwq    ] o.a.s.c.c.SolrZkClient makePath: /overseer_elect/election
   [junit4]   2> 485634 INFO  (TEST-HttpPartitionTest.test-seed#[47D2483C1DE5BF5B]) [n:127.0.0.1:46370_o_%2Fwq    ] o.a.s.c.Overseer Overseer (id=null) closing
   [junit4]   2> 485634 INFO  (TEST-HttpPartitionTest.test-seed#[47D2483C1DE5BF5B]) [n:127.0.0.1:46370_o_%2Fwq    ] o.a.s.c.LeaderElector Joined leadership election with path: /overseer_elect/election/94359018868178948-127.0.0.1:46370_o_%2Fwq-n_0000000000
   [junit4]   2> 485635 INFO  (TEST-HttpPartitionTest.test-seed#[47D2483C1DE5BF5B]) [n:127.0.0.1:46370_o_%2Fwq    ] o.a.s.c.OverseerElectionContext I am going to be the leader 127.0.0.1:46370_o_%2Fwq
   [junit4]   2> 485635 INFO  (TEST-HttpPartitionTest.test-seed#[47D2483C1DE5BF5B]) [n:127.0.0.1:46370_o_%2Fwq    ] o.a.s.c.c.SolrZkClient makePath: /overseer_elect/leader
   [junit4]   2> 485636 INFO  (TEST-HttpPartitionTest.test-seed#[47D2483C1DE5BF5B]) [n:127.0.0.1:46370_o_%2Fwq    ] o.a.s.c.Overseer Overseer (id=94359018868178948-127.0.0.1:46370_o_%2Fwq-n_0000000000) starting
   [junit4]   2> 485637 INFO  (TEST-HttpPartitionTest.test-seed#[47D2483C1DE5BF5B]) [n:127.0.0.1:46370_o_%2Fwq    ] o.a.s.c.c.SolrZkClient makePath: /overseer/queue-work
   [junit4]   2> 485640 INFO  (TEST-HttpPartitionTest.test-seed#[47D2483C1DE5BF5B]) [n:127.0.0.1:46370_o_%2Fwq    ] o.a.s.c.OverseerAutoReplicaFailoverThread Starting OverseerAutoReplicaFailoverThread autoReplicaFailoverWorkLoopDelay=10000 autoReplicaFailoverWaitAfterExpiration=30000 autoReplicaFailoverBadNodeExpiration=60000
   [junit4]   2> 485640 INFO  (OverseerCollectionProcessor-94359018868178948-127.0.0.1:46370_o_%2Fwq-n_0000000000) [n:127.0.0.1:46370_o_%2Fwq    ] o.a.s.c.OverseerProcessor Process current queue of overseer operations
   [junit4]   2> 485641 INFO  (TEST-HttpPartitionTest.test-seed#[47D2483C1DE5BF5B]) [n:127.0.0.1:46370_o_%2Fwq    ] o.a.s.c.c.ZkStateReader Updating cluster state from ZooKeeper... 
   [junit4]   2> 485641 INFO  (OverseerStateUpdate-94359018868178948-127.0.0.1:46370_o_%2Fwq-n_0000000000) [n:127.0.0.1:46370_o_%2Fwq    ] o.a.s.c.Overseer Starting to work on the main queue
   [junit4]   2> 485659 INFO  (TEST-HttpPartitionTest.test-seed#[47D2483C1DE5BF5B]) [n:127.0.0.1:46370_o_%2Fwq    ] o.a.s.c.CoreContainer Security conf doesn't exist. Skipping setup for authorization module.
   [junit4]   2> 485660 INFO  (TEST-HttpPartitionTest.test-seed#[47D2483C1DE5BF5B]) [n:127.0.0.1:46370_o_%2Fwq    ] o.a.s.c.CoreContainer No authentication plugin used.
   [junit4]   2> 485660 INFO  (TEST-HttpPartitionTest.test-seed#[47D2483C1DE5BF5B]) [n:127.0.0.1:46370_o_%2Fwq    ] o.a.s.c.CoresLocator Looking for core definitions underneath /home/jenkins/workspace/Lucene-Solr-5.x-Linux/solr/build/solr-core/test/J2/temp/solr.cloud.HttpPartitionTest_47D2483C1DE5BF5B-001/control-001/cores
   [junit4]   2> 485661 INFO  (TEST-HttpPartitionTest.test-seed#[47D2483C1DE5BF5B]) [n:127.0.0.1:46370_o_%2Fwq    ] o.a.s.c.SolrCore Created CoreDescriptor: {schema=schema.xml, coreNodeName=, loadOnStartup=true, transient=false, absoluteInstDir=/home/jenkins/workspace/Lucene-Solr-5.x-Linux/solr/build/solr-core/test/J2/temp/solr.cloud.HttpPartitionTest_47D2483C1DE5BF5B-001/control-001/cores/collection1/, instanceDir=/home/jenkins/workspace/Lucene-Solr-5.x-Linux/solr/build/solr-core/test/J2/temp/solr.cloud.HttpPartitionTest_47D2483C1DE5BF5B-001/control-001/cores/collection1, config=solrconfig.xml, shard=, collection=control_collection, configSetProperties=configsetprops.json, dataDir=data/, name=collection1}
   [junit4]   2> 485661 INFO  (TEST-HttpPartitionTest.test-seed#[47D2483C1DE5BF5B]) [n:127.0.0.1:46370_o_%2Fwq    ] o.a.s.c.CoresLocator Found core collection1 in /home/jenkins/workspace/Lucene-Solr-5.x-Linux/solr/build/solr-core/test/J2/temp/solr.cloud.HttpPartitionTest_47D2483C1DE5BF5B-001/control-001/cores/collection1/
   [junit4]   2> 485661 INFO  (TEST-HttpPartitionTest.test-seed#[47D2483C1DE5BF5B]) [n:127.0.0.1:46370_o_%2Fwq    ] o.a.s.c.CoresLocator Found 1 core definitions
   [junit4]   2> 485662 INFO  (coreLoadExecutor-1907-thread-1-processing-n:127.0.0.1:46370_o_%2Fwq) [n:127.0.0.1:46370_o_%2Fwq c:control_collection   x:collection1] o.a.s.c.ZkController publishing state=down
   [junit4]   2> 485662 INFO  (TEST-HttpPartitionTest.test-seed#[47D2483C1DE5BF5B]) [n:127.0.0.1:46370_o_%2Fwq    ] o.a.s.s.SolrDispatchFilter user.dir=/home/jenkins/workspace/Lucene-Solr-5.x-Linux/solr/build/solr-core/test/J2
   [junit4]   2> 485662 INFO  (TEST-HttpPartitionTest.test-seed#[47D2483C1DE5BF5B]) [n:127.0.0.1:46370_o_%2Fwq    ] o.a.s.s.SolrDispatchFilter SolrDispatchFilter.init() done
   [junit4]   2> 485662 INFO  (coreLoadExecutor-1907-thread-1-processing-n:127.0.0.1:46370_o_%2Fwq) [n:127.0.0.1:46370_o_%2Fwq c:control_collection   x:collection1] o.a.s.c.ZkController numShards not found on descriptor - reading it from system property
   [junit4]   2> 485663 INFO  (coreLoadExecutor-1907-thread-1-processing-n:127.0.0.1:46370_o_%2Fwq) [n:127.0.0.1:46370_o_%2Fwq c:control_collection   x:collection1] o.a.s.c.ZkController look for our core node name
   [junit4]   2> 485663 INFO  (zkCallback-330-thread-1-processing-n:127.0.0.1:46370_o_%2Fwq) [n:127.0.0.1:46370_o_%2Fwq    ] o.a.s.c.DistributedQueue NodeChildrenChanged fired on path /overseer/queue state SyncConnected
   [junit4]   2> 485663 INFO  (OverseerStateUpdate-94359018868178948-127.0.0.1:46370_o_%2Fwq-n_0000000000) [n:127.0.0.1:46370_o_%2Fwq    ] o.a.s.c.Overseer processMessage: queueSize: 1, message = {
   [junit4]   2>   "base_url":"http://127.0.0.1:46370/o_/wq",
   [junit4]   2>   "core":"collection1",
   [junit4]   2>   "collection":"control_collection",
   [junit4]   2>   "operation":"state",
   [junit4]   2>   "node_name":"127.0.0.1:46370_o_%2Fwq",
   [junit4]   2>   "roles":null,
   [junit4]   2>   "numShards":"1",
   [junit4]   2>   "shard":null,
   [junit4]   2>   "state":"down"} current state version: 0
   [junit4]   2> 485664 INFO  (OverseerStateUpdate-94359018868178948-127.0.0.1:46370_o_%2Fwq-n_0000000000) [n:127.0.0.1:46370_o_%2Fwq    ] o.a.s.c.o.ReplicaMutator Update state numShards=1 message={
   [junit4]   2>   "base_url":"http://127.0.0.1:46370/o_/wq",
   [junit4]   2>   "core":"collection1",
   [junit4]   2>   "collection":"control_collection",
   [junit4]   2>   "operation":"state",
   [junit4]   2>   "node_name":"127.0.0.1:46370_o_%2Fwq",
   [junit4]   2>   "roles":null,
   [junit4]   2>   "numShards":"1",
   [junit4]   2>   "shard":null,
   [junit4]   2>   "state":"down"}
   [junit4]   2> 485664 INFO  (OverseerStateUpdate-94359018868178948-127.0.0.1:46370_o_%2Fwq-n_0000000000) [n:127.0.0.1:46370_o_%2Fwq    ] o.a.s.c.o.ClusterStateMutator building a new cName: control_collection
   [junit4]   2> 485664 INFO  (OverseerStateUpdate-94359018868178948-127.0.0.1:46370_o_%2Fwq-n_0000000000) [n:127.0.0.1:46370_o_%2Fwq    ] o.a.s.c.o.ReplicaMutator Assigning new node to shard shard=shard1
   [junit4]   2> 485665 INFO  (zkCallback-330-thread-1-processing-n:127.0.0.1:46370_o_%2Fwq) [n:127.0.0.1:46370_o_%2Fwq    ] o.a.s.c.c.ZkStateReader A cluster state change: WatchedEvent state:SyncConnected type:NodeDataChanged path:/clusterstate.json, has occurred - updating... (live nodes size: 1)
   [junit4]   2> 486663 INFO  (coreLoadExecutor-1907-thread-1-processing-n:127.0.0.1:46370_o_%2Fwq) [n:127.0.0.1:46370_o_%2Fwq c:control_collection   x:collection1] o.a.s.c.ZkController waiting to find shard id in clusterstate for collection1
   [junit4]   2> 486663 INFO  (coreLoadExecutor-1907-thread-1-processing-n:127.0.0.1:46370_o_%2Fwq) [n:127.0.0.1:46370_o_%2Fwq c:control_collection   x:collection1] o.a.s.c.ZkController Check for collection zkNode:control_collection
   [junit4]   2> 486663 INFO  (coreLoadExecutor-1907-thread-1-processing-n:127.0.0.1:46370_o_%2Fwq) [n:127.0.0.1:46370_o_%2Fwq c:control_collection   x:collection1] o.a.s.c.ZkController Collection zkNode exists
   [junit4]   2> 486664 INFO  (coreLoadExecutor-1907-thread-1-processing-n:127.0.0.1:46370_o_%2Fwq) [n:127.0.0.1:46370_o_%2Fwq c:control_collection   x:collection1] o.a.s.c.c.ZkStateReader Load collection config from:/collections/control_collection
   [junit4]   2> 486664 INFO  (coreLoadExecutor-1907-thread-1-processing-n:127.0.0.1:46370_o_%2Fwq) [n:127.0.0.1:46370_o_%2Fwq c:control_collection   x:collection1] o.a.s.c.c.ZkStateReader path=/collections/control_collection configName=conf1 specified config exists in ZooKeeper
   [junit4]   2> 486664 INFO  (coreLoadExecutor-1907-thread-1-processing-n:127.0.0.1:46370_o_%2Fwq) [n:127.0.0.1:46370_o_%2Fwq c:control_collection   x:collection1] o.a.s.c.SolrResourceLoader new SolrResourceLoader for directory: '/home/jenkins/workspace/Lucene-Solr-5.x-Linux/solr/build/solr-core/test/J2/temp/solr.cloud.HttpPartitionTest_47D2483C1DE5BF5B-001/control-001/cores/collection1/'
   [junit4]   2> 486673 INFO  (coreLoadExecutor-1907-thread-1-processing-n:127.0.0.1:46370_o_%2Fwq) [n:127.0.0.1:46370_o_%2Fwq c:control_collection   x:collection1] o.a.s.c.Config loaded config solrconfig.xml with version 0 
   [junit4]   2> 486677 INFO  (coreLoadExecutor-1907-thread-1-processing-n:127.0.0.1:46370_o_%2Fwq) [n:127.0.0.1:46370_o_%2Fwq c:control_collection   x:collection1] o.a.s.c.SolrConfig current version of requestparams : -1
   [junit4]   2> 486685 INFO  (coreLoadExecutor-1907-thread-1-processing-n:127.0.0.1:46370_o_%2Fwq) [n:127.0.0.1:46370_o_%2Fwq c:control_collection   x:collection1] o.a.s.c.SolrConfig Using Lucene MatchVersion: 5.4.0
   [junit4]   2> 486747 INFO  (coreLoadExecutor-1907-thread-1-processing-n:127.0.0.1:46370_o_%2Fwq) [n:127.0.0.1:46370_o_%2Fwq c:control_collection   x:collection1] o.a.s.c.Config Loaded SolrConfig: solrconfig.xml
   [junit4]   2> 486748 INFO  (coreLoadExecutor-1907-thread-1-processing-n:127.0.0.1:46370_o_%2Fwq) [n:127.0.0.1:46370_o_%2Fwq c:control_collection   x:collection1] o.a.s.s.IndexSchema Reading Solr Schema from /configs/conf1/schema.xml
   [junit4]   2> 486753 INFO  (coreLoadExecutor-1907-thread-1-processing-n:127.0.0.1:46370_o_%2Fwq) [n:127.0.0.1:46370_o_%2Fwq c:control_collection   x:collection1] o.a.s.s.IndexSchema [collection1] Schema name=test
   [junit4]   2> 486886 INFO  (coreLoadExecutor-1907-thread-1-processing-n:127.0.0.1:46370_o_%2Fwq) [n:127.0.0.1:46370_o_%2Fwq c:control_collection   x:collection1] o.a.s.s.OpenExchangeRatesOrgProvider Initialized with rates=open-exchange-rates.json, refreshInterval=1440.
   [junit4]   2> 486891 INFO  (coreLoadExecutor-1907-thread-1-processing-n:127.0.0.1:46370_o_%2Fwq) [n:127.0.0.1:46370_o_%2Fwq c:control_collection   x:collection1] o.a.s.s.IndexSchema default search field in schema is text
   [junit4]   2> 486892 INFO  (coreLoadExecutor-1907-thread-1-processing-n:127.0.0.1:46370_o_%2Fwq) [n:127.0.0.1:46370_o_%2Fwq c:control_collection   x:collection1] o.a.s.s.IndexSchema unique key field: id
   [junit4]   2> 486897 INFO  (coreLoadExecutor-1907-thread-1-processing-n:127.0.0.1:46370_o_%2Fwq) [n:127.0.0.1:46370_o_%2Fwq c:control_collection   x:collection1] o.a.s.s.FileExchangeRateProvider Reloading exchange rates from file currency.xml
   [junit4]   2> 486899 INFO  (coreLoadExecutor-1907-thread-1-processing-n:127.0.0.1:46370_o_%2Fwq) [n:127.0.0.1:46370_o_%2Fwq c:control_collection   x:collection1] o.a.s.s.FileExchangeRateProvider Reloading exchange rates from file currency.xml
   [junit4]   2> 486901 INFO  (coreLoadExecutor-1907-thread-1-processing-n:127.0.0.1:46370_o_%2Fwq) [n:127.0.0.1:46370_o_%2Fwq c:control_collection   x:collection1] o.a.s.s.OpenExchangeRatesOrgProvider Reloading exchange rates from open-exchange-rates.json
   [junit4]   2> 486901 WARN  (coreLoadExecutor-1907-thread-1-processing-n:127.0.0.1:46370_o_%2Fwq) [n:127.0.0.1:46370_o_%2Fwq c:control_collection   x:collection1] o.a.s.s.OpenExchangeRatesOrgProvider Unknown key IMPORTANT NOTE
   [junit4]   2> 486901 WARN  (coreLoadExecutor-1907-thread-1-processing-n:127.0.0.1:46370_o_%2Fwq) [n:127.0.0.1:46370_o_%2Fwq c:control_collection   x:collection1] o.a.s.s.OpenExchangeRatesOrgProvider Expected key, got STRING
   [junit4]   2> 486901 INFO  (coreLoadExecutor-1907-thread-1-processing-n:127.0.0.1:46370_o_%2Fwq) [n:127.0.0.1:46370_o_%2Fwq c:control_collection   x:collection1] o.a.s.s.OpenExchangeRatesOrgProvider Reloading exchange rates from open-exchange-rates.json
   [junit4]   2> 486901 WARN  (coreLoadExecutor-1907-thread-1-processing-n:127.0.0.1:46370_o_%2Fwq) [n:127.0.0.1:46370_o_%2Fwq c:control_collection   x:collection1] o.a.s.s.OpenExchangeRatesOrgProvider Unknown key IMPORTANT NOTE
   [junit4]   2> 486902 WARN  (coreLoadExecutor-1907-thread-1-processing-n:127.0.0.1:46370_o_%2Fwq) [n:127.0.0.1:46370_o_%2Fwq c:control_collection   x:collection1] o.a.s.s.OpenExchangeRatesOrgProvider Expected key, got STRING
   [junit4]   2> 486902 INFO  (coreLoadExecutor-1907-thread-1-processing-n:127.0.0.1:46370_o_%2Fwq) [n:127.0.0.1:46370_o_%2Fwq c:control_collection   x:collection1] o.a.s.c.ConfigSetProperties Did not find ConfigSet properties, assuming default properties: Can't find resource 'configsetprops.json' in classpath or '/configs/conf1', cwd=/home/jenkins/workspace/Lucene-Solr-5.x-Linux/solr/build/solr-core/test/J2
   [junit4]   2> 486902 INFO  (coreLoadExecutor-1907-thread-1-processing-n:127.0.0.1:46370_o_%2Fwq) [n:127.0.0.1:46370_o_%2Fwq c:control_collection   x:collection1] o.a.s.c.CoreContainer Creating SolrCore 'collection1' using configuration from collection control_collection
   [junit4]   2> 486902 INFO  (coreLoadExecutor-1907-thread-1-processing-n:127.0.0.1:46370_o_%2Fwq) [n:127.0.0.1:46370_o_%2Fwq c:control_collection s:shard1 r:core_node1 x:collection1] o.a.s.c.SolrCore org.apache.solr.core.MockDirectoryFactory
   [junit4]   2> 486903 INFO  (coreLoadExecutor-1907-thread-1-processing-n:127.0.0.1:46370_o_%2Fwq) [n:127.0.0.1:46370_o_%2Fwq c:control_collection s:shard1 r:core_node1 x:collection1] o.a.s.c.SolrCore [[collection1] ] Opening new SolrCore at [/home/jenkins/workspace/Lucene-Solr-5.x-Linux/solr/build/solr-core/test/J2/temp/solr.cloud.HttpPartitionTest_47D2483C1DE5BF5B-001/control-001/cores/collection1/], dataDir=[null]
   [junit4]   2> 486903 INFO  (coreLoadExecutor-1907-thread-1-processing-n:127.0.0.1:46370_o_%2Fwq) [n:127.0.0.1:46370_o_%2Fwq c:control_collection s:shard1 r:core_node1 x:collection1] o.a.s.c.JmxMonitoredMap JMX monitoring is enabled. Adding Solr mbeans to JMX Server: com.sun.jmx.mbeanserver.JmxMBeanServer@37bdfa20
   [junit4]   2> 486904 INFO  (coreLoadExecutor-1907-thread-1-processing-n:127.0.0.1:46370_o_%2Fwq) [n:127.0.0.1:46370_o_%2Fwq c:control_collection s:shard1 r:core_node1 x:collection1] o.a.s.c.CachingDirectoryFactory return new directory for /home/jenkins/workspace/Lucene-Solr-5.x-Linux/solr/build/solr-core/test/J2/temp/solr.cloud.HttpPartitionTest_47D2483C1DE5BF5B-001/control-001/cores/collection1/data
   [junit4]   2> 486904 INFO  (coreLoadExecutor-1907-thread-1-processing-n:127.0.0.1:46370_o_%2Fwq) [n:127.0.0.1:46370_o_%2Fwq c:control_collection s:shard1 r:core_node1 x:collection1] o.a.s.c.SolrCore New index directory detected: old=null new=/home/jenkins/workspace/Lucene-Solr-5.x-Linux/solr/build/solr-core/test/J2/temp/solr.cloud.HttpPartitionTest_47D2483C1DE5BF5B-001/control-001/cores/collection1/data/index/
   [junit4]   2> 486904 WARN  (coreLoadExecutor-1907-thread-1-processing-n:127.0.0.1:46370_o_%2Fwq) [n:127.0.0.1:46370_o_%2Fwq c:control_collection s:shard1 r:core_node1 x:collection1] o.a.s.c.SolrCore [collection1] Solr index directory '/home/jenkins/workspace/Lucene-Solr-5.x-Linux/solr/build/solr-core/test/J2/temp/solr.cloud.HttpPartitionTest_47D2483C1DE5BF5B-001/control-001/cores/collection1/data/index' doesn't exist. Creating new index...
   [junit4]   2> 486904 INFO  (coreLoadExecutor-1907-thread-1-processing-n:127.0.0.1:46370_o_%2Fwq) [n:127.0.0.1:46370_o_%2Fwq c:control_collection s:shard1 r:core_node1 x:collection1] o.a.s.c.CachingDirectoryFactory return new directory for /home/jenkins/workspace/Lucene-Solr-5.x-Linux/solr/build/solr-core/test/J2/temp/solr.cloud.HttpPartitionTest_47D2483C1DE5BF5B-001/control-001/cores/collection1/data/index
   [junit4]   2> 486904 INFO  (coreLoadExecutor-1907-thread-1-processing-n:127.0.0.1:46370_o_%2Fwq) [n:127.0.0.1:46370_o_%2Fwq c:control_collection s:shard1 r:core_node1 x:collection1] o.a.s.u.RandomMergePolicy RandomMergePolicy wrapping class org.apache.lucene.index.TieredMergePolicy: [TieredMergePolicy: maxMergeAtOnce=19, maxMergeAtOnceExplicit=45, maxMergedSegmentMB=44.92578125, floorSegmentMB=1.5400390625, forceMergeDeletesPctAllowed=29.751208590836367, segmentsPerTier=49.0, maxCFSSegmentSizeMB=8.796093022207999E12, noCFSRatio=0.0
   [junit4]   2> 486905 INFO  (coreLoadExecutor-1907-thread-1-processing-n:127.0.0.1:46370_o_%2Fwq) [n:127.0.0.1:46370_o_%2Fwq c:control_collection s:shard1 r:core_node1 x:collection1] o.a.s.c.SolrCore SolrDeletionPolicy.onCommit: commits: num=1
   [junit4]   2> 	commit{dir=MockDirectoryWrapper(RAMDirectory@38a86a88 lockFactory=org.apache.lucene.store.SingleInstanceLockFactory@38ea23c7),segFN=segments_1,generation=1}
   [junit4]   2> 486905 INFO  (coreLoadExecutor-1907-thread-1-processing-n:127.0.0.1:46370_o_%2Fwq) [n:127.0.0.1:46370_o_%2Fwq c:control_collection s:shard1 r:core_node1 x:collection1] o.a.s.c.SolrCore newest commit generation = 1
   [junit4]   2> 486905 INFO  (OldIndexDirectoryCleanupThreadForCore-collection1) [n:127.0.0.1:46370_o_%2Fwq c:control_collection s:shard1 r:core_node1 x:collection1] o.a.s.c.SolrCore Looking for old index directories to cleanup for core collection1 in /home/jenkins/workspace/Lucene-Solr-5.x-Linux/solr/build/solr-core/test/J2/temp/solr.cloud.HttpPartitionTest_47D2483C1DE5BF5B-001/control-001/cores/collection1/data/
   [junit4]   2> 486905 WARN  (OldIndexDirectoryCleanupThreadForCore-collection1) [n:127.0.0.1:46370_o_%2Fwq c:control_collection s:shard1 r:core_node1 x:collection1] o.a.s.c.DirectoryFactory /home/jenkins/workspace/Lucene-Solr-5.x-Linux/solr/build/solr-core/test/J2/temp/solr.cloud.HttpPartitionTest_47D2483C1DE5BF5B-001/control-001/cores/collection1/data/ does not point to a valid data directory; skipping clean-up of old index directories.
   [junit4]   2> 486909 INFO  (coreLoadExecutor-1907-thread-1-processing-n:127.0.0.1:46370_o_%2Fwq) [n:127.0.0.1:46370_o_%2Fwq c:control_collection s:shard1 r:core_node1 x:collection1] o.a.s.u.p.UpdateRequestProcessorChain creating updateRequestProcessorChain "nodistrib"
   [junit4]   2> 486909 INFO  (coreLoadExecutor-1907-thread-1-processing-n:127.0.0.1:46370_o_%2Fwq) [n:127.0.0.1:46370_o_%2Fwq c:control_collection s:shard1 r:core_node1 x:collection1] o.a.s.u.p.UpdateRequestProcessorChain creating updateRequestProcessorChain "dedupe"
   [junit4]   2> 486909 INFO  (coreLoadExecutor-1907-thread-1-processing-n:127.0.0.1:46370_o_%2Fwq) [n:127.0.0.1:46370_o_%2Fwq c:control_collection s:shard1 r:core_node1 x:collection1] o.a.s.u.p.UpdateRequestProcessorChain inserting DistributedUpdateProcessorFactory into updateRequestProcessorChain "dedupe"
   [junit4]   2> 486909 INFO  (coreLoadExecutor-1907-thread-1-processing-n:127.0.0.1:46370_o_%2Fwq) [n:127.0.0.1:46370_o_%2Fwq c:control_collection s:shard1 r:core_node1 x:collection1] o.a.s.u.p.UpdateRequestProcessorChain creating updateRequestProcessorChain "stored_sig"
   [junit4]   2> 486909 INFO  (coreLoadExecutor-1907-thread-1-processing-n:127.0.0.1:46370_o_%2Fwq) [n:127.0.0.1:46370_o_%2Fwq c:control_collection s:shard1 r:core_node1 x:collection1] o.a.s.u.p.UpdateRequestProcessorChain inserting DistributedUpdateProcessorFactory into updateRequestProcessorChain "stored_sig"
   [junit4]   2> 486909 INFO  (coreLoadExecutor-1907-thread-1-processing-n:127.0.0.1:46370_o_%2Fwq) [n:127.0.0.1:46370_o_%2Fwq c:control_collection s:shard1 r:core_node1 x:collection1] o.a.s.u.p.UpdateRequestProcessorChain creating updateRequestProcessorChain "distrib-dup-test-chain-explicit"
   [junit4]   2> 486909 INFO  (coreLoadExecutor-1907-thread-1-processing-n:127.0.0.1:46370_o_%2Fwq) [n:127.0.0.1:46370_o_%2Fwq c:control_collection s:shard1 r:core_node1 x:collection1] o.a.s.u.p.UpdateRequestProcessorChain creating updateRequestProcessorChain "distrib-dup-test-chain-implicit"
   [junit4]   2> 486910 INFO  (coreLoadExecutor-1907-thread-1-processing-n:127.0.0.1:46370_o_%2Fwq) [n:127.0.0.1:46370_o_%2Fwq c:control_collection s:shard1 r:core_node1 x:collection1] o.a.s.u.p.UpdateRequestProcessorChain inserting DistributedUpdateProcessorFactory into updateRequestProcessorChain "distrib-dup-test-chain-implicit"
   [junit4]   2> 486910 INFO  (coreLoadExecutor-1907-thread-1-processing-n:127.0.0.1:46370_o_%2Fwq) [n:127.0.0.1:46370_o_%2Fwq c:control_collection s:shard1 r:core_node1 x:collection1] o.a.s.c.SolrCore no updateRequestProcessorChain defined as default, creating implicit default
   [junit4]   2> 486912 INFO  (coreLoadExecutor-1907-thread-1-processing-n:127.0.0.1:46370_o_%2Fwq) [n:127.0.0.1:46370_o_%2Fwq c:control_collection s:shard1 r:core_node1 x:collection1] o.a.s.h.l.XMLLoader xsltCacheLifetimeSeconds=60
   [junit4]   2> 486912 INFO  (coreLoadExecutor-1907-thread-1-processing-n:127.0.0.1:46370_o_%2Fwq) [n:127.0.0.1:46370_o_%2Fwq c:control_collection s:shard1 r:core_node1 x:collection1] o.a.s.h.l.XMLLoader xsltCacheLifetimeSeconds=60
   [junit4]   2> 486913 INFO  (coreLoadExecutor-1907-thread-1-processing-n:127.0.0.1:46370_o_%2Fwq) [n:127.0.0.1:46370_o_%2Fwq c:control_collection s:shard1 r:core_node1 x:collection1] o.a.s.h.l.XMLLoader xsltCacheLifetimeSeconds=60
   [junit4]   2> 486914 INFO  (coreLoadExecutor-1907-thread-1-processing-n:127.0.0.1:46370_o_%2Fwq) [n:127.0.0.1:46370_o_%2Fwq c:control_collection s:shard1 r:core_node1 x:collection1] o.a.s.h.l.XMLLoader xsltCacheLifetimeSeconds=60
   [junit4]   2> 486917 INFO  (coreLoadExecutor-1907-thread-1-processing-n:127.0.0.1:46370_o_%2Fwq) [n:127.0.0.1:46370_o_%2Fwq c:control_collection s:shard1 r:core_node1 x:collection1] o.a.s.c.RequestHandlers Registered paths: /replication,/update/json/docs,/config,standard,/update/csv,/admin/luke,/admin/system,/admin/file,/admin/mbeans,/schema,/update,/admin/properties,/admin/ping,/admin/logging,/get,/update/json,/admin/plugins,/admin/threads,/admin/segments
   [junit4]   2> 486918 INFO  (coreLoadExecutor-1907-thread-1-processing-n:127.0.0.1:46370_o_%2Fwq) [n:127.0.0.1:46370_o_%2Fwq c:control_collection s:shard1 r:core_node1 x:collection1] o.a.s.c.SolrCore Using default statsCache cache: org.apache.solr.search.stats.LocalStatsCache
   [junit4]   2> 486919 INFO  (coreLoadExecutor-1907-thread-1-processing-n:127.0.0.1:46370_o_%2Fwq) [n:127.0.0.1:46370_o_%2Fwq c:control_collection s:shard1 r:core_node1 x:collection1] o.a.s.u.UpdateHandler Using UpdateLog implementation: org.apache.solr.update.UpdateLog
   [junit4]   2> 486919 INFO  (coreLoadExecutor-1907-thread-1-processing-n:127.0.0.1:46370_o_%2Fwq) [n:127.0.0.1:46370_o_%2Fwq c:control_collection s:shard1 r:core_node1 x:collection1] o.a.s.u.UpdateLog Initializing UpdateLog: dataDir= defaultSyncLevel=FLUSH numRecordsToKeep=100 maxNumLogsToKeep=10 numVersionBuckets=65536
   [junit4]   2> 486920 INFO  (coreLoadExecutor-1907-thread-1-processing-n:127.0.0.1:46370_o_%2Fwq) [n:127.0.0.1:46370_o_%2Fwq c:control_collection s:shard1 r:core_node1 x:collection1] o.a.s.c.SolrCore Hard AutoCommit: disabled
   [junit4]   2> 486920 INFO  (coreLoadExecutor-1907-thread-1-processing-n:127.0.0.1:46370_o_%2Fwq) [n:127.0.0.1:46370_o_%2Fwq c:control_collection s:shard1 r:core_node1 x:collection1] o.a.s.c.SolrCore Soft AutoCommit: disabled
   [junit4]   2> 486920 INFO  (coreLoadExecutor-1907-thread-1-processing-n:127.0.0.1:46370_o_%2Fwq) [n:127.0.0.1:46370_o_%2Fwq c:control_collection s:shard1 r:core_node1 x:collection1] o.a.s.u.RandomMergePolicy RandomMergePolicy wrapping class org.apache.lucene.index.LogDocMergePolicy: [LogDocMergePolicy: minMergeSize=1000, mergeFactor=22, maxMergeSize=9223372036854775807, maxMergeSizeForForcedMerge=9223372036854775807, calibrateSizeByDeletes=true, maxMergeDocs=2147483647, maxCFSSegmentSizeMB=8.796093022207999E12, noCFSRatio=0.6647471201529458]
   [junit4]   2> 486920 INFO  (coreLoadExecutor-1907-thread-1-processing-n:127.0.0.1:46370_o_%2Fwq) [n:127.0.0.1:46370_o_%2Fwq c:control_collection s:shard1 r:core_node1 x:collection1] o.a.s.c.SolrCore SolrDeletionPolicy.onInit: commits: num=1
   [junit4]   2> 	commit{dir=MockDirectoryWrapper(RAMDirectory@38a86a88 lockFactory=org.apache.lucene.store.SingleInstanceLockFactory@38ea23c7),segFN=segments_1,generation=1}
   [junit4]   2> 486920 INFO  (coreLoadExecutor-1907-thread-1-processing-n:127.0.0.1:46370_o_%2Fwq) [n:127.0.0.1:46370_o_%2Fwq c:control_collection s:shard1 r:core_node1 x:collection1] o.a.s.c.SolrCore newest commit generation = 1
   [junit4]   2> 486921 INFO  (coreLoadExecutor-1907-thread-1-processing-n:127.0.0.1:46370_o_%2Fwq) [n:127.0.0.1:46370_o_%2Fwq c:control_collection s:shard1 r:core_node1 x:collection1] o.a.s.s.SolrIndexSearcher Opening Searcher@53762e3[collection1] main
   [junit4]   2> 486921 INFO  (coreLoadExecutor-1907-thread-1-processing-n:127.0.0.1:46370_o_%2Fwq) [n:127.0.0.1:46370_o_%2Fwq c:control_collection s:shard1 r:core_node1 x:collection1] o.a.s.c.c.ZkStateReader Load collection config from:/collections/control_collection
   [junit4]   2> 486921 INFO  (coreLoadExecutor-1907-thread-1-processing-n:127.0.0.1:46370_o_%2Fwq) [n:127.0.0.1:46370_o_%2Fwq c:control_collection s:shard1 r:core_node1 x:collection1] o.a.s.c.c.ZkStateReader path=/collections/control_collection configName=conf1 specified config exists in ZooKeeper
   [junit4]   2> 486921 INFO  (coreLoadExecutor-1907-thread-1-processing-n:127.0.0.1:46370_o_%2Fwq) [n:127.0.0.1:46370_o_%2Fwq c:control_collection s:shard1 r:core_node1 x:collection1] o.a.s.r.ManagedResourceStorage Setting up ZooKeeper-based storage for the RestManager with znodeBase: /configs/conf1
   [junit4]   2> 486922 INFO  (coreLoadExecutor-1907-thread-1-processing-n:127.0.0.1:46370_o_%2Fwq) [n:127.0.0.1:46370_o_%2Fwq c:control_collection s:shard1 r:core_node1 x:collection1] o.a.s.r.ManagedResourceStorage Configured ZooKeeperStorageIO with znodeBase: /configs/conf1
   [junit4]   2> 486922 INFO  (coreLoadExecutor-1907-thread-1-processing-n:127.0.0.1:46370_o_%2Fwq) [n:127.0.0.1:46370_o_%2Fwq c:control_collection s:shard1 r:core_node1 x:collection1] o.a.s.r.RestManager Initializing RestManager with initArgs: {}
   [junit4]   2> 486922 INFO  (coreLoadExecutor-1907-thread-1-processing-n:127.0.0.1:46370_o_%2Fwq) [n:127.0.0.1:46370_o_%2Fwq c:control_collection s:shard1 r:core_node1 x:collection1] o.a.s.r.ManagedResourceStorage Reading _rest_managed.json using ZooKeeperStorageIO:path=/configs/conf1
   [junit4]   2> 486922 INFO  (coreLoadExecutor-1907-thread-1-processing-n:127.0.0.1:46370_o_%2Fwq) [n:127.0.0.1:46370_o_%2Fwq c:control_collection s:shard1 r:core_node1 x:collection1] o.a.s.r.ManagedResourceStorage No data found for znode /configs/conf1/_rest_managed.json
   [junit4]   2> 486922 INFO  (coreLoadExecutor-1907-thread-1-processing-n:127.0.0.1:46370_o_%2Fwq) [n:127.0.0.1:46370_o_%2Fwq c:control_collection s:shard1 r:core_node1 x:collection1] o.a.s.r.ManagedResourceStorage Loaded null at path _rest_managed.json using ZooKeeperStorageIO:path=/configs/conf1
   [junit4]   2> 486922 INFO  (coreLoadExecutor-1907-thread-1-processing-n:127.0.0.1:46370_o_%2Fwq) [n:127.0.0.1:46370_o_%2Fwq c:control_collection s:shard1 r:core_node1 x:collection1] o.a.s.r.RestManager Initializing 0 registered ManagedResources
   [junit4]   2> 486922 INFO  (coreLoadExecutor-1907-thread-1-processing-n:127.0.0.1:46370_o_%2Fwq) [n:127.0.0.1:46370_o_%2Fwq c:control_collection s:shard1 r:core_node1 x:collection1] o.a.s.h.ReplicationHandler Commits will be reserved for  10000
   [junit4]   2> 486923 INFO  (searcherExecutor-1908-thread-1-processing-x:collection1 c:control_collection r:core_node1 n:127.0.0.1:46370_o_%2Fwq s:shard1) [n:127.0.0.1:46370_o_%2Fwq c:control_collection s:shard1 r:core_node1 x:collection1] o.a.s.c.SolrCore [collection1] Registered new searcher Searcher@53762e3[collection1] main{ExitableDirectoryReader(UninvertingDirectoryReader())}
   [junit4]   2> 486923 INFO  (coreLoadExecutor-1907-thread-1-processing-n:127.0.0.1:46370_o_%2Fwq) [n:127.0.0.1:46370_o_%2Fwq c:control_collection s:shard1 r:core_node1 x:collection1] o.a.s.u.UpdateLog Looking up max value of version field to seed version buckets
   [junit4]   2> 486923 INFO  (coreLoadExecutor-1907-thread-1-processing-n:127.0.0.1:46370_o_%2Fwq) [n:127.0.0.1:46370_o_%2Fwq c:control_collection s:shard1 r:core_node1 x:collection1] o.a.s.u.VersionInfo Refreshing highest value of _version_ for 65536 version buckets from index
   [junit4]   2> 486923 INFO  (coreLoadExecutor-1907-thread-1-processing-n:127.0.0.1:46370_o_%2Fwq) [n:127.0.0.1:46370_o_%2Fwq c:control_collection s:shard1 r:core_node1 x:collection1] o.a.s.u.VersionInfo No terms found for _version_, cannot seed version bucket highest value from index
   [junit4]   2> 486923 INFO  (coreLoadExecutor-1907-thread-1-processing-n:127.0.0.1:46370_o_%2Fwq) [n:127.0.0.1:46370_o_%2Fwq c:control_collection s:shard1 r:core_node1 x:collection1] o.a.s.u.UpdateLog Could not find max version in index or recent updates, using new clock 1509744303476310016
   [junit4]   2> 486925 INFO  (coreLoadExecutor-1907-thread-1-processing-n:127.0.0.1:46370_o_%2Fwq) [n:127.0.0.1:46370_o_%2Fwq c:control_collection s:shard1 r:core_node1 x:collection1] o.a.s.u.UpdateLog Took 1.0ms to seed version buckets with highest version 1509744303476310016
   [junit4]   2> 486925 INFO  (coreLoadExecutor-1907-thread-1-processing-n:127.0.0.1:46370_o_%2Fwq) [n:127.0.0.1:46370_o_%2Fwq c:control_collection s:shard1 r:core_node1 x:collection1] o.a.s.c.ZkController watch zkdir /configs/conf1
   [junit4]   2> 486926 INFO  (coreLoadExecutor-1907-thread-1-processing-n:127.0.0.1:46370_o_%2Fwq) [n:127.0.0.1:46370_o_%2Fwq c:control_collection s:shard1 r:core_node1 x:collection1] o.a.s.c.CoreContainer registering core: collection1
   [junit4]   2> 486926 INFO  (coreZkRegister-1901-thread-1-processing-x:collection1 c:control_collection r:core_node1 n:127.0.0.1:46370_o_%2Fwq s:shard1) [n:127.0.0.1:46370_o_%2Fwq c:control_collection s:shard1 r:core_node1 x:collection1] o.a.s.c.ZkController Register replica - core:collection1 address:http://127.0.0.1:46370/o_/wq collection:control_collection shard:shard1
   [junit4]   2> 486926 INFO  (coreZkRegister-1901-thread-1-processing-x:collection1 c:control_collection r:core_node1 n:127.0.0.1:46370_o_%2Fwq s:shard1) [n:127.0.0.1:46370_o_%2Fwq c:control_collection s:shard1 r:core_node1 x:collection1] o.a.s.c.c.SolrZkClient makePath: /collections/control_collection/leader_elect/shard1/election
   [junit4]   2> 486928 INFO  (coreZkRegister-1901-thread-1-processing-x:collection1 c:control_collection r:core_node1 n:127.0.0.1:46370_o_%2Fwq s:shard1) [n:127.0.0.1:46370_o_%2Fwq c:control_collection s:shard1 r:core_node1 x:collection1] o.a.s.c.LeaderElector Joined leadership election with path: /collections/control_collection/leader_elect/shard1/election/94359018868178948-core_node1-n_0000000000
   [junit4]   2> 486928 INFO  (coreZkRegister-1901-thread-1-processing-x:collection1 c:control_collection r:core_node1 n:127.0.0.1:46370_o_%2Fwq s:shard1) [n:127.0.0.1:46370_o_%2Fwq c:control_collection s:shard1 r:core_node1 x:collection1] o.a.s.c.ShardLeaderElectionContext Running the leader process for shard shard1
   [junit4]   2> 486929 INFO  (zkCallback-330-thread-1-processing-n:127.0.0.1:46370_o_%2Fwq) [n:127.0.0.1:46370_o_%2Fwq    ] o.a.s.c.DistributedQueue NodeChildrenChanged fired on path /overseer/queue state SyncConnected
   [junit4]   2> 486929 INFO  (coreZkRegister-1901-thread-1-processing-x:collection1 c:control_collection r:core_node1 n:127.0.0.1:46370_o_%2Fwq s:shard1) [n:127.0.0.1:46370_o_%2Fwq c:control_collection s:shard1 r:core_node1 x:collection1] o.a.s.c.ShardLeaderElectionContext Enough replicas found to continue.
   [junit4]   2> 486929 INFO  (coreZkRegister-1901-thread-1-processing-x:collection1 c:control_collection r:core_node1 n:127.0.0.1:46370_o_%2Fwq s:shard1) [n:127.0.0.1:46370_o_%2Fwq c:control_collection s:shard1 r:core_node1 x:collection1] o.a.s.c.ShardLeaderElectionContext I may be the new leader - try and sync
   [junit4]   2> 486929 INFO  (coreZkRegister-1901-thread-1-processing-x:collection1 c:control_collection r:core_node1 n:127.0.0.1:46370_o_%2Fwq s:shard1) [n:127.0.0.1:46370_o_%2Fwq c:control_collection s:shard1 r:core_node1 x:collection1] o.a.s.c.SyncStrategy Sync replicas to http://127.0.0.1:46370/o_/wq/collection1/
   [junit4]   2> 486929 INFO  (OverseerStateUpdate-94359018868178948-127.0.0.1:46370_o_%2Fwq-n_0000000000) [n:127.0.0.1:46370_o_%2Fwq    ] o.a.s.c.Overseer processMessage: queueSize: 1, message = {
   [junit4]   2>   "operation":"leader",
   [junit4]   2>   "shard":"shard1",
   [junit4]   2>   "collection":"control_collection"} current state version: 1
   [junit4]   2> 486929 INFO  (coreZkRegister-1901-thread-1-processing-x:collection1 c:control_collection r:core_node1 n:127.0.0.1:46370_o_%2Fwq s:shard1) [n:127.0.0.1:46370_o_%2Fwq c:control_collection s:shard1 r:core_node1 x:collection1] o.a.s.c.SyncStrategy Sync Success - now sync replicas to me
   [junit4]   2> 486930 INFO  (coreZkRegister-1901-thread-1-processing-x:collection1 c:control_collection r:core_node1 n:127.0.0.1:46370_o_%2Fwq s:shard1) [n:127.0.0.1:46370_o_%2Fwq c:control_collection s:shard1 r:core_node1 x:collection1] o.a.s.c.SyncStrategy http://127.0.0.1:46370/o_/wq/collection1/ has no replicas
   [junit4]   2> 486930 INFO  (coreZkRegister-1901-thread-1-processing-x:collection1 c:control_collection r:core_node1 n:127.0.0.1:46370_o_%2Fwq s:shard1) [n:127.0.0.1:46370_o_%2Fwq c:control_collection s:shard1 r:core_node1 x:collection1] o.a.s.c.ShardLeaderElectionContext I am the new leader: http://127.0.0.1:46370/o_/wq/collection1/ shard1
   [junit4]   2> 486930 INFO  (coreZkRegister-1901-thread-1-processing-x:collection1 c:control_collection r:core_node1 n:127.0.0.1:46370_o_%2Fwq s:shard1) [n:127.0.0.1:46370_o_%2Fwq c:control_collection s:shard1 r:core_node1 x:collection1] o.a.s.c.c.SolrZkClient makePath: /collections/control_collection/leaders/shard1
   [junit4]   2> 486932 INFO  (zkCallback-330-thread-1-processing-n:127.0.0.1:46370_o_%2Fwq) [n:127.0.0.1:46370_o_%2Fwq    ] o.a.s.c.DistributedQueue NodeChildrenChanged fired on path /overseer/queue state SyncConnected
   [junit4]   2> 486932 INFO  (OverseerStateUpdate-94359018868178948-127.0.0.1:46370_o_%2Fwq-n_0000000000) [n:127.0.0.1:46370_o_%2Fwq    ] o.a.s.c.Overseer processMessage: queueSize: 1, message = {
   [junit4]   2>   "operation":"leader",
   [junit4]   2>   "shard":"shard1",
   [junit4]   2>   "collection":"control_collection",
   [junit4]   2>   "base_url":"http://127.0.0.1:46370/o_/wq",
   [junit4]   2>   "core":"collection1",
   [junit4]   2>   "state":"active"} current state version: 1
   [junit4]   2> 487033 INFO  (zkCallback-330-thread-1-processing-n:127.0.0.1:46370_o_%2Fwq) [n:127.0.0.1:46370_o_%2Fwq    ] o.a.s.c.c.ZkStateReader A cluster state change: WatchedEvent state:SyncConnected type:NodeDataChanged path:/clusterstate.json, has occurred - updating... (live nodes size: 1)
   [junit4]   2> 487082 INFO  (coreZkRegister-1901-thread-1-processing-x:collection1 c:control_collection r:core_node1 n:127.0.0.1:46370_o_%2Fwq s:shard1) [n:127.0.0.1:46370_o_%2Fwq c:control_collection s:shard1 r:core_node1 x:collection1] o.a.s.c.ZkController We are http://127.0.0.1:46370/o_/wq/collection1/ and leader is http://127.0.0.1:46370/o_/wq/collection1/
   [junit4]   2> 487082 INFO  (coreZkRegister-1901-thread-1-processing-x:collection1 c:control_collection r:core_node1 n:127.0.0.1:46370_o_%2Fwq s:shard1) [n:127.0.0.1:46370_o_%2Fwq c:control_collection s:shard1 r:core_node1 x:collection1] o.a.s.c.ZkController No LogReplay needed for core=collection1 baseURL=http://127.0.0.1:46370/o_/wq
   [junit4]   2> 487082 INFO  (coreZkRegister-1901-thread-1-processing-x:collection1 c:control_collection r:core_node1 n:127.0.0.1:46370_o_%2Fwq s:shard1) [n:127.0.0.1:46370_o_%2Fwq c:control_collection s:shard1 r:core_node1 x:collection1] o.a.s.c.ZkController I am the leader, no recovery necessary
   [junit4]   2> 487082 INFO  (coreZkRegister-1901-thread-1-processing-x:collection1 c:control_collection r:core_node1 n:127.0.0.1:46370_o_%2Fwq s:shard1) [n:127.0.0.1:46370_o_%2Fwq c:control_collection s:shard1 r:core_node1 x:collection1] o.a.s.c.ZkController publishing state=active
   [junit4]   2> 487083 INFO  (coreZkRegister-1901-thread-1-processing-x:collection1 c:control_collection r:core_node1 n:127.0.0.1:46370_o_%2Fwq s:shard1) [n:127.0.0.1:46370_o_%2Fwq c:control_collection s:shard1 r:core_node1 x:collection1] o.a.s.c.ZkController numShards not found on descriptor - reading it from system property
   [junit4]   2> 487084 INFO  (zkCallback-330-thread-1-processing-n:127.0.0.1:46370_o_%2Fwq) [n:127.0.0.1:46370_o_%2Fwq    ] o.a.s.c.DistributedQueue NodeChildrenChanged fired on path /overseer/queue state SyncConnected
   [junit4]   2> 487084 INFO  (OverseerStateUpdate-94359018868178948-127.0.0.1:46370_o_%2Fwq-n_0000000000) [n:127.0.0.1:46370_o_%2Fwq    ] o.a.s.c.Overseer processMessage: queueSize: 1, message = {
   [junit4]   2>   "base_url":"http://127.0.0.1:46370/o_/wq",
   [junit4]   2>   "core":"collection1",
   [junit4]   2>   "collection":"control_collection",
   [junit4]   2>   "operation":"state",
   [junit4]   2>   "core_node_name":"core_node1",
   [junit4]   2>   "node_name":"127.0.0.1:46370_o_%2Fwq",
   [junit4]   2>   "roles":null,
   [junit4]   2>   "numShards":"1",
   [junit4]   2>   "shard":"shard1",
   [junit4]   2>   "state":"active"} current state version: 2
   [junit4]   2> 487084 INFO  (OverseerStateUpdate-94359018868178948-127.0.0.1:46370_o_%2Fwq-n_0000000000) [n:127.0.0.1:46370_o_%2Fwq    ] o.a.s.c.o.ReplicaMutator Update state numShards=1 message={
   [junit4]   2>   "base_url":"http://127.0.0.1:46370/o_/wq",
   [junit4]   2>   "core":"collection1",
   [junit4]   2>   "collection":"control_collection",
   [junit4]   2>   "operation":"state",
   [junit4]   2>   "core_node_name":"core_node1",
   [junit4]   2>   "node_name":"127.0.0.1:46370_o_%2Fwq",
   [junit4]   2>   "roles":null,
   [junit4]   2>   "numShards":"1",
   [junit4]   2>   "shard":"shard1",
   [junit4]   2>   "state":"active"}
   [junit4]   2> 487165 INFO  (TEST-HttpPartitionTest.test-seed#[47D2483C1DE5BF5B]) [    ] o.a.s.c.c.SolrZkClient Using default ZkCredentialsProvider
   [junit4]   2> 487165 INFO  (TEST-HttpPartitionTest.test-seed#[47D2483C1DE5BF5B]) [    ] o.a.s.c.c.ConnectionManager Waiting for client to connect to ZooKeeper
   [junit4]   2> 487166 INFO  (zkCallback-332-thread-1) [    ] o.a.s.c.c.ConnectionManager Watcher org.apache.solr.common.cloud.ConnectionManager@5b6c92ab name:ZooKeeperConnection Watcher:127.0.0.1:56213/solr got event WatchedEvent state:SyncConnected type:None path:null path:null type:None
   [junit4]   2> 487166 INFO  (TEST-HttpPartitionTest.test-seed#[47D2483C1DE5BF5B]) [    ] o.a.s.c.c.ConnectionManager Client is connected to ZooKeeper
   [junit4]   2> 487167 INFO  (TEST-HttpPartitionTest.test-seed#[47D2483C1DE5BF5B]) [    ] o.a.s.c.c.SolrZkClient Using default ZkACLProvider
   [junit4]   2> 487167 INFO  (TEST-HttpPartitionTest.test-seed#[47D2483C1DE5BF5B]) [    ] o.a.s.c.c.ZkStateReader Updating cluster state from ZooKeeper... 
   [junit4]   2> 487168 INFO  (TEST-HttpPartitionTest.test-seed#[47D2483C1DE5BF5B]) [    ] o.a.s.c.ChaosMonkey monkey: init - expire sessions:false cause connection loss:false
   [junit4]   2> 487186 INFO  (zkCallback-332-thread-1) [    ] o.a.s.c.c.ZkStateReader A cluster state change: WatchedEvent state:SyncConnected type:NodeDataChanged path:/clusterstate.json, has occurred - updating... (live nodes size: 1)
   [junit4]   2> 487186 INFO  (zkCallback-330-thread-1-processing-n:127.0.0.1:46370_o_%2Fwq) [n:127.0.0.1:46370_o_%2Fwq    ] o.a.s.c.c.ZkStateReader A cluster state change: WatchedEvent state:SyncConnected type:NodeDataChanged path:/clusterstate.json, has occurred - updating... (live nodes size: 1)
   [junit4]   2> 487216 INFO  (TEST-HttpPartitionTest.test-seed#[47D2483C1DE5BF5B]) [    ] o.a.s.SolrTestCaseJ4 Writing core.properties file to /home/jenkins/workspace/Lucene-Solr-5.x-Linux/solr/build/solr-core/test/J2/temp/solr.cloud.HttpPartitionTest_47D2483C1DE5BF5B-001/shard-1-001/cores/collection1
   [junit4]   2> 487217 INFO  (TEST-HttpPartitionTest.test-seed#[47D2483C1DE5BF5B]) [    ] o.a.s.c.AbstractFullDistribZkTestBase create jetty 1 in directory /home/jenkins/workspace/Lucene-Solr-5.x-Linux/solr/build/solr-core/test/J2/temp/solr.cloud.HttpPartitionTest_47D2483C1DE5BF5B-001/shard-1-001
   [junit4]   2> 487217 INFO  (TEST-HttpPartitionTest.test-seed#[47D2483C1DE5BF5B]) [    ] o.e.j.s.Server jetty-9.2.11.v20150529
   [junit4]   2> 487218 INFO  (TEST-HttpPartitionTest.test-seed#[47D2483C1DE5BF5B]) [    ] o.e.j.s.h.ContextHandler Started o.e.j.s.ServletContextHandler@4ba7dec0{/o_/wq,null,AVAILABLE}
   [junit4]   2> 487219 INFO  (TEST-HttpPartitionTest.test-seed#[47D2483C1DE5BF5B]) [    ] o.e.j.s.ServerConnector Started ServerConnector@7ff3ce16{HTTP/1.1}{127.0.0.1:39830}
   [junit4]   2> 487219 INFO  (TEST-HttpPartitionTest.test-seed#[47D2483C1DE5BF5B]) [    ] o.e.j.s.Server Started @489473ms
   [junit4]   2> 487219 INFO  (TEST-HttpPartitionTest.test-seed#[47D2483C1DE5BF5B]) [    ] o.a.s.c.s.e.JettySolrRunner Jetty properties: {solrconfig=solrconfig.xml, solr.data.dir=/home/jenkins/workspace/Lucene-Solr-5.x-Linux/solr/build/solr-core/test/J2/temp/solr.cloud.HttpPartitionTest_47D2483C1DE5BF5B-001/tempDir-001/jetty1, hostContext=/o_/wq, coreRootDirectory=/home/jenkins/workspace/Lucene-Solr-5.x-Linux/solr/build/solr-core/test/J2/temp/solr.cloud.HttpPartitionTest_47D2483C1DE5BF5B-001/shard-1-001/cores, hostPort=41211}
   [junit4]   2> 487219 INFO  (TEST-HttpPartitionTest.test-seed#[47D2483C1DE5BF5B]) [    ] o.a.s.s.SolrDispatchFilter SolrDispatchFilter.init(): sun.misc.Launcher$AppClassLoader@321ea24
   [junit4]   2> 487219 INFO  (TEST-HttpPartitionTest.test-seed#[47D2483C1DE5BF5B]) [    ] o.a.s.c.SolrResourceLoader new SolrResourceLoader for directory: '/home/jenkins/workspace/Lucene-Solr-5.x-Linux/solr/build/solr-core/test/J2/temp/solr.cloud.HttpPartitionTest_47D2483C1DE5BF5B-001/shard-1-001/'
   [junit4]   2> 487254 INFO  (TEST-HttpPartitionTest.test-seed#[47D2483C1DE5BF5B]) [    ] o.a.s.c.c.SolrZkClient Using default ZkCredentialsProvider
   [junit4]   2> 487255 INFO  (TEST-HttpPartitionTest.test-seed#[47D2483C1DE5BF5B]) [    ] o.a.s.c.c.ConnectionManager Waiting for client to connect to ZooKeeper
   [junit4]   2> 487256 INFO  (zkCallback-333-thread-1) [    ] o.a.s.c.c.ConnectionManager Watcher org.apache.solr.common.cloud.ConnectionManager@45b07a name:ZooKeeperConnection Watcher:127.0.0.1:56213/solr got event WatchedEvent state:SyncConnected type:None path:null path:null type:None
   [junit4]   2> 487256 INFO  (TEST-HttpPartitionTest.test-seed#[47D2483C1DE5BF5B]) [    ] o.a.s.c.c.ConnectionManager Client is connected to ZooKeeper
   [junit4]   2> 487257 INFO  (TEST-HttpPartitionTest.test-seed#[47D2483C1DE5BF5B]) [    ] o.a.s.c.c.SolrZkClient Using default ZkACLProvider
   [junit4]   2> 487258 INFO  (TEST-HttpPartitionTest.test-seed#[47D2483C1DE5BF5B]) [    ] o.a.s.s.SolrDispatchFilter Loading solr.xml from SolrHome (not found in ZooKeeper)
   [junit4]   2> 487258 INFO  (TEST-HttpPartitionTest.test-seed#[47D2483C1DE5BF5B]) [    ] o.a.s.c.SolrXmlConfig Loading container configuration from /home/jenkins/workspace/Lucene-Solr-5.x-Linux/solr/build/solr-core/test/J2/temp/solr.cloud.HttpPartitionTest_47D2483C1DE5BF5B-001/shard-1-001/solr.xml
   [junit4]   2> 487267 INFO  (TEST-HttpPartitionTest.test-seed#[47D2483C1DE5BF5B]) [    ] o.a.s.c.CoresLocator Config-defined core root directory: /home/jenkins/workspace/Lucene-Solr-5.x-Linux/solr/build/solr-core/test/J2/temp/solr.cloud.HttpPartitionTest_47D2483C1DE5BF5B-001/shard-1-001/cores
   [junit4]   2> 487267 INFO  (TEST-HttpPartitionTest.test-seed#[47D2483C1DE5BF5B]) [    ] o.a.s.c.CoreContainer New CoreContainer 922260092
   [junit4]   2> 487267 INFO  (TEST-HttpPartitionTest.test-seed#[47D2483C1DE5BF5B]) [    ] o.a.s.c.CoreContainer Loading cores into CoreContainer [instanceDir=/home/jenkins/workspace/Lucene-Solr-5.x-Linux/solr/build/solr-core/test/J2/temp/solr.cloud.HttpPartitionTest_47D2483C1DE5BF5B-001/shard-1-001/]
   [junit4]   2> 487267 INFO  (TEST-HttpPartitionTest.test-seed#[47D2483C1DE5BF5B]) [    ] o.a.s.c.CoreContainer loading shared library: /home/jenkins/workspace/Lucene-Solr-5.x-Linux/solr/build/solr-core/test/J2/temp/solr.cloud.HttpPartitionTest_47D2483C1DE5BF5B-001/shard-1-001/lib
   [junit4]   2> 487267 WARN  (TEST-HttpPartitionTest.test-seed#[47D2483C1DE5BF5B]) [    ] o.a.s.c.SolrResourceLoader Can't find (or read) directory to add to classloader: lib (resolved as: /home/jenkins/workspace/Lucene-Solr-5.x-Linux/solr/build/solr-core/test/J2/temp/solr.cloud.HttpPartitionTest_47D2483C1DE5BF5B-001/shard-1-001/lib).
   [junit4]   2> 487272 INFO  (TEST-HttpPartitionTest.test-seed#[47D2483C1DE5BF5B]) [    ] o.a.s.h.c.HttpShardHandlerFactory created with socketTimeout : 90000,urlScheme : ,connTimeout : 15000,maxConnectionsPerHost : 20,maxConnections : 10000,corePoolSize : 0,maximumPoolSize : 2147483647,maxThreadIdleTime : 5,sizeOfQueue : -1,fairnessPolicy : false,useRetries : false,
   [junit4]   2> 487273 INFO  (TEST-HttpPartitionTest.test-seed#[47D2483C1DE5BF5B]) [    ] o.a.s.u.UpdateShardHandler Creating UpdateShardHandler HTTP client with params: socketTimeout=340000&connTimeout=45000&retry=true
   [junit4]   2> 487273 INFO  (TEST-HttpPartitionTest.test-seed#[47D2483C1DE5BF5B]) [    ] o.a.s.l.LogWatcher SLF4J impl is org.slf4j.impl.Log4jLoggerFactory
   [junit4]   2> 487273 INFO  (TEST-HttpPartitionTest.test-seed#[47D2483C1DE5BF5B]) [    ] o.a.s.l.LogWatcher Registering Log Listener [Log4j (org.slf4j.impl.Log4jLoggerFactory)]
   [junit4]   2> 487273 INFO  (TEST-HttpPartitionTest.test-seed#[47D2483C1DE5BF5B]) [    ] o.a.s.c.ZkContainer Zookeeper client=127.0.0.1:56213/solr
   [junit4]   2> 487273 INFO  (TEST-HttpPartitionTest.test-seed#[47D2483C1DE5BF5B]) [    ] o.a.s.c.ZkController zkHost includes chroot
   [junit4]   2> 487273 INFO  (TEST-HttpPartitionTest.test-seed#[47D2483C1DE5BF5B]) [    ] o.a.s.c.c.SolrZkClient Using default ZkCredentialsProvider
   [junit4]   2> 487274 INFO  (TEST-HttpPartitionTest.test-seed#[47D2483C1DE5BF5B]) [    ] o.a.s.c.c.ConnectionManager Waiting for client to connect to ZooKeeper
   [junit4]   2> 487275 INFO  (zkCallback-335-thread-1) [    ] o.a.s.c.c.ConnectionManager Watcher org.apache.solr.common.cloud.ConnectionManager@6f0625f8 name:ZooKeeperConnection Watcher:127.0.0.1:56213 got event WatchedEvent state:SyncConnected type:None path:null path:null type:None
   [junit4]   2> 487275 INFO  (TEST-HttpPartitionTest.test-seed#[47D2483C1DE5BF5B]) [    ] o.a.s.c.c.ConnectionManager Client is connected to ZooKeeper
   [junit4]   2> 487275 INFO  (TEST-HttpPartitionTest.test-seed#[47D2483C1DE5BF5B]) [    ] o.a.s.c.c.SolrZkClient Using default ZkACLProvider
   [junit4]   2> 487277 INFO  (TEST-HttpPartitionTest.test-seed#[47D2483C1DE5BF5B]) [n:127.0.0.1:41211_o_%2Fwq    ] o.a.s.c.c.ConnectionManager Waiting for client to connect to ZooKeeper
   [junit4]   2> 487278 INFO  (zkCallback-336-thread-1-processing-n:127.0.0.1:41211_o_%2Fwq) [n:127.0.0.1:41211_o_%2Fwq    ] o.a.s.c.c.ConnectionManager Watcher org.apache.solr.common.cloud.ConnectionManager@71f56b00 name:ZooKeeperConnection Watcher:127.0.0.1:56213/solr got event WatchedEvent state:SyncConnected type:None path:null path:null type:None
   [junit4]   2> 487278 INFO  (TEST-HttpPartitionTest.test-seed#[47D2483C1DE5BF5B]) [n:127.0.0.1:41211_o_%2Fwq    ] o.a.s.c.c.ConnectionManager Client is connected to ZooKeeper
   [junit4]   2> 487281 INFO  (TEST-HttpPartitionTest.test-seed#[47D2483C1DE5BF5B]) [n:127.0.0.1:41211_o_%2Fwq    ] o.a.s.c.c.ZkStateReader Updating cluster state from ZooKeeper... 
   [junit4]   2> 488282 INFO  (TEST-HttpPartitionTest.test-seed#[47D2483C1DE5BF5B]) [n:127.0.0.1:41211_o_%2Fwq    ] o.a.s.c.ZkController Register node as live in ZooKeeper:/live_nodes/127.0.0.1:41211_o_%2Fwq
   [junit4]   2> 488284 INFO  (TEST-HttpPartitionTest.test-seed#[47D2483C1DE5BF5B]) [n:127.0.0.1:41211_o_%2Fwq    ] o.a.s.c.c.SolrZkClient makePath: /live_nodes/127.0.0.1:41211_o_%2Fwq
   [junit4]   2> 488285 INFO  (zkCallback-336-thread-1-processing-n:127.0.0.1:41211_o_%2Fwq) [n:127.0.0.1:41211_o_%2Fwq    ] o.a.s.c.c.ZkStateReader A live node change: WatchedEvent state:SyncConnected type:NodeChildrenChanged path:/live_nodes, has occurred - updating... (live nodes size: 1)
   [junit4]   2> 488285 INFO  (zkCallback-332-thread-1) [    ] o.a.s.c.c.ZkStateReader A live node change: WatchedEvent state:SyncConnected type:NodeChildrenChanged path:/live_nodes, has occurred - updating... (live nodes size: 1)
   [junit4]   2> 488285 INFO  (zkCallback-330-thread-1-processing-n:127.0.0.1:46370_o_%2Fwq) [n:127.0.0.1:46370_o_%2Fwq    ] o.a.s.c.c.ZkStateReader A live node change: WatchedEvent state:SyncConnected type:NodeChildrenChanged path:/live_nodes, has occurred - updating... (live nodes size: 1)
   [junit4]   2> 488286 INFO  (TEST-HttpPartitionTest.test-seed#[47D2483C1DE5BF5B]) [n:127.0.0.1:41211_o_%2Fwq    ] o.a.s.c.Overseer Overseer (id=null) closing
   [junit4]   2> 488287 INFO  (TEST-HttpPartitionTest.test-seed#[47D2483C1DE5BF5B]) [n:127.0.0.1:41211_o_%2Fwq    ] o.a.s.c.LeaderElector Joined leadership election with path: /overseer_elect/election/94359018868178952-127.0.0.1:41211_o_%2Fwq-n_0000000001
   [junit4]   2> 488287 INFO  (TEST-HttpPartitionTest.test-seed#[47D2483C1DE5BF5B]) [n:127.0.0.1:41211_o_%2Fwq    ] o.a.s.c.LeaderElector Watching path /overseer_elect/election/94359018868178948-127.0.0.1:46370_o_%2Fwq-n_0000000000 to know if I could be the leader
   [junit4]   2> 488297 INFO  (TEST-HttpPartitionTest.test-seed#[47D2483C1DE5BF5B]) [n:127.0.0.1:41211_o_%2Fwq    ] o.a.s.c.CoreContainer Security conf doesn't exist. Skipping setup for authorization module.
   [junit4]   2> 488298 INFO  (TEST-HttpPartitionTest.test-seed#[47D2483C1DE5BF5B]) [n:127.0.0.1:41211_o_%2Fwq    ] o.a.s.c.CoreContainer No authentication plugin used.
   [junit4]   2> 488298 INFO  (TEST-HttpPartitionTest.test-seed#[47D2483C1DE5BF5B]) [n:127.0.0.1:41211_o_%2Fwq    ] o.a.s.c.CoresLocator Looking for core definitions underneath /home/jenkins/workspace/Lucene-Solr-5.x-Linux/solr/build/solr-core/test/J2/temp/solr.cloud.HttpPartitionTest_47D2483C1DE5BF5B-001/shard-1-001/cores
   [junit4]   2> 488299 INFO  (TEST-HttpPartitionTest.test-seed#[47D2483C1DE5BF5B]) [n:127.0.0.1:41211_o_%2Fwq    ] o.a.s.c.SolrCore Created CoreDescriptor: {absoluteInstDir=/home/jenkins/workspace/Lucene-Solr-5.x-Linux/solr/build/solr-core/test/J2/temp/solr.cloud.HttpPartitionTest_47D2483C1DE5BF5B-001/shard-1-001/cores/collection1/, configSetProperties=configsetprops.json, shard=, dataDir=data/, collection=collection1, instanceDir=/home/jenkins/workspace/Lucene-Solr-5.x-Linux/solr/build/solr-core/test/J2/temp/solr.cloud.HttpPartitionTest_47D2483C1DE5BF5B-001/shard-1-001/cores/collection1, coreNodeName=, name=collection1, loadOnStartup=true, transient=false, config=solrconfig.xml, schema=schema.xml}
   [junit4]   2> 488299 INFO  (TEST-HttpPartitionTest.test-seed#[47D2483C1DE5BF5B]) [n:127.0.0.1:41211_o_%2Fwq    ] o.a.s.c.CoresLocator Found core collection1 in /home/jenkins/workspace/Lucene-Solr-5.x-Linux/solr/build/solr-core/test/J2/temp/solr.cloud.HttpPartitionTest_47D2483C1DE5BF5B-001/shard-1-001/cores/collection1/
   [junit4]   2> 488299 INFO  (TEST-HttpPartitionTest.test-seed#[47D2483C1DE5BF5B]) [n:127.0.0.1:41211_o_%2Fwq    ] o.a.s.c.CoresLocator Found 1 core definitions
   [junit4]   2> 488300 INFO  (coreLoadExecutor-1918-thread-1-processing-n:127.0.0.1:41211_o_%2Fwq) [n:127.0.0.1:41211_o_%2Fwq c:collection1   x:collection1] o.a.s.c.ZkController publishing state=down
   [junit4]   2> 488300 INFO  (coreLoadExecutor-1918-thread-1-processing-n:127.0.0.1:41211_o_%2Fwq) [n:127.0.0.1:41211_o_%2Fwq c:collection1   x:collection1] o.a.s.c.ZkController numShards not found on descriptor - reading it from system property
   [junit4]   2> 488300 INFO  (TEST-HttpPartitionTest.test-seed#[47D2483C1DE5BF5B]) [n:127.0.0.1:41211_o_%2Fwq    ] o.a.s.s.SolrDispatchFilter user.dir=/home/jenkins/workspace/Lucene-Solr-5.x-Linux/solr/build/solr-core/test/J2
   [junit4]   2> 488300 INFO  (TEST-HttpPartitionTest.test-seed#[47D2483C1DE5BF5B]) [n:127.0.0.1:41211_o_%2Fwq    ] o.a.s.s.SolrDispatchFilter SolrDispatchFilter.init() done
   [junit4]   2> 488300 INFO  (coreLoadExecutor-1918-thread-1-processing-n:127.0.0.1:41211_o_%2Fwq) [n:127.0.0.1:41211_o_%2Fwq c:collection1   x:collection1] o.a.s.c.ZkController look for our core node name
   [junit4]   2> 488300 INFO  (zkCallback-330-thread-1-processing-n:127.0.0.1:46370_o_%2Fwq) [n:127.0.0.1:46370_o_%2Fwq    ] o.a.s.c.DistributedQueue NodeChildrenChanged fired on path /overseer/queue state SyncConnected
   [junit4]   2> 488301 INFO  (OverseerStateUpdate-94359018868178948-127.0.0.1:46370_o_%2Fwq-n_0000000000) [n:127.0.0.1:46370_o_%2Fwq    ] o.a.s.c.Overseer processMessage: queueSize: 1, message = {
   [junit4]   2>   "base_url":"http://127.0.0.1:41211/o_/wq",
   [junit4]   2>   "core":"collection1",
   [junit4]   2>   "collection":"collection1",
   [junit4]   2>   "operation":"state",
   [junit4]   2>   "node_name":"127.0.0.1:41211_o_%2Fwq",
   [junit4]   2>   "roles":null,
   [junit4]   2>   "numShards":"2",
   [junit4]   2>   "shard":null,
   [junit4]   2>   "state":"down"} current state version: 3
   [junit4]   2> 488301 INFO  (OverseerStateUpdate-94359018868178948-127.0.0.1:46370_o_%2Fwq-n_0000000000) [n:127.0.0.1:46370_o_%2Fwq    ] o.a.s.c.o.ReplicaMutator Update state numShards=2 message={
   [junit4]   2>   "base_url":"http://127.0.0.1:41211/o_/wq",
   [junit4]   2>   "core":"collection1",
   [junit4]   2>   "collection":"collection1",
   [junit4]   2>   "operation":"state",
   [junit4]   2>   "node_name":"127.0.0.1:41211_o_%2Fwq",
   [junit4]   2>   "roles":null,
   [junit4]   2>   "numShards":"2",
   [junit4]   2>   "shard":null,
   [junit4]   2>   "state":"down"}
   [junit4]   2> 488301 INFO  (OverseerStateUpdate-94359018868178948-127.0.0.1:46370_o_%2Fwq-n_0000000000) [n:127.0.0.1:46370_o_%2Fwq    ] o.a.s.c.o.ClusterStateMutator building a new cName: collection1
   [junit4]   2> 488301 INFO  (OverseerStateUpdate-94359018868178948-127.0.0.1:46370_o_%2Fwq-n_0000000000) [n:127.0.0.1:46370_o_%2Fwq    ] o.a.s.c.o.ReplicaMutator Assigning new node to shard shard=shard1
   [junit4]   2> 488403 INFO  (zkCallback-330-thread-1-processing-n:127.0.0.1:46370_o_%2Fwq) [n:127.0.0.1:46370_o_%2Fwq    ] o.a.s.c.c.ZkStateReader A cluster state change: WatchedEvent state:SyncConnected type:NodeDataChanged path:/clusterstate.json, has occurred - updating... (live nodes size: 2)
   [junit4]   2> 488403 INFO  (zkCallback-336-thread-1-processing-n:127.0.0.1:41211_o_%2Fwq) [n:127.0.0.1:41211_o_%2Fwq    ] o.a.s.c.c.ZkStateReader A cluster state change: WatchedEvent state:SyncConnected type:NodeDataChanged path:/clusterstate.json, has occurred - updating... (live nodes size: 2)
   [junit4]   2> 488403 INFO  (zkCallback-332-thread-1) [    ] o.a.s.c.c.ZkStateReader A cluster state change: WatchedEvent state:SyncConnected type:NodeDataChanged path:/clusterstate.json, has occurred - updating... (live nodes size: 2)
   [junit4]   2> 489301 INFO  (coreLoadExecutor-1918-thread-1-processing-n:127.0.0.1:41211_o_%2Fwq) [n:127.0.0.1:41211_o_%2Fwq c:collection1   x:collection1] o.a.s.c.ZkController waiting to find shard id in clusterstate for collection1
   [junit4]   2> 489301 INFO  (coreLoadExecutor-1918-thread-1-processing-n:127.0.0.1:41211_o_%2Fwq) [n:127.0.0.1:41211_o_%2Fwq c:collection1   x:collection1] o.a.s.c.ZkController Check for collection zkNode:collection1
   [junit4]   2> 489301 INFO  (coreLoadExecutor-1918-thread-1-processing-n:127.0.0.1:41211_o_%2Fwq) [n:127.0.0.1:41211_o_%2Fwq c:collection1   x:collection1] o.a.s.c.ZkController Collection zkNode exists
   [junit4]   2> 489301 INFO  (coreLoadExecutor-1918-thread-1-processing-n:127.0.0.1:41211_o_%2Fwq) [n:127.0.0.1:41211_o_%2Fwq c:collection1   x:collection1] o.a.s.c.c.ZkStateReader Load collection config from:/collections/collection1
   [junit4]   2> 489301 INFO  (coreLoadExecutor-1918-thread-1-processing-n:127.0.0.1:41211_o_%2Fwq) [n:127.0.0.1:41211_o_%2Fwq c:collection1   x:collection1] o.a.s.c.c.ZkStateReader path=/collections/collection1 configName=conf1 specified config exists in ZooKeeper
   [junit4]   2> 489301 INFO  (coreLoadExecutor-1918-thread-1-processing-n:127.0.0.1:41211_o_%2Fwq) [n:127.0.0.1:41211_o_%2Fwq c:collection1   x:collection1] o.a.s.c.SolrResourceLoader new SolrResourceLoader for directory: '/home/jenkins/workspace/Lucene-Solr-5.x-Linux/solr/build/solr-core/test/J2/temp/solr.cloud.HttpPartitionTest_47D2483C1DE5BF5B-001/shard-1-001/cores/collection1/'
   [junit4]   2> 489311 INFO  (coreLoadExecutor-1918-thread-1-processing-n:127.0.0.1:41211_o_%2Fwq) [n:127.0.0.1:41211_o_%2Fwq c:collection1   x:collection1] o.a.s.c.Config loaded config solrconfig.xml with version 0 
   [junit4]   2> 489316 INFO  (coreLoadExecutor-1918-thread-1-processing-n:127.0.0.1:41211_o_%2Fwq) [n:127.0.0.1:41211_o_%2Fwq c:collection1   x:collection1] o.a.s.c.SolrConfig current version of requestparams : -1
   [junit4]   2> 489323 INFO  (coreLoadExecutor-1918-thread-1-processing-n:127.0.0.1:41211_o_%2Fwq) [n:127.0.0.1:41211_o_%2Fwq c:collection1   x:collection1] o.a.s.c.SolrConfig Using Lucene MatchVersion: 5.4.0
   [junit4]   2> 489340 INFO  (coreLoadExecutor-1918-thread-1-processing-n:127.0.0.1:41211_o_%2Fwq) [n:127.0.0.1:41211_o_%2Fwq c:collection1   x:collection1] o.a.s.c.Config Loaded SolrConfig: solrconfig.xml
   [junit4]   2> 489340 INFO  (coreLoadExecutor-1918-thread-1-processing-n:127.0.0.1:41211_o_%2Fwq) [n:127.0.0.1:41211_o_%2Fwq c:collection1   x:collection1] o.a.s.s.IndexSchema Reading Solr Schema from /configs/conf1/schema.xml
   [junit4]   2> 489345 INFO  (coreLoadExecutor-1918-thread-1-processing-n:127.0.0.1:41211_o_%2Fwq) [n:127.0.0.1:41211_o_%2Fwq c:collection1   x:collection1] o.a.s.s.IndexSchema [collection1] Schema name=test
   [junit4]   2> 489484 INFO  (coreLoadExecutor-1918-thread-1-processing-n:127.0.0.1:41211_o_%2Fwq) [n:127.0.0.1:41211_o_%2Fwq c:collection1   x:collection1] o.a.s.s.OpenExchangeRatesOrgProvider Initialized with rates=open-exchange-rates.json, refreshInterval=1440.
   [junit4]   2> 489490 INFO  (coreLoadExecutor-1918-thread-1-processing-n:127.0.0.1:41211_o_%2Fwq) [n:127.0.0.1:41211_o_%2Fwq c:collection1   x:collection1] o.a.s.s.IndexSchema default search field in schema is text
   [junit4]   2> 489491 INFO  (coreLoadExecutor-1918-thread-1-processing-n:127.0.0.1:41211_o_%2Fwq) [n:127.0.0.1:41211_o_%2Fwq c:collection1   x:collection1] o.a.s.s.IndexSchema unique key field: id
   [junit4]   2> 489517 INFO  (coreLoadExecutor-1918-thread-1-processing-n:127.0.0.1:41211_o_%2Fwq) [n:127.0.0.1:41211_o_%2Fwq c:collection1   x:collection1] o.a.s.s.FileExchangeRateProvider Reloading exchange rates from file currency.xml
   [junit4]   2> 489520 INFO  (coreLoadExecutor-1918-thread-1-processing-n:127.0.0.1:41211_o_%2Fwq) [n:127.0.0.1:41211_o_%2Fwq c:collection1   x:collection1] o.a.s.s.FileExchangeRateProvider Reloading exchange rates from file currency.xml
   [junit4]   2> 489521 INFO  (coreLoadExecutor-1918-thread-1-processing-n:127.0.0.1:41211_o_%2Fwq) [n:127.0.0.1:41211_o_%2Fwq c:collection1   x:collection1] o.a.s.s.OpenExchangeRatesOrgProvider Reloading exchange rates from open-exchange-rates.json
   [junit4]   2> 489521 WARN  (coreLoadExecutor-1918-thread-1-processing-n:127.0.0.1:41211_o_%2Fwq) [n:127.0.0.1:41211_o_%2Fwq c:collection1   x:collection1] o.a.s.s.OpenExchangeRatesOrgProvider Unknown key IMPORTANT NOTE
   [junit4]   2> 489522 WARN  (coreLoadExecutor-1918-thread-1-processing-n:127.0.0.1:41211_o_%2Fwq) [n:127.0.0.1:41211_o_%2Fwq c:collection1   x:collection1] o.a.s.s.OpenExchangeRatesOrgProvider Expected key, got STRING
   [junit4]   2> 489522 INFO  (coreLoadExecutor-1918-thread-1-processing-n:127.0.0.1:41211_o_%2Fwq) [n:127.0.0.1:41211_o_%2Fwq c:collection1   x:collection1] o.a.s.s.OpenExchangeRatesOrgProvider Reloading exchange rates from open-exchange-rates.json
   [junit4]   2> 489522 WARN  (coreLoadExecutor-1918-thread-1-processing-n:127.0.0.1:41211_o_%2Fwq) [n:127.0.0.1:41211_o_%2Fwq c:collection1   x:collection1] o.a.s.s.OpenExchangeRatesOrgProvider Unknown key IMPORTANT NOTE
   [junit4]   2> 489522 WARN  (coreLoadExecutor-1918-thread-1-processing-n:127.0.0.1:41211_o_%2Fwq) [n:127.0.0.1:41211_o_%2Fwq c:collection1   x:collection1] o.a.s.s.OpenExchangeRatesOrgProvider Expected key, got STRING
   [junit4]   2> 489522 INFO  (coreLoadExecutor-1918-thread-1-processing-n:127.0.0.1:41211_o_%2Fwq) [n:127.0.0.1:41211_o_%2Fwq c:collection1   x:collection1] o.a.s.c.ConfigSetProperties Did not find ConfigSet properties, assuming default properties: Can't find resource 'configsetprops.json' in classpath or '/configs/conf1', cwd=/home/jenkins/workspace/Lucene-Solr-5.x-Linux/solr/build/solr-core/test/J2
   [junit4]   2> 489523 INFO  (coreLoadExecutor-1918-thread-1-processing-n:127.0.0.1:41211_o_%2Fwq) [n:127.0.0.1:41211_o_%2Fwq c:collection1   x:collection1] o.a.s.c.CoreContainer Creating SolrCore 'collection1' using configuration from collection collection1
   [junit4]   2> 489523 INFO  (coreLoadExecutor-1918-thread-1-processing-n:127.0.0.1:41211_o_%2Fwq) [n:127.0.0.1:41211_o_%2Fwq c:collection1 s:shard1 r:core_node1 x:collection1] o.a.s.c.SolrCore org.apache.solr.core.MockDirectoryFactory
   [junit4]   2> 489523 INFO  (coreLoadExecutor-1918-thread-1-processing-n:127.0.0.1:41211_o_%2Fwq) [n:127.0.0.1:41211_o_%2Fwq c:collection1 s:shard1 r:core_node1 x:collection1] o.a.s.c.SolrCore [[collection1] ] Opening new SolrCore at [/home/jenkins/workspace/Lucene-Solr-5.x-Linux/solr/build/solr-core/test/J2/temp/solr.cloud.HttpPartitionTest_47D2483C1DE5BF5B-001/shard-1-001/cores/collection1/], dataDir=[null]
   [junit4]   2> 489523 INFO  (coreLoadExecutor-1918-thread-1-processing-n:127.0.0.1:41211_o_%2Fwq) [n:127.0.0.1:41211_o_%2Fwq c:collection1 s:shard1 r:core_node1 x:collection1] o.a.s.c.JmxMonitoredMap JMX monitoring is enabled. Adding Solr mbeans to JMX Server: com.sun.jmx.mbeanserver.JmxMBeanServer@37bdfa20
   [junit4]   2> 489524 INFO  (coreLoadExecutor-1918

[...truncated too long message...]

concurrent create/delete watches above limit:
   [junit4]   2> 
   [junit4]   2> 	5	/solr/aliases.json
   [junit4]   2> 	4	/solr/configs/conf1
   [junit4]   2> 	4	/solr/security.json
   [junit4]   2> 
   [junit4]   2> Maximum concurrent data watches above limit:
   [junit4]   2> 
   [junit4]   2> 	5	/solr/clusterstate.json
   [junit4]   2> 
   [junit4]   2> Maximum concurrent children watches above limit:
   [junit4]   2> 
   [junit4]   2> 	5	/solr/live_nodes
   [junit4]   2> 	3	/solr/overseer/collection-queue-work
   [junit4]   2> 	3	/solr/overseer/queue
   [junit4]   2> 
   [junit4]   2> 589792 WARN  (TEST-HttpPartitionTest.test-seed#[47D2483C1DE5BF5B]) [n:127.0.0.1:40576_o_%2Fwq c:collection1 s:shard1 r:core_node3 x:collection1] o.a.s.c.SocketProxy Closing 13 connections to: http://127.0.0.1:43415/o_/wq, target: http://127.0.0.1:43185/o_/wq
   [junit4]   2> 589792 WARN  (TEST-HttpPartitionTest.test-seed#[47D2483C1DE5BF5B]) [n:127.0.0.1:40576_o_%2Fwq c:collection1 s:shard1 r:core_node3 x:collection1] o.a.s.c.SocketProxy Closing 6 connections to: http://127.0.0.1:40576/o_/wq, target: http://127.0.0.1:51330/o_/wq
   [junit4]   2> 589792 WARN  (TEST-HttpPartitionTest.test-seed#[47D2483C1DE5BF5B]) [n:127.0.0.1:40576_o_%2Fwq c:collection1 s:shard1 r:core_node3 x:collection1] o.a.s.c.SocketProxy Closing 1 connections to: http://127.0.0.1:46370/o_/wq, target: http://127.0.0.1:45178/o_/wq
   [junit4]   2> 589792 WARN  (TEST-HttpPartitionTest.test-seed#[47D2483C1DE5BF5B]) [n:127.0.0.1:40576_o_%2Fwq c:collection1 s:shard1 r:core_node3 x:collection1] o.a.s.c.SocketProxy Closing 1 connections to: http://127.0.0.1:41211/o_/wq, target: http://127.0.0.1:39830/o_/wq
   [junit4]   2> NOTE: reproduce with: ant test  -Dtestcase=HttpPartitionTest -Dtests.method=test -Dtests.seed=47D2483C1DE5BF5B -Dtests.multiplier=3 -Dtests.slow=true -Dtests.locale=ms -Dtests.timezone=Africa/Blantyre -Dtests.asserts=true -Dtests.file.encoding=UTF-8
   [junit4] FAILURE  104s J2 | HttpPartitionTest.test <<<
   [junit4]    > Throwable #1: java.lang.AssertionError: Didn't see all replicas for shard shard1 in c8n_1x2 come up within 30000 ms! ClusterState: {
   [junit4]    >   "c8n_1x2":{
   [junit4]    >     "shards":{"shard1":{
   [junit4]    >         "range":"80000000-7fffffff",
   [junit4]    >         "state":"active",
   [junit4]    >         "replicas":{
   [junit4]    >           "core_node1":{
   [junit4]    >             "base_url":"http://127.0.0.1:43415/o_/wq",
   [junit4]    >             "core":"c8n_1x2_shard1_replica1",
   [junit4]    >             "node_name":"127.0.0.1:43415_o_%2Fwq",
   [junit4]    >             "state":"active",
   [junit4]    >             "leader":"true"},
   [junit4]    >           "core_node2":{
   [junit4]    >             "base_url":"http://127.0.0.1:41211/o_/wq",
   [junit4]    >             "core":"c8n_1x2_shard1_replica2",
   [junit4]    >             "node_name":"127.0.0.1:41211_o_%2Fwq",
   [junit4]    >             "state":"active"}}}},
   [junit4]    >     "router":{"name":"compositeId"},
   [junit4]    >     "maxShardsPerNode":"1",
   [junit4]    >     "autoAddReplicas":"false",
   [junit4]    >     "replicationFactor":"2"},
   [junit4]    >   "collection1":{
   [junit4]    >     "shards":{
   [junit4]    >       "shard1":{
   [junit4]    >         "range":"80000000-ffffffff",
   [junit4]    >         "state":"active",
   [junit4]    >         "replicas":{
   [junit4]    >           "core_node1":{
   [junit4]    >             "base_url":"http://127.0.0.1:41211/o_/wq",
   [junit4]    >             "core":"collection1",
   [junit4]    >             "node_name":"127.0.0.1:41211_o_%2Fwq",
   [junit4]    >             "state":"active",
   [junit4]    >             "leader":"true"},
   [junit4]    >           "core_node3":{
   [junit4]    >             "base_url":"http://127.0.0.1:40576/o_/wq",
   [junit4]    >             "core":"collection1",
   [junit4]    >             "node_name":"127.0.0.1:40576_o_%2Fwq",
   [junit4]    >             "state":"active"}}},
   [junit4]    >       "shard2":{
   [junit4]    >         "range":"0-7fffffff",
   [junit4]    >         "state":"active",
   [junit4]    >         "replicas":{"core_node2":{
   [junit4]    >             "base_url":"http://127.0.0.1:43415/o_/wq",
   [junit4]    >             "core":"collection1",
   [junit4]    >             "node_name":"127.0.0.1:43415_o_%2Fwq",
   [junit4]    >             "state":"active",
   [junit4]    >             "leader":"true"}}}},
   [junit4]    >     "router":{"name":"compositeId"},
   [junit4]    >     "maxShardsPerNode":"1",
   [junit4]    >     "autoAddReplicas":"false",
   [junit4]    >     "autoCreated":"true",
   [junit4]    >     "replicationFactor":"1"},
   [junit4]    >   "control_collection":{
   [junit4]    >     "shards":{"shard1":{
   [junit4]    >         "range":"80000000-7fffffff",
   [junit4]    >         "state":"active",
   [junit4]    >         "replicas":{"core_node1":{
   [junit4]    >             "base_url":"http://127.0.0.1:46370/o_/wq",
   [junit4]    >             "core":"collection1",
   [junit4]    >             "node_name":"127.0.0.1:46370_o_%2Fwq",
   [junit4]    >             "state":"active",
   [junit4]    >             "leader":"true"}}}},
   [junit4]    >     "router":{"name":"compositeId"},
   [junit4]    >     "maxShardsPerNode":"1",
   [junit4]    >     "autoAddReplicas":"false",
   [junit4]    >     "autoCreated":"true",
   [junit4]    >     "replicationFactor":"1"}}
   [junit4]    > 	at __randomizedtesting.SeedInfo.seed([47D2483C1DE5BF5B:CF8677E6B319D2A3]:0)
   [junit4]    > 	at org.apache.solr.cloud.AbstractFullDistribZkTestBase.ensureAllReplicasAreActive(AbstractFullDistribZkTestBase.java:1844)
   [junit4]    > 	at org.apache.solr.cloud.HttpPartitionTest.testRf2(HttpPartitionTest.java:249)
   [junit4]    > 	at org.apache.solr.cloud.HttpPartitionTest.test(HttpPartitionTest.java:103)
   [junit4]    > 	at org.apache.solr.BaseDistributedSearchTestCase$ShardsRepeatRule$ShardsFixedStatement.callStatement(BaseDistributedSearchTestCase.java:963)
   [junit4]    > 	at org.apache.solr.BaseDistributedSearchTestCase$ShardsRepeatRule$ShardsStatement.evaluate(BaseDistributedSearchTestCase.java:938)
   [junit4]    > 	at java.lang.Thread.run(Thread.java:745)
   [junit4]   2> 589800 INFO  (SUITE-HttpPartitionTest-seed#[47D2483C1DE5BF5B]-worker) [n:127.0.0.1:40576_o_%2Fwq c:collection1 s:shard1 r:core_node3 x:collection1] o.a.s.SolrTestCaseJ4 ###deleteCore
   [junit4]   2> NOTE: leaving temporary files on disk at: /home/jenkins/workspace/Lucene-Solr-5.x-Linux/solr/build/solr-core/test/J2/temp/solr.cloud.HttpPartitionTest_47D2483C1DE5BF5B-001
   [junit4]   2> Aug 17, 2015 9:41:09 AM com.carrotsearch.randomizedtesting.ThreadLeakControl checkThreadLeaks
   [junit4]   2> WARNING: Will linger awaiting termination of 1 leaked thread(s).
   [junit4]   2> NOTE: test params are: codec=Asserting(Lucene53): {multiDefault=Lucene50(blocksize=128), a_t=Lucene50(blocksize=128), timestamp=Lucene50(blocksize=128), range_facet_i_dv=Lucene50(blocksize=128), range_facet_l=Lucene50(blocksize=128), intDefault=PostingsFormat(name=MockRandom), text=FSTOrd50, range_facet_l_dv=FST50, id=FST50, _version_=PostingsFormat(name=MockRandom)}, docValues:{timestamp=DocValuesFormat(name=Direct), range_facet_i_dv=DocValuesFormat(name=Direct), range_facet_l_dv=DocValuesFormat(name=Lucene50)}, sim=DefaultSimilarity, locale=ms, timezone=Africa/Blantyre
   [junit4]   2> NOTE: Linux 3.19.0-25-generic amd64/Oracle Corporation 1.7.0_80 (64-bit)/cpus=12,threads=1,free=396341352,total=536870912
   [junit4]   2> NOTE: All tests run in this JVM: [TestUtils, SpellCheckCollatorTest, SmileWriterTest, TestBinaryResponseWriter, QueryResultKeyTest, FullSolrCloudDistribCmdsTest, TestQueryTypes, HdfsRecoverLeaseTest, CustomCollectionTest, TestCSVResponseWriter, FileBasedSpellCheckerTest, SolrInfoMBeanTest, SynonymTokenizerTest, TestFastOutputStream, IgnoreCommitOptimizeUpdateProcessorFactoryTest, TestShardHandlerFactory, TestTrie, TestInfoStreamLogging, PolyFieldTest, TestRequestStatusCollectionAPI, MoreLikeThisHandlerTest, TestSchemaManager, TestRemoveLastDynamicCopyField, BlockCacheTest, TestRestoreCore, PathHierarchyTokenizerFactoryTest, ShardSplitTest, OverseerCollectionProcessorTest, SpatialHeatmapFacetsTest, SimpleFacetsTest, TestConfigSets, TestRawResponseWriter, SuggesterTest, VersionInfoTest, CoreAdminRequestStatusTest, QueryEqualityTest, DocExpirationUpdateProcessorFactoryTest, SpatialRPTFieldTypeTest, TestRandomRequestDistribution, TestDocBasedVersionConstraints, HdfsUnloadDistributedZkTest, SoftAutoCommitTest, SampleTest, AutoCommitTest, TestSmileRequest, HttpPartitionTest]
   [junit4] Completed [196/533] on J2 in 105.18s, 1 test, 1 failure <<< FAILURES!

[...truncated 1051 lines...]
BUILD FAILED
/home/jenkins/workspace/Lucene-Solr-5.x-Linux/build.xml:785: The following error occurred while executing this line:
/home/jenkins/workspace/Lucene-Solr-5.x-Linux/build.xml:729: The following error occurred while executing this line:
/home/jenkins/workspace/Lucene-Solr-5.x-Linux/build.xml:59: The following error occurred while executing this line:
/home/jenkins/workspace/Lucene-Solr-5.x-Linux/solr/build.xml:233: The following error occurred while executing this line:
/home/jenkins/workspace/Lucene-Solr-5.x-Linux/solr/common-build.xml:524: The following error occurred while executing this line:
/home/jenkins/workspace/Lucene-Solr-5.x-Linux/lucene/common-build.xml:1449: The following error occurred while executing this line:
/home/jenkins/workspace/Lucene-Solr-5.x-Linux/lucene/common-build.xml:1003: There were test failures: 533 suites, 2114 tests, 1 failure, 67 ignored (31 assumptions)

Total time: 48 minutes 27 seconds
Build step 'Invoke Ant' marked build as failure
Archiving artifacts
[WARNINGS] Skipping publisher since build result is FAILURE
Recording test results
Email was triggered for: Failure - Any
Sending email for trigger: Failure - Any