You are viewing a plain text version of this content. The canonical link for it is here.
Posted to commits@myfaces.apache.org by Apache Hudson Server <hu...@hudson.apache.org> on 2011/01/30 01:45:33 UTC

Build failed in Hudson: ExtVal for JSF 1.2 (nightly) #41

See <https://hudson.apache.org/hudson/job/ExtVal%20for%20JSF%201.2%20(nightly)/41/>

------------------------------------------
[...truncated 2397 lines...]
[INFO] Using 'UTF-8' encoding to copy filtered resources.
[INFO] 
[INFO] --- maven-resources-plugin:2.4.3:resources (default-resources) @ examples-feature-set_01 ---[INFO] Copying 0 resource to META-INF
[INFO] skip non existing resourceDirectory <https://hudson.apache.org/hudson/job/ExtVal%20for%20JSF%201.2%20(nightly)/ws/trunk/examples/feature-set_01/src/main/resources>
[INFO] Copying 3 resources

[INFO] 
[INFO] --- maven-compiler-plugin:2.3.1:compile (default-compile) @ examples-feature-set_01 ---
[INFO] Compiling 2 source files to <https://hudson.apache.org/hudson/job/ExtVal%20for%20JSF%201.2%20(nightly)/ws/trunk/examples/feature-set_01/target/classes>
[INFO] [INFO] Using 'UTF-8' encoding to copy filtered resources.

[INFO] --- maven-resources-plugin:2.4.3:testResources (default-testResources) @ examples-feature-set_01 ---[INFO] skip non existing resourceDirectory <https://hudson.apache.org/hudson/job/ExtVal%20for%20JSF%201.2%20(nightly)/ws/trunk/examples/feature-set_01/src/test/resources>
[INFO] Copying 3 resources

[INFO] [INFO] No sources to compile

[INFO] --- maven-compiler-plugin:2.3.1:testCompile (default-testCompile) @ examples-feature-set_01 ---
[INFO] 
[INFO] --- maven-surefire-plugin:2.5:test (default-test) @ examples-feature-set_01 ---
[INFO] Surefire report directory: <https://hudson.apache.org/hudson/job/ExtVal%20for%20JSF%201.2%20(nightly)/ws/trunk/examples/feature-set_01/target/surefire-reports>

-------------------------------------------------------
 T E S T S
-------------------------------------------------------
There are no tests to run.

Results :

Tests run: 0, Failures: 0, Errors: 0, Skipped: 0

[HUDSON] Recording test results
[INFO] 
[INFO] --- maven-war-plugin:2.1.1:war (default-war) @ examples-feature-set_01 ---[INFO] Packaging webapp
[INFO] Assembling webapp [examples-feature-set_01] in [<https://hudson.apache.org/hudson/job/ExtVal%20for%20JSF%201.2%20(nightly)/ws/trunk/examples/feature-set_01/target/examples-feature-set_01-1.2.5-SNAPSHOT]>
[INFO] Processing war project
[INFO] Copying webapp resources [<https://hudson.apache.org/hudson/job/ExtVal%20for%20JSF%201.2%20(nightly)/ws/trunk/examples/feature-set_01/src/main/webapp]>

[INFO] Webapp assembled in [690 msecs]
[INFO] Building war: <https://hudson.apache.org/hudson/job/ExtVal%20for%20JSF%201.2%20(nightly)/ws/trunk/examples/feature-set_01/target/examples-feature-set_01-1.2.5-SNAPSHOT.war>
[INFO] WEB-INF/web.xml already added, skipping
mojo forkStarted org.apache.maven.plugins:maven-source-plugin:2.1.2(attach-sources)
forkedProjectStarted org.apache.myfaces.extensions.validator.examples:examples-feature-set_011.2.5-SNAPSHOT
[INFO] 
[INFO] --- maven-antrun-plugin:1.3:run (javadoc.resources) @ examples-feature-set_01 ---[INFO] Executing tasks
[INFO] Executed tasks

forkedProjectSucceeded org.apache.myfaces.extensions.validator.examples:examples-feature-set_011.2.5-SNAPSHOT
[HUDSON] Archiving <https://hudson.apache.org/hudson/job/ExtVal%20for%20JSF%201.2%20(nightly)/ws/trunk/examples/feature-set_01/pom.xml> to /home/hudson/hudson/jobs/ExtVal for JSF 1.2 (nightly)/modules/org.apache.myfaces.extensions.validator.examples$examples-feature-set_01/builds/2011-01-30_00-04-46/archive/org.apache.myfaces.extensions.validator.examples/examples-feature-set_01/1.2.5-SNAPSHOT/pom.xml
[HUDSON] Archiving <https://hudson.apache.org/hudson/job/ExtVal%20for%20JSF%201.2%20(nightly)/ws/trunk/examples/feature-set_01/target/examples-feature-set_01-1.2.5-SNAPSHOT.war> to /home/hudson/hudson/jobs/ExtVal for JSF 1.2 (nightly)/modules/org.apache.myfaces.extensions.validator.examples$examples-feature-set_01/builds/2011-01-30_00-04-46/archive/org.apache.myfaces.extensions.validator.examples/examples-feature-set_01/1.2.5-SNAPSHOT/examples-feature-set_01-1.2.5-SNAPSHOT.war
mojo forkSucceeded org.apache.maven.plugins:maven-source-plugin:2.1.2(attach-sources)
ignoring exception during new ExecutedMojo null
[INFO] 
[INFO] --- maven-source-plugin:2.1.2:jar (attach-sources) @ examples-feature-set_01 ---
[INFO] META-INF already added, skipping
[INFO] META-INF/NOTICE already added, skipping
[INFO] META-INF/LICENSE already added, skipping
[INFO] META-INF/DEPENDENCIES already added, skipping
[INFO] Building jar: <https://hudson.apache.org/hudson/job/ExtVal%20for%20JSF%201.2%20(nightly)/ws/trunk/examples/feature-set_01/target/examples-feature-set_01-1.2.5-SNAPSHOT-sources.jar>
[INFO] META-INF already added, skipping
[INFO] META-INF/NOTICE already added, skipping
[INFO] META-INF/LICENSE already added, skipping
[INFO] META-INF/DEPENDENCIES already added, skipping
mojo forkStarted org.apache.maven.plugins:maven-checkstyle-plugin:2.2(verify-style)
forkedProjectStarted org.apache.myfaces.extensions.validator.examples:examples-feature-set_011.2.5-SNAPSHOT
[INFO] 
[INFO] --- maven-checkstyle-plugin:2.2:checkstyle (checkstyle) @ examples-feature-set_01 ---
forkedProjectSucceeded org.apache.myfaces.extensions.validator.examples:examples-feature-set_011.2.5-SNAPSHOT
[HUDSON] Archiving <https://hudson.apache.org/hudson/job/ExtVal%20for%20JSF%201.2%20(nightly)/ws/trunk/examples/feature-set_01/target/examples-feature-set_01-1.2.5-SNAPSHOT-sources.jar> to /home/hudson/hudson/jobs/ExtVal for JSF 1.2 (nightly)/modules/org.apache.myfaces.extensions.validator.examples$examples-feature-set_01/builds/2011-01-30_00-04-46/archive/org.apache.myfaces.extensions.validator.examples/examples-feature-set_01/1.2.5-SNAPSHOT/examples-feature-set_01-1.2.5-SNAPSHOT-sources.jar
mojo forkSucceeded org.apache.maven.plugins:maven-checkstyle-plugin:2.2(verify-style)
[INFO] 
[INFO] --- maven-checkstyle-plugin:2.2:check (verify-style) @ examples-feature-set_01 ---
[INFO] 
[INFO] --- maven-install-plugin:2.3:install (default-install) @ examples-feature-set_01 ---[INFO] Installing <https://hudson.apache.org/hudson/job/ExtVal%20for%20JSF%201.2%20(nightly)/ws/trunk/examples/feature-set_01/target/examples-feature-set_01-1.2.5-SNAPSHOT.war> to /export/home/hudson/.m2/repository/org/apache/myfaces/extensions/validator/examples/examples-feature-set_01/1.2.5-SNAPSHOT/examples-feature-set_01-1.2.5-SNAPSHOT.war
[INFO] Installing <https://hudson.apache.org/hudson/job/ExtVal%20for%20JSF%201.2%20(nightly)/ws/trunk/examples/feature-set_01/pom.xml> to /export/home/hudson/.m2/repository/org/apache/myfaces/extensions/validator/examples/examples-feature-set_01/1.2.5-SNAPSHOT/examples-feature-set_01-1.2.5-SNAPSHOT.pom
[INFO] Installing <https://hudson.apache.org/hudson/job/ExtVal%20for%20JSF%201.2%20(nightly)/ws/trunk/examples/feature-set_01/target/examples-feature-set_01-1.2.5-SNAPSHOT-sources.jar> to /export/home/hudson/.m2/repository/org/apache/myfaces/extensions/validator/examples/examples-feature-set_01/1.2.5-SNAPSHOT/examples-feature-set_01-1.2.5-SNAPSHOT-sources.jar

projectSucceeded org.apache.myfaces.extensions.validator.examples:examples-feature-set_01:1.2.5-SNAPSHOT
[INFO]                                                                         
[INFO] ------------------------------------------------------------------------
[INFO] Building MyFaces Extensions-Validator examples feature-set 02 1.2.5-SNAPSHOT
[INFO] ------------------------------------------------------------------------
[INFO] 
[INFO] --- maven-clean-plugin:2.3:clean (default-clean) @ examples-feature-set_02 ---
[INFO] 
[INFO] --- maven-antrun-plugin:1.3:run (javadoc.resources) @ examples-feature-set_02 ---[INFO] Executing tasks
[INFO] Executed tasks

[INFO] 
[INFO] --- maven-remote-resources-plugin:1.1:process (default) @ examples-feature-set_02 ---
[INFO] 
[INFO] --- maven-resources-plugin:2.4.3:resources (default-resources) @ examples-feature-set_02 ---[INFO] Using 'UTF-8' encoding to copy filtered resources.
[INFO] Copying 0 resource to META-INF
[INFO] skip non existing resourceDirectory <https://hudson.apache.org/hudson/job/ExtVal%20for%20JSF%201.2%20(nightly)/ws/trunk/examples/feature-set_02/src/main/resources>
[INFO] Copying 3 resources

[INFO] 
[INFO] --- maven-compiler-plugin:2.3.1:compile (default-compile) @ examples-feature-set_02 ---[INFO] Compiling 4 source files to <https://hudson.apache.org/hudson/job/ExtVal%20for%20JSF%201.2%20(nightly)/ws/trunk/examples/feature-set_02/target/classes>

[INFO] 
[INFO] --- maven-resources-plugin:2.4.3:testResources (default-testResources) @ examples-feature-set_02 ---[INFO] Using 'UTF-8' encoding to copy filtered resources.
[INFO] skip non existing resourceDirectory <https://hudson.apache.org/hudson/job/ExtVal%20for%20JSF%201.2%20(nightly)/ws/trunk/examples/feature-set_02/src/test/resources>
[INFO] Copying 3 resources

[INFO] 
[INFO] --- maven-compiler-plugin:2.3.1:testCompile (default-testCompile) @ examples-feature-set_02 ---[INFO] No sources to compile

[INFO] 
[INFO] --- maven-surefire-plugin:2.5:test (default-test) @ examples-feature-set_02 ---[INFO] Surefire report directory: <https://hudson.apache.org/hudson/job/ExtVal%20for%20JSF%201.2%20(nightly)/ws/trunk/examples/feature-set_02/target/surefire-reports>


-------------------------------------------------------
 T E S T S
-------------------------------------------------------
There are no tests to run.

Results :

Tests run: 0, Failures: 0, Errors: 0, Skipped: 0

[HUDSON] Recording test results
[INFO] [INFO] Packaging webapp

[INFO] Assembling webapp [examples-feature-set_02] in [<https://hudson.apache.org/hudson/job/ExtVal%20for%20JSF%201.2%20(nightly)/ws/trunk/examples/feature-set_02/target/examples-feature-set_02-1.2.5-SNAPSHOT]>
[INFO] Processing war project
[INFO] --- maven-war-plugin:2.1.1:war (default-war) @ examples-feature-set_02 ---[INFO] Copying webapp resources [<https://hudson.apache.org/hudson/job/ExtVal%20for%20JSF%201.2%20(nightly)/ws/trunk/examples/feature-set_02/src/main/webapp]>

[INFO] Webapp assembled in [274 msecs]
[INFO] Building war: <https://hudson.apache.org/hudson/job/ExtVal%20for%20JSF%201.2%20(nightly)/ws/trunk/examples/feature-set_02/target/examples-feature-set_02-1.2.5-SNAPSHOT.war>
[INFO] WEB-INF/web.xml already added, skipping
mojo forkStarted org.apache.maven.plugins:maven-source-plugin:2.1.2(attach-sources)
forkedProjectStarted org.apache.myfaces.extensions.validator.examples:examples-feature-set_021.2.5-SNAPSHOT
[INFO] 
[INFO] --- maven-antrun-plugin:1.3:run (javadoc.resources) @ examples-feature-set_02 ---[INFO] Executing tasks
[INFO] Executed tasks

forkedProjectSucceeded org.apache.myfaces.extensions.validator.examples:examples-feature-set_021.2.5-SNAPSHOT
[HUDSON] Archiving <https://hudson.apache.org/hudson/job/ExtVal%20for%20JSF%201.2%20(nightly)/ws/trunk/examples/feature-set_02/pom.xml> to /home/hudson/hudson/jobs/ExtVal for JSF 1.2 (nightly)/modules/org.apache.myfaces.extensions.validator.examples$examples-feature-set_02/builds/2011-01-30_00-04-46/archive/org.apache.myfaces.extensions.validator.examples/examples-feature-set_02/1.2.5-SNAPSHOT/pom.xml
[HUDSON] Archiving <https://hudson.apache.org/hudson/job/ExtVal%20for%20JSF%201.2%20(nightly)/ws/trunk/examples/feature-set_02/target/examples-feature-set_02-1.2.5-SNAPSHOT.war> to /home/hudson/hudson/jobs/ExtVal for JSF 1.2 (nightly)/modules/org.apache.myfaces.extensions.validator.examples$examples-feature-set_02/builds/2011-01-30_00-04-46/archive/org.apache.myfaces.extensions.validator.examples/examples-feature-set_02/1.2.5-SNAPSHOT/examples-feature-set_02-1.2.5-SNAPSHOT.war
mojo forkSucceeded org.apache.maven.plugins:maven-source-plugin:2.1.2(attach-sources)
ignoring exception during new ExecutedMojo null
[INFO] 
[INFO] --- maven-source-plugin:2.1.2:jar (attach-sources) @ examples-feature-set_02 ---
[INFO] META-INF already added, skipping
[INFO] META-INF/NOTICE already added, skipping
[INFO] META-INF/DEPENDENCIES already added, skipping
[INFO] META-INF/LICENSE already added, skipping
[INFO] Building jar: <https://hudson.apache.org/hudson/job/ExtVal%20for%20JSF%201.2%20(nightly)/ws/trunk/examples/feature-set_02/target/examples-feature-set_02-1.2.5-SNAPSHOT-sources.jar>
[INFO] META-INF already added, skipping
[INFO] META-INF/NOTICE already added, skipping
[INFO] META-INF/DEPENDENCIES already added, skipping
[INFO] META-INF/LICENSE already added, skipping
mojo forkStarted org.apache.maven.plugins:maven-checkstyle-plugin:2.2(verify-style)
forkedProjectStarted org.apache.myfaces.extensions.validator.examples:examples-feature-set_021.2.5-SNAPSHOT
[INFO] 
[INFO] --- maven-checkstyle-plugin:2.2:checkstyle (checkstyle) @ examples-feature-set_02 ---
forkedProjectSucceeded org.apache.myfaces.extensions.validator.examples:examples-feature-set_021.2.5-SNAPSHOT
[HUDSON] Archiving <https://hudson.apache.org/hudson/job/ExtVal%20for%20JSF%201.2%20(nightly)/ws/trunk/examples/feature-set_02/target/examples-feature-set_02-1.2.5-SNAPSHOT-sources.jar> to /home/hudson/hudson/jobs/ExtVal for JSF 1.2 (nightly)/modules/org.apache.myfaces.extensions.validator.examples$examples-feature-set_02/builds/2011-01-30_00-04-46/archive/org.apache.myfaces.extensions.validator.examples/examples-feature-set_02/1.2.5-SNAPSHOT/examples-feature-set_02-1.2.5-SNAPSHOT-sources.jar
mojo forkSucceeded org.apache.maven.plugins:maven-checkstyle-plugin:2.2(verify-style)
[INFO] 
[INFO] --- maven-checkstyle-plugin:2.2:check (verify-style) @ examples-feature-set_02 ---
[INFO] 
[INFO] --- maven-install-plugin:2.3:install (default-install) @ examples-feature-set_02 ---[INFO] Installing <https://hudson.apache.org/hudson/job/ExtVal%20for%20JSF%201.2%20(nightly)/ws/trunk/examples/feature-set_02/target/examples-feature-set_02-1.2.5-SNAPSHOT.war> to /export/home/hudson/.m2/repository/org/apache/myfaces/extensions/validator/examples/examples-feature-set_02/1.2.5-SNAPSHOT/examples-feature-set_02-1.2.5-SNAPSHOT.war

[INFO] Installing <https://hudson.apache.org/hudson/job/ExtVal%20for%20JSF%201.2%20(nightly)/ws/trunk/examples/feature-set_02/pom.xml> to /export/home/hudson/.m2/repository/org/apache/myfaces/extensions/validator/examples/examples-feature-set_02/1.2.5-SNAPSHOT/examples-feature-set_02-1.2.5-SNAPSHOT.pom
[INFO] Installing <https://hudson.apache.org/hudson/job/ExtVal%20for%20JSF%201.2%20(nightly)/ws/trunk/examples/feature-set_02/target/examples-feature-set_02-1.2.5-SNAPSHOT-sources.jar> to /export/home/hudson/.m2/repository/org/apache/myfaces/extensions/validator/examples/examples-feature-set_02/1.2.5-SNAPSHOT/examples-feature-set_02-1.2.5-SNAPSHOT-sources.jar
projectSucceeded org.apache.myfaces.extensions.validator.examples:examples-feature-set_02:1.2.5-SNAPSHOT
sessionEnded
[INFO] ------------------------------------------------------------------------
[INFO] Reactor Summary:
[INFO] 
[INFO] Apache MyFaces Extensions-Validator Module ........ SUCCESS [1:09.469s]
[INFO] MyFaces Extensions-Validator Core ................. SUCCESS [1:27.921s]
[INFO] MyFaces Extensions-Validator Validation-Modules ... SUCCESS [13.528s]
[INFO] MyFaces Extensions-Validator Property-Validation-Module  SUCCESS [55.217s]
[INFO] MyFaces Extensions-Validator Bean-Validation-Integration-Module (JSR 303)  SUCCESS [49.084s]
[INFO] MyFaces Extensions-Validator Component-Support Modules  SUCCESS [15.408s]
[INFO] MyFaces Extensions-Validator Trinidad Support Module  SUCCESS [43.895s]
[INFO] MyFaces Extensions-Validator Generic Support Module  SUCCESS [42.764s]
[INFO] MyFaces Extensions-Validator Test-Modules ......... SUCCESS [26.721s]
[INFO] MyFaces Extensions-Validator Base-Test-Infrastructure  SUCCESS [43.769s]
[INFO] MyFaces Extensions-Validator Core-Tests ........... SUCCESS [54.353s]
[INFO] MyFaces Extensions-Validator Property-Validation-Tests  SUCCESS [52.145s]
[INFO] MyFaces Extensions-Validator Bean-Validation-Integration-Tests  SUCCESS [45.736s]
[INFO] MyFaces Extensions-Validator Trinidad Component-Support-Tests  SUCCESS [44.645s]
[INFO] MyFaces Extensions-Validator examples project ..... SUCCESS [14.035s]
[INFO] MyFaces Extensions-Validator examples hello world . SUCCESS [3:08.364s]
[INFO] MyFaces Extensions-Validator examples hello bean-validation  SUCCESS [4:28.543s]
[INFO] MyFaces Extensions-Validator examples feature-set 01  SUCCESS [10:12.713s]
[INFO] MyFaces Extensions-Validator examples feature-set 02  SUCCESS [8:09.405s]
[INFO] ------------------------------------------------------------------------
[INFO] BUILD SUCCESS
[INFO] ------------------------------------------------------------------------
[INFO] Total time: 39:32.526s
[INFO] Finished at: Sun Jan 30 00:47:11 GMT+00:00 2011
[INFO] Final Memory: 26M/194M
[INFO] ------------------------------------------------------------------------
channel stopped
Deploying artifacts to https://repository.apache.org/content/repositories/snapshots
uniqueVersion == false is not anymore supported in maven 3
Deploying the main artifact myfaces-extval-core-1.2.5-SNAPSHOT.jar
ERROR: Error retrieving previous build number for artifact 'org.apache.myfaces.extensions.validator:myfaces-extval-core:jar': repository metadata for: 'snapshot org.apache.myfaces.extensions.validator:myfaces-extval-core:1.2.5-SNAPSHOT' could not be retrieved from repository: apache.snapshots.https due to an error: Error transferring file: Server returned HTTP response code: 502 for URL: https://repository.apache.org/content/repositories/snapshots/org/apache/myfaces/extensions/validator/myfaces-extval-core/1.2.5-SNAPSHOT/maven-metadata.xml
org.apache.maven.artifact.deployer.ArtifactDeploymentException: Error retrieving previous build number for artifact 'org.apache.myfaces.extensions.validator:myfaces-extval-core:jar': repository metadata for: 'snapshot org.apache.myfaces.extensions.validator:myfaces-extval-core:1.2.5-SNAPSHOT' could not be retrieved from repository: apache.snapshots.https due to an error: Error transferring file: Server returned HTTP response code: 502 for URL: https://repository.apache.org/content/repositories/snapshots/org/apache/myfaces/extensions/validator/myfaces-extval-core/1.2.5-SNAPSHOT/maven-metadata.xml
	at hudson.maven.artifact.transform.SnapshotTransformation.transformForDeployment(SnapshotTransformation.java:110)
	at hudson.maven.artifact.transform.DefaultArtifactTransformationManager.transformForDeployment(DefaultArtifactTransformationManager.java:71)
	at hudson.maven.artifact.deployer.DefaultArtifactDeployer.deploy(DefaultArtifactDeployer.java:92)
	at hudson.maven.reporters.MavenArtifactRecord.deployMavenArtifact(MavenArtifactRecord.java:139)
	at hudson.maven.reporters.MavenArtifactRecord.deploy(MavenArtifactRecord.java:126)
	at hudson.maven.RedeployPublisher.perform(RedeployPublisher.java:128)
	at hudson.tasks.BuildStepMonitor$1.perform(BuildStepMonitor.java:19)
	at hudson.model.AbstractBuild$AbstractRunner.perform(AbstractBuild.java:622)
	at hudson.model.AbstractBuild$AbstractRunner.performAllBuildSteps(AbstractBuild.java:601)
	at hudson.maven.MavenModuleSetBuild$RunnerImpl.post2(MavenModuleSetBuild.java:762)
	at hudson.model.AbstractBuild$AbstractRunner.post(AbstractBuild.java:548)
	at hudson.model.Run.run(Run.java:1386)
	at hudson.maven.MavenModuleSetBuild.run(MavenModuleSetBuild.java:405)
	at hudson.model.ResourceController.execute(ResourceController.java:88)
	at hudson.model.Executor.run(Executor.java:145)
Caused by: org.apache.maven.artifact.repository.metadata.RepositoryMetadataResolutionException: repository metadata for: 'snapshot org.apache.myfaces.extensions.validator:myfaces-extval-core:1.2.5-SNAPSHOT' could not be retrieved from repository: apache.snapshots.https due to an error: Error transferring file: Server returned HTTP response code: 502 for URL: https://repository.apache.org/content/repositories/snapshots/org/apache/myfaces/extensions/validator/myfaces-extval-core/1.2.5-SNAPSHOT/maven-metadata.xml
	at org.apache.maven.artifact.repository.metadata.DefaultRepositoryMetadataManager.resolveAlways(DefaultRepositoryMetadataManager.java:400)
	at hudson.maven.artifact.transform.SnapshotTransformation.resolveLatestSnapshotBuildNumber(SnapshotTransformation.java:158)
	at hudson.maven.artifact.transform.SnapshotTransformation.transformForDeployment(SnapshotTransformation.java:104)
	... 14 more
Caused by: org.apache.maven.wagon.TransferFailedException: Error transferring file: Server returned HTTP response code: 502 for URL: https://repository.apache.org/content/repositories/snapshots/org/apache/myfaces/extensions/validator/myfaces-extval-core/1.2.5-SNAPSHOT/maven-metadata.xml
	at org.apache.maven.wagon.providers.http.LightweightHttpWagon.fillInputData(LightweightHttpWagon.java:143)
	at org.apache.maven.wagon.StreamWagon.getInputStream(StreamWagon.java:116)
	at org.apache.maven.wagon.StreamWagon.getIfNewer(StreamWagon.java:88)
	at org.apache.maven.wagon.StreamWagon.get(StreamWagon.java:61)
	at org.apache.maven.repository.legacy.DefaultWagonManager.getRemoteFile(DefaultWagonManager.java:351)
	at org.apache.maven.repository.legacy.DefaultWagonManager.getArtifactMetadataFromDeploymentRepository(DefaultWagonManager.java:215)
	at org.apache.maven.artifact.repository.metadata.DefaultRepositoryMetadataManager.getArtifactMetadataFromDeploymentRepository(DefaultRepositoryMetadataManager.java:424)
	at org.apache.maven.artifact.repository.metadata.DefaultRepositoryMetadataManager.resolveAlways(DefaultRepositoryMetadataManager.java:396)
	... 16 more
Caused by: java.io.IOException: Server returned HTTP response code: 502 for URL: https://repository.apache.org/content/repositories/snapshots/org/apache/myfaces/extensions/validator/myfaces-extval-core/1.2.5-SNAPSHOT/maven-metadata.xml
	at sun.reflect.GeneratedConstructorAccessor1087.newInstance(Unknown Source)
	at sun.reflect.DelegatingConstructorAccessorImpl.newInstance(DelegatingConstructorAccessorImpl.java:27)
	at java.lang.reflect.Constructor.newInstance(Constructor.java:513)
	at sun.net.www.protocol.http.HttpURLConnection$6.run(HttpURLConnection.java:1496)
	at java.security.AccessController.doPrivileged(Native Method)
	at sun.net.www.protocol.http.HttpURLConnection.getChainedException(HttpURLConnection.java:1490)
	at sun.net.www.protocol.http.HttpURLConnection.getInputStream(HttpURLConnection.java:1144)
	at sun.net.www.protocol.https.HttpsURLConnectionImpl.getInputStream(HttpsURLConnectionImpl.java:234)
	at org.apache.maven.wagon.providers.http.LightweightHttpWagon.fillInputData(LightweightHttpWagon.java:122)
	... 23 more
Caused by: java.io.IOException: Server returned HTTP response code: 502 for URL: https://repository.apache.org/content/repositories/snapshots/org/apache/myfaces/extensions/validator/myfaces-extval-core/1.2.5-SNAPSHOT/maven-metadata.xml
	at sun.net.www.protocol.http.HttpURLConnection.getInputStream(HttpURLConnection.java:1441)
	at java.net.HttpURLConnection.getResponseCode(HttpURLConnection.java:379)
	at sun.net.www.protocol.https.HttpsURLConnectionImpl.getResponseCode(HttpsURLConnectionImpl.java:318)
	at org.apache.maven.wagon.providers.http.LightweightHttpWagon.fillInputData(LightweightHttpWagon.java:115)
	... 23 more


Hudson build is back to normal : ExtVal for JSF 1.2 (nightly) #42

Posted by Apache Hudson Server <hu...@hudson.apache.org>.
See <https://hudson.apache.org/hudson/job/ExtVal%20for%20JSF%201.2%20(nightly)/42/changes>