You are viewing a plain text version of this content. The canonical link for it is here.
Posted to yarn-dev@hadoop.apache.org by Apache Jenkins Server <je...@builds.apache.org> on 2013/12/17 13:16:33 UTC

Failed: YARN-1445 PreCommit Build #2676

Jira: https://issues.apache.org/jira/browse/YARN-1445
Build: https://builds.apache.org/job/PreCommit-YARN-Build/2676/

###################################################################################
########################## LAST 60 LINES OF THE CONSOLE ###########################
[...truncated 3841 lines...]
  http://issues.apache.org/jira/secure/attachment/12619070/YARN-1445.5.patch
  against trunk revision .

    {color:green}+1 @author{color}.  The patch does not contain any @author tags.

    {color:green}+1 tests included{color}.  The patch appears to include 2 new or modified test files.

    {color:green}+1 javac{color}.  The applied patch does not increase the total number of javac compiler warnings.

    {color:green}+1 javadoc{color}.  The javadoc tool did not generate any warning messages.

    {color:green}+1 eclipse:eclipse{color}.  The patch built with eclipse:eclipse.

    {color:green}+1 findbugs{color}.  The patch does not introduce any new Findbugs (version 1.3.9) warnings.

    {color:green}+1 release audit{color}.  The applied patch does not increase the total number of release audit warnings.

    {color:red}-1 core tests{color}.  The patch failed these unit tests in hadoop-mapreduce-project/hadoop-mapreduce-client/hadoop-mapreduce-client-common hadoop-mapreduce-project/hadoop-mapreduce-client/hadoop-mapreduce-client-jobclient hadoop-yarn-project/hadoop-yarn/hadoop-yarn-api hadoop-yarn-project/hadoop-yarn/hadoop-yarn-client hadoop-yarn-project/hadoop-yarn/hadoop-yarn-server/hadoop-yarn-server-resourcemanager hadoop-yarn-project/hadoop-yarn/hadoop-yarn-server/hadoop-yarn-server-web-proxy hadoop-yarn-project/hadoop-yarn/hadoop-yarn-site:

                  org.apache.hadoop.mapred.TestYARNRunner
                  org.apache.hadoop.mapreduce.security.TestJHSSecurity

                                      The following test timeouts occurred in hadoop-mapreduce-project/hadoop-mapreduce-client/hadoop-mapreduce-client-common hadoop-mapreduce-project/hadoop-mapreduce-client/hadoop-mapreduce-client-jobclient hadoop-yarn-project/hadoop-yarn/hadoop-yarn-api hadoop-yarn-project/hadoop-yarn/hadoop-yarn-client hadoop-yarn-project/hadoop-yarn/hadoop-yarn-server/hadoop-yarn-server-resourcemanager hadoop-yarn-project/hadoop-yarn/hadoop-yarn-server/hadoop-yarn-server-web-proxy hadoop-yarn-project/hadoop-yarn/hadoop-yarn-site:

org.apache.hadoop.mapreduce.lib.jobcontrol.TestMapReduceJobControl
org.apache.hadoop.mapred.TestClientRedirect

    {color:green}+1 contrib tests{color}.  The patch passed contrib unit tests.

Test results: https://builds.apache.org/job/PreCommit-YARN-Build/2676//testReport/
Console output: https://builds.apache.org/job/PreCommit-YARN-Build/2676//console

This message is automatically generated.


======================================================================
======================================================================
    Adding comment to Jira.
======================================================================
======================================================================


Comment added.
a6c17505563c7fa3c764d55e4c38a2393008929e logged out


======================================================================
======================================================================
    Finished build.
======================================================================
======================================================================


Build step 'Execute shell' marked build as failure
Archiving artifacts
[description-setter] Could not determine description.
Recording test results
Email was triggered for: Failure
Sending email for trigger: Failure



###################################################################################
############################## FAILED TESTS (if any) ##############################
2 tests failed.
FAILED:  org.apache.hadoop.mapred.TestYARNRunner.testResourceMgrDelegate

Error Message:
null

Stack Trace:
java.lang.NullPointerException: null
	at org.apache.hadoop.yarn.client.api.impl.YarnClientImpl.killApplication(YarnClientImpl.java:201)
	at org.apache.hadoop.mapred.ResourceMgrDelegate.killApplication(ResourceMgrDelegate.java:284)
	at org.apache.hadoop.mapred.TestYARNRunner.testResourceMgrDelegate(TestYARNRunner.java:212)


FAILED:  org.apache.hadoop.mapreduce.security.TestJHSSecurity.testDelegationToken

Error Message:
null

Stack Trace:
java.lang.NullPointerException: null
	at java.util.Hashtable.get(Hashtable.java:334)
	at java.util.Properties.getProperty(Properties.java:932)
	at org.apache.hadoop.conf.Configuration.get(Configuration.java:874)
	at org.apache.hadoop.http.HttpServer.initSpnego(HttpServer.java:892)
	at org.apache.hadoop.http.HttpServer.access$100(HttpServer.java:101)
	at org.apache.hadoop.http.HttpServer$Builder.build(HttpServer.java:323)
	at org.apache.hadoop.yarn.webapp.WebApps$Builder.start(WebApps.java:232)
	at org.apache.hadoop.mapreduce.v2.hs.HistoryClientService.initializeWebApp(HistoryClientService.java:149)
	at org.apache.hadoop.mapreduce.v2.hs.HistoryClientService.serviceStart(HistoryClientService.java:118)
	at org.apache.hadoop.service.AbstractService.start(AbstractService.java:193)
	at org.apache.hadoop.service.CompositeService.serviceStart(CompositeService.java:121)
	at org.apache.hadoop.mapreduce.v2.hs.JobHistoryServer.serviceStart(JobHistoryServer.java:175)
	at org.apache.hadoop.service.AbstractService.start(AbstractService.java:193)
	at org.apache.hadoop.mapreduce.security.TestJHSSecurity.testDelegationToken(TestJHSSecurity.java:100)



Success: YARN-1493 PreCommit Build #2679

Posted by Apache Jenkins Server <je...@builds.apache.org>.
Jira: https://issues.apache.org/jira/browse/YARN-1493
Build: https://builds.apache.org/job/PreCommit-YARN-Build/2679/

###################################################################################
########################## LAST 60 LINES OF THE CONSOLE ###########################
[...truncated 3146 lines...]

/bin/kill -9 15503 
kill: No such process
NOP




{color:green}+1 overall{color}.  Here are the results of testing the latest attachment 
  http://issues.apache.org/jira/secure/attachment/12619152/YARN-1493.3.patch
  against trunk revision .

    {color:green}+1 @author{color}.  The patch does not contain any @author tags.

    {color:green}+1 tests included{color}.  The patch appears to include 12 new or modified test files.

    {color:green}+1 javac{color}.  The applied patch does not increase the total number of javac compiler warnings.

    {color:green}+1 javadoc{color}.  The javadoc tool did not generate any warning messages.

    {color:green}+1 eclipse:eclipse{color}.  The patch built with eclipse:eclipse.

    {color:green}+1 findbugs{color}.  The patch does not introduce any new Findbugs (version 1.3.9) warnings.

    {color:green}+1 release audit{color}.  The applied patch does not increase the total number of release audit warnings.

    {color:green}+1 core tests{color}.  The patch passed unit tests in hadoop-tools/hadoop-sls hadoop-yarn-project/hadoop-yarn/hadoop-yarn-server/hadoop-yarn-server-resourcemanager.

    {color:green}+1 contrib tests{color}.  The patch passed contrib unit tests.

Test results: https://builds.apache.org/job/PreCommit-YARN-Build/2679//testReport/
Console output: https://builds.apache.org/job/PreCommit-YARN-Build/2679//console

This message is automatically generated.


======================================================================
======================================================================
    Adding comment to Jira.
======================================================================
======================================================================


Comment added.
b7335c91b0fe2e491b1e5fa1fa1cc209282bfad9 logged out


======================================================================
======================================================================
    Finished build.
======================================================================
======================================================================


Archiving artifacts
Description set: YARN-1493
Recording test results
Email was triggered for: Success
Sending email for trigger: Success



###################################################################################
############################## FAILED TESTS (if any) ##############################
All tests passed

Failed: YARN-1028 PreCommit Build #2678

Posted by Apache Jenkins Server <je...@builds.apache.org>.
Jira: https://issues.apache.org/jira/browse/YARN-1028
Build: https://builds.apache.org/job/PreCommit-YARN-Build/2678/

###################################################################################
########################## LAST 60 LINES OF THE CONSOLE ###########################
[...truncated 4361 lines...]




{color:red}-1 overall{color}.  Here are the results of testing the latest attachment 
  http://issues.apache.org/jira/secure/attachment/12619134/yarn-1028-11.patch
  against trunk revision .

    {color:green}+1 @author{color}.  The patch does not contain any @author tags.

    {color:green}+1 tests included{color}.  The patch appears to include 3 new or modified test files.

    {color:green}+1 javac{color}.  The applied patch does not increase the total number of javac compiler warnings.

    {color:green}+1 javadoc{color}.  The javadoc tool did not generate any warning messages.

    {color:green}+1 eclipse:eclipse{color}.  The patch built with eclipse:eclipse.

    {color:green}+1 findbugs{color}.  The patch does not introduce any new Findbugs (version 1.3.9) warnings.

    {color:green}+1 release audit{color}.  The applied patch does not increase the total number of release audit warnings.

    {color:red}-1 core tests{color}.  The patch failed these unit tests in hadoop-common-project/hadoop-common hadoop-yarn-project/hadoop-yarn/hadoop-yarn-api hadoop-yarn-project/hadoop-yarn/hadoop-yarn-client hadoop-yarn-project/hadoop-yarn/hadoop-yarn-common hadoop-yarn-project/hadoop-yarn/hadoop-yarn-server/hadoop-yarn-server-common hadoop-yarn-project/hadoop-yarn/hadoop-yarn-server/hadoop-yarn-server-tests:

                  org.apache.hadoop.yarn.server.TestRMNMSecretKeys
                  org.apache.hadoop.yarn.server.TestContainerManagerSecurity

    {color:green}+1 contrib tests{color}.  The patch passed contrib unit tests.

Test results: https://builds.apache.org/job/PreCommit-YARN-Build/2678//testReport/
Console output: https://builds.apache.org/job/PreCommit-YARN-Build/2678//console

This message is automatically generated.


======================================================================
======================================================================
    Adding comment to Jira.
======================================================================
======================================================================


Comment added.
c1a5c942cb3888d5b44377f9acc793c33730496f logged out


======================================================================
======================================================================
    Finished build.
======================================================================
======================================================================


Build step 'Execute shell' marked build as failure
Archiving artifacts
[description-setter] Could not determine description.
Recording test results
Email was triggered for: Failure
Sending email for trigger: Failure



###################################################################################
############################## FAILED TESTS (if any) ##############################
2 tests failed.
FAILED:  org.apache.hadoop.yarn.server.TestContainerManagerSecurity.testContainerManager[1]

Error Message:
java.io.IOException: ResourceManager failed to start. Final state is STOPPED

Stack Trace:
org.apache.hadoop.yarn.exceptions.YarnRuntimeException: java.io.IOException: ResourceManager failed to start. Final state is STOPPED
	at org.apache.hadoop.yarn.server.MiniYARNCluster$ResourceManagerWrapper.serviceStart(MiniYARNCluster.java:373)
	at org.apache.hadoop.service.AbstractService.start(AbstractService.java:193)
	at org.apache.hadoop.service.CompositeService.serviceStart(CompositeService.java:121)
	at org.apache.hadoop.service.AbstractService.start(AbstractService.java:193)
	at org.apache.hadoop.yarn.server.TestContainerManagerSecurity.testContainerManager(TestContainerManagerSecurity.java:110)


FAILED:  org.apache.hadoop.yarn.server.TestRMNMSecretKeys.testNMUpdation

Error Message:
null

Stack Trace:
java.lang.NullPointerException: null
	at java.util.Hashtable.get(Hashtable.java:334)
	at java.util.Properties.getProperty(Properties.java:932)
	at org.apache.hadoop.conf.Configuration.get(Configuration.java:874)
	at org.apache.hadoop.http.HttpServer.initSpnego(HttpServer.java:892)
	at org.apache.hadoop.http.HttpServer.access$100(HttpServer.java:101)
	at org.apache.hadoop.http.HttpServer$Builder.build(HttpServer.java:323)
	at org.apache.hadoop.yarn.webapp.WebApps$Builder.start(WebApps.java:232)
	at org.apache.hadoop.yarn.server.resourcemanager.ResourceManager.startWepApp(ResourceManager.java:835)
	at org.apache.hadoop.yarn.server.resourcemanager.ResourceManager$RMActiveServices.serviceStart(ResourceManager.java:485)
	at org.apache.hadoop.service.AbstractService.start(AbstractService.java:193)
	at org.apache.hadoop.yarn.server.resourcemanager.ResourceManager.startActiveServices(ResourceManager.java:855)
	at org.apache.hadoop.yarn.server.resourcemanager.ResourceManager.transitionToActive(ResourceManager.java:886)
	at org.apache.hadoop.yarn.server.resourcemanager.ResourceManager.serviceStart(ResourceManager.java:922)
	at org.apache.hadoop.service.AbstractService.start(AbstractService.java:193)
	at org.apache.hadoop.yarn.server.TestRMNMSecretKeys.validateRMNMKeyExchange(TestRMNMSecretKeys.java:69)
	at org.apache.hadoop.yarn.server.TestRMNMSecretKeys.testNMUpdation(TestRMNMSecretKeys.java:49)



Failed: YARN-1028 PreCommit Build #2677

Posted by Apache Jenkins Server <je...@builds.apache.org>.
Jira: https://issues.apache.org/jira/browse/YARN-1028
Build: https://builds.apache.org/job/PreCommit-YARN-Build/2677/

###################################################################################
########################## LAST 60 LINES OF THE CONSOLE ###########################
[...truncated 4335 lines...]



{color:red}-1 overall{color}.  Here are the results of testing the latest attachment 
  http://issues.apache.org/jira/secure/attachment/12619130/yarn-1028-10.patch
  against trunk revision .

    {color:green}+1 @author{color}.  The patch does not contain any @author tags.

    {color:green}+1 tests included{color}.  The patch appears to include 3 new or modified test files.

    {color:green}+1 javac{color}.  The applied patch does not increase the total number of javac compiler warnings.

    {color:red}-1 javadoc{color}.  The javadoc tool appears to have generated 1 warning messages.

    {color:green}+1 eclipse:eclipse{color}.  The patch built with eclipse:eclipse.

    {color:red}-1 findbugs{color}.  The patch appears to introduce 1 new Findbugs (version 1.3.9) warnings.

    {color:green}+1 release audit{color}.  The applied patch does not increase the total number of release audit warnings.

    {color:red}-1 core tests{color}.  The patch failed these unit tests in hadoop-common-project/hadoop-common hadoop-yarn-project/hadoop-yarn/hadoop-yarn-api hadoop-yarn-project/hadoop-yarn/hadoop-yarn-client hadoop-yarn-project/hadoop-yarn/hadoop-yarn-common hadoop-yarn-project/hadoop-yarn/hadoop-yarn-server/hadoop-yarn-server-common hadoop-yarn-project/hadoop-yarn/hadoop-yarn-server/hadoop-yarn-server-tests:

                  org.apache.hadoop.yarn.server.TestContainerManagerSecurity
                  org.apache.hadoop.yarn.server.TestRMNMSecretKeys

    {color:green}+1 contrib tests{color}.  The patch passed contrib unit tests.

Test results: https://builds.apache.org/job/PreCommit-YARN-Build/2677//testReport/
Findbugs warnings: https://builds.apache.org/job/PreCommit-YARN-Build/2677//artifact/trunk/patchprocess/newPatchFindbugsWarningshadoop-yarn-common.html
Console output: https://builds.apache.org/job/PreCommit-YARN-Build/2677//console

This message is automatically generated.


======================================================================
======================================================================
    Adding comment to Jira.
======================================================================
======================================================================


Comment added.
001aa221243a8cc04a4c33ecd42d85a81eb9af46 logged out


======================================================================
======================================================================
    Finished build.
======================================================================
======================================================================


Build step 'Execute shell' marked build as failure
Archiving artifacts
[description-setter] Could not determine description.
Recording test results
Email was triggered for: Failure
Sending email for trigger: Failure



###################################################################################
############################## FAILED TESTS (if any) ##############################
2 tests failed.
FAILED:  org.apache.hadoop.yarn.server.TestContainerManagerSecurity.testContainerManager[1]

Error Message:
java.io.IOException: ResourceManager failed to start. Final state is STOPPED

Stack Trace:
org.apache.hadoop.yarn.exceptions.YarnRuntimeException: java.io.IOException: ResourceManager failed to start. Final state is STOPPED
	at org.apache.hadoop.yarn.server.MiniYARNCluster$ResourceManagerWrapper.serviceStart(MiniYARNCluster.java:373)
	at org.apache.hadoop.service.AbstractService.start(AbstractService.java:193)
	at org.apache.hadoop.service.CompositeService.serviceStart(CompositeService.java:121)
	at org.apache.hadoop.service.AbstractService.start(AbstractService.java:193)
	at org.apache.hadoop.yarn.server.TestContainerManagerSecurity.testContainerManager(TestContainerManagerSecurity.java:110)


FAILED:  org.apache.hadoop.yarn.server.TestRMNMSecretKeys.testNMUpdation

Error Message:
null

Stack Trace:
java.lang.NullPointerException: null
	at java.util.Hashtable.get(Hashtable.java:334)
	at java.util.Properties.getProperty(Properties.java:932)
	at org.apache.hadoop.conf.Configuration.get(Configuration.java:874)
	at org.apache.hadoop.http.HttpServer.initSpnego(HttpServer.java:892)
	at org.apache.hadoop.http.HttpServer.access$100(HttpServer.java:101)
	at org.apache.hadoop.http.HttpServer$Builder.build(HttpServer.java:323)
	at org.apache.hadoop.yarn.webapp.WebApps$Builder.start(WebApps.java:232)
	at org.apache.hadoop.yarn.server.resourcemanager.ResourceManager.startWepApp(ResourceManager.java:835)
	at org.apache.hadoop.yarn.server.resourcemanager.ResourceManager$RMActiveServices.serviceStart(ResourceManager.java:485)
	at org.apache.hadoop.service.AbstractService.start(AbstractService.java:193)
	at org.apache.hadoop.yarn.server.resourcemanager.ResourceManager.startActiveServices(ResourceManager.java:855)
	at org.apache.hadoop.yarn.server.resourcemanager.ResourceManager.transitionToActive(ResourceManager.java:886)
	at org.apache.hadoop.yarn.server.resourcemanager.ResourceManager.serviceStart(ResourceManager.java:922)
	at org.apache.hadoop.service.AbstractService.start(AbstractService.java:193)
	at org.apache.hadoop.yarn.server.TestRMNMSecretKeys.validateRMNMKeyExchange(TestRMNMSecretKeys.java:69)
	at org.apache.hadoop.yarn.server.TestRMNMSecretKeys.testNMUpdation(TestRMNMSecretKeys.java:49)