You are viewing a plain text version of this content. The canonical link for it is here.
Posted to dev@poi.apache.org by Apache Jenkins Server <je...@builds.apache.org> on 2024/08/31 00:09:46 UTC

Build failed in Jenkins: POI » POI-DSL-OpenJDK #989

See <https://ci-builds.apache.org/job/POI/job/POI-DSL-OpenJDK/989/display/redirect?page=changes>

Changes:

[PJ Fanning] ant 1.10.15

[PJ Fanning] ant 1.10.15

[PJ Fanning] bytebuddy 1.15.1


------------------------------------------
[...truncated 434.54 KB...]
AU        src/documentation/resources/images/logoRaPiGmbH9.png
AU        src/documentation/resources/images/logoDanielFernandez.png
AU        src/documentation/resources/images/logoAndrewClements2.png
AU        src/documentation/resources/images/hslf_shapes.gif
AU        src/documentation/resources/images/logoWendyWise2.png
AU        src/documentation/resources/images/POIFSLifeCycle.gif
AU        src/documentation/resources/images/logoAdria1.png
AU        src/documentation/resources/images/logoAdria2.png
AU        src/documentation/resources/images/logoAdria3.png
AU        src/documentation/resources/images/remove.jpg
AU        src/documentation/resources/images/logoKarmokar3s.png
AU        src/documentation/resources/images/logoGlenStampoutlzis.png
AU        src/documentation/resources/images/logoKarmokar1.png
AU        src/documentation/resources/images/POIFSInitialization.gif
AU        src/documentation/resources/images/logoKarmokar2.png
AU        src/documentation/resources/images/logoRaPiGmbH10.png
AU        src/documentation/resources/images/logoKarmokar3.png
AU        src/documentation/resources/images/logoRaPiGmbH11.png
AU        src/documentation/resources/images/logoMichaelMosmann.png
AU        src/documentation/resources/images/logoKarmokar4.png
AU        src/documentation/resources/images/logoRaPiGmbH12.png
AU        src/documentation/resources/images/logoKarmokar5.png
AU        src/documentation/resources/images/logoKarmokar6.png
AU        src/documentation/resources/images/ApacheConEu08.jpg
AU        src/documentation/resources/images/BlockClassDiagram.gif
AU        src/documentation/resources/images/calculatePayment.jpg
AU        src/documentation/resources/images/PropertyTableClassDiagram.gif
AU        src/documentation/resources/images/logoRussellBeattie1.png
AU        src/documentation/resources/images/logoRussellBeattie2.png
AU        src/documentation/resources/images/logoRussellBeattie3.png
A         src/documentation/sitemap.xmap
A         src/documentation/cli.xconf
AU        src/documentation/README.txt
A         src/documentation/classes
A         src/documentation/classes/CatalogManager.properties
At revision 1920311


<-- Got one external: forrest.properties, svn url: https://svn.apache.org/repos/asf/poi/site/forrest.properties -->
Fetching 'https://svn.apache.org/repos/asf/poi/site/forrest.properties' at -1 into '<https://ci-builds.apache.org/job/POI/job/POI-DSL-OpenJDK/ws/forrest.properties'>
A         forrest.properties
At revision 1920311

At revision 1920311

No changes for https://svn.apache.org/repos/asf/poi/site/forrest.properties since the previous build
ERROR: Not all environment variables could be successfully injected. Check for similarly-named environment variables.
No JDK named ‘adoptopenjdk_hotspot_8u282’ found
ERROR: Not all environment variables could be successfully injected. Check for similarly-named environment variables.
No JDK named ‘adoptopenjdk_hotspot_8u282’ found
[POI-DSL-OpenJDK] $ /bin/sh -xe /tmp/jenkins14947875497067312360.sh
+ rm -rf examples excelant integrationtest main ooxml ooxml-schema scratchpad build.javacheck.xml
+ svn status
    X   forrest.properties
X       src/documentation

Performing status on external item at 'src/documentation':
+ svn revert poi-examples/src/main/java9/module-info.java poi-excelant/src/main/java9/module-info.java poi-excelant/src/test/java9/module-info.java poi-integration/src/test/java9/module-info.java poi-ooxml-full/src/main/java9/module-info.java poi-ooxml-lite-agent/src/main/java9/module-info.java poi-ooxml-lite/src/main/java9/module-info.java poi-ooxml/src/main/java9/module-info.java poi-ooxml/src/test/java9/module-info.java poi-scratchpad/src/main/java9/module-info.java poi-scratchpad/src/test/java9/module-info.java poi/src/main/java9/module-info.java poi/src/test/java9/module-info.java
+ svn revert src/resources/ooxml-lite-report.clazz src/resources/ooxml-lite-report.xsb
+ echo Java-Home:
Java-Home:
+ ls -al /
total 8390608
drwxr-xr-x  20 root root       4096 Aug 20 22:49 .
drwxr-xr-x  20 root root       4096 Aug 20 22:49 ..
lrwxrwxrwx   1 root root          7 Aug 23  2023 bin -> usr/bin
drwxr-xr-x   4 root root       4096 Aug 22 06:49 boot
drwxr-xr-x  21 root root       4320 Aug 30 02:45 dev
drwxr-xr-x 141 root root      12288 Aug 22 06:49 etc
drwxr-xr-x  10 root root       4096 Dec 21  2023 home
lrwxrwxrwx   1 root root          7 Aug 23  2023 lib -> usr/lib
lrwxrwxrwx   1 root root          9 Aug 23  2023 lib32 -> usr/lib32
lrwxrwxrwx   1 root root          9 Aug 23  2023 lib64 -> usr/lib64
lrwxrwxrwx   1 root root         10 Aug 23  2023 libx32 -> usr/libx32
drwx------   2 root root      16384 Nov 13  2023 lost+found
drwxr-xr-x   2 root root       4096 Aug 23  2023 media
drwxr-xr-x   2 root root       4096 Aug 23  2023 mnt
drwxr-xr-x  14 root root       4096 Apr 19 20:57 opt
dr-xr-xr-x 402 root root          0 Aug 20 22:45 proc
-rw-r--r--   1 root root      11304 May 17  2023 puppet-release-jammy.deb
drwx------  11 root root       4096 Aug 20 22:50 root
drwxr-xr-x  44 root root       1320 Aug 30 23:50 run
lrwxrwxrwx   1 root root          8 Aug 23  2023 sbin -> usr/sbin
drwxr-xr-x  13 root root       4096 Aug 21 11:19 snap
drwxr-xr-x   2 root root       4096 Aug 20 22:50 srv
-rw-------   1 root root 8589934592 Nov 13  2023 swap.img
dr-xr-xr-x  13 root root          0 Aug 20 22:45 sys
drwxrwxrwt 306 root root    1941504 Aug 31 00:08 tmp
drwx------   3 root root       4096 Nov 17  2023 Users
drwxr-xr-x  16 root root       4096 Nov 13  2023 usr
drwxr-xr-x  13 root root       4096 Aug 23  2023 var
+ ls -al /bin
lrwxrwxrwx 1 root root 7 Aug 23  2023 /bin -> usr/bin
+ /bin/java -version
openjdk version "11.0.24" 2024-07-16
OpenJDK Runtime Environment (build 11.0.24+8-post-Ubuntu-1ubuntu322.04)
OpenJDK 64-Bit Server VM (build 11.0.24+8-post-Ubuntu-1ubuntu322.04, mixed mode, sharing)
+ echo which java
which java
+ which java
/usr/bin/java
+ java -version
openjdk version "11.0.24" 2024-07-16
OpenJDK Runtime Environment (build 11.0.24+8-post-Ubuntu-1ubuntu322.04)
OpenJDK 64-Bit Server VM (build 11.0.24+8-post-Ubuntu-1ubuntu322.04, mixed mode, sharing)
+ echo which javac
which javac
+ which javac
/usr/bin/javac
+ javac -version
javac 11.0.24
+ echo Ant-Home:
Ant-Home:
+ ls -al
total 512
drwxr-xr-x 20 jenkins jenkins   4096 Aug 31 00:08 .
drwxr-xr-x  3 jenkins jenkins   4096 Aug 31 00:07 ..
-rw-r--r--  1 jenkins jenkins    520 Aug 31 00:08 .asf.yaml
-rw-r--r--  1 jenkins jenkins  33427 Aug 31 00:07 build.gradle
-rw-r--r--  1 jenkins jenkins 151471 Aug 31 00:07 build.xml
-rw-r--r--  1 jenkins jenkins   7709 Aug 31 00:08 doap_POI.rdf
-rw-r--r--  1 jenkins jenkins   3261 Aug 31 00:08 file-leak-detector.exclude
-rw-r--r--  1 jenkins jenkins   6229 Aug 31 00:08 forrest.properties
-rw-r--r--  1 jenkins jenkins     53 Aug 31 00:08 .gitattributes
drwxr-xr-x  3 jenkins jenkins   4096 Aug 31 00:08 .github
-rw-r--r--  1 jenkins jenkins    396 Aug 31 00:08 .gitignore
drwxr-xr-x  3 jenkins jenkins   4096 Aug 31 00:07 gradle
-rw-r--r--  1 jenkins jenkins    494 Aug 31 00:08 gradle.properties
-rwxr-xr-x  1 jenkins jenkins   8762 Aug 31 00:07 gradlew
-rw-r--r--  1 jenkins jenkins   2966 Aug 31 00:07 gradlew.bat
drwxr-xr-x  2 jenkins jenkins   4096 Aug 31 00:08 jenkins
-rw-r--r--  1 jenkins jenkins 167947 Aug 31 00:08 KEYS
drwxr-xr-x  2 jenkins jenkins   4096 Aug 31 00:08 legal
drwxr-xr-x  2 jenkins jenkins   4096 Aug 31 00:08 lib.stored
drwxr-xr-x  3 jenkins jenkins   4096 Aug 31 00:08 osgi
-rw-r--r--  1 jenkins jenkins   4813 Aug 31 00:08 patch.xml
drwxr-xr-x  4 jenkins jenkins   4096 Aug 31 00:07 poi
drwxr-xr-x  3 jenkins jenkins   4096 Aug 31 00:08 poi-examples
drwxr-xr-x  3 jenkins jenkins   4096 Aug 31 00:07 poi-excelant
drwxr-xr-x  3 jenkins jenkins   4096 Aug 31 00:07 poi-integration
drwxr-xr-x  3 jenkins jenkins   4096 Aug 31 00:07 poi-ooxml
drwxr-xr-x  3 jenkins jenkins   4096 Aug 31 00:07 poi-ooxml-full
drwxr-xr-x  3 jenkins jenkins   4096 Aug 31 00:08 poi-ooxml-lite
drwxr-xr-x  3 jenkins jenkins   4096 Aug 31 00:07 poi-ooxml-lite-agent
drwxr-xr-x  4 jenkins jenkins   4096 Aug 31 00:08 poi-scratchpad
-rw-r--r--  1 jenkins jenkins   4354 Aug 31 00:08 README.rst
-rw-r--r--  1 jenkins jenkins    428 Aug 31 00:08 SECURITY.md
-rw-r--r--  1 jenkins jenkins    190 Aug 31 00:08 settings.gradle
drwxr-xr-x  4 jenkins jenkins   4096 Aug 31 00:08 src
drwxr-xr-x  4 jenkins jenkins   4096 Aug 31 00:08 .svn
drwxr-xr-x 15 jenkins jenkins   4096 Aug 31 00:08 test-data
-rw-r--r--  1 jenkins jenkins   3803 Aug 31 00:08 wrapper.gradle
+ echo which ant
which ant
+ which ant
/usr/bin/ant
+ ant -version
Apache Ant(TM) version 1.10.12 compiled on January 17 1970
+ echo <project default="test"><target name="test"><echo>Java ${ant.java.version}/${java.version}</echo><exec executable="javac"><arg value="-version"/></exec></target></project>
+ ant -f build.javacheck.xml -v
Apache Ant(TM) version 1.10.12 compiled on January 17 1970
Buildfile: <https://ci-builds.apache.org/job/POI/job/POI-DSL-OpenJDK/ws/build.javacheck.xml>
Detected Java version: 11 in: /usr/lib/jvm/java-11-openjdk-amd64
Detected OS: Linux
parsing buildfile <https://ci-builds.apache.org/job/POI/job/POI-DSL-OpenJDK/ws/build.javacheck.xml> with URI = <https://ci-builds.apache.org/job/POI/job/POI-DSL-OpenJDK/ws/build.javacheck.xml>
Project base dir set to: <https://ci-builds.apache.org/job/POI/job/POI-DSL-OpenJDK/ws/>
Build sequence for target(s) `test' is [test]
Complete build sequence is [test, ]

test:
parsing buildfile jar:file:/usr/share/ant/lib/ant.jar!/org/apache/tools/ant/antlib.xml with URI = jar:file:/usr/share/ant/lib/ant.jar!/org/apache/tools/ant/antlib.xml from a zip file
     [echo] Java 11/11.0.24
     [exec] Current OS is Linux
     [exec] Executing 'javac' with arguments:
     [exec] '-version'
     [exec] 
     [exec] The ' characters around the executable and arguments are
     [exec] not part of the command.
     [exec] javac 11.0.24

BUILD SUCCESSFUL
Total time: 1 second
+ exit 0
ERROR: Not all environment variables could be successfully injected. Check for similarly-named environment variables.
No JDK named ‘adoptopenjdk_hotspot_8u282’ found
[POI-DSL-OpenJDK] $ /bin/sh -xe /tmp/jenkins16439328345406944791.sh
+ touch --no-create build/*/build/test-results/TEST-*.xml build/*/build/test-results/test/TEST-*.xml
[Gradle] - Launching build.
ERROR: Not all environment variables could be successfully injected. Check for similarly-named environment variables.
No JDK named ‘adoptopenjdk_hotspot_8u282’ found
[POI-DSL-OpenJDK] $ <https://ci-builds.apache.org/job/POI/job/POI-DSL-OpenJDK/ws/gradlew> -PjdkVersion=8 -PjdkVendor=adoptopenjdk --refresh-dependencies clean jenkinsLite
To honour the JVM settings for this build a single-use Daemon process will be forked. For more on this, please refer to https://docs.gradle.org/8.10/userguide/gradle_daemon.html#sec:disabling_the_daemon in the Gradle documentation.
Daemon will be stopped at the end of the build 
Configuration on demand is an incubating feature.

> Configure project :
Trying to override old definition of datatype junit
Run with reduced parallelism for CI build
Run with reduced parallelism for CI build
Run with reduced parallelism for CI build
Run with reduced parallelism for CI build
Run with reduced parallelism for CI build
Run with reduced parallelism for CI build
Run with reduced parallelism for CI build
Run with reduced parallelism for CI build
Run with reduced parallelism for CI build
Invalid Java installation found at '/usr/local/asfpackages/java/oraclejdk-j2sdk1.4.2-19' (Maven Toolchains) auto-detected. It will be re-checked in the next build. This might have performance impact if it keeps failing. Run the 'javaToolchains' task for more details.

FAILURE: Build failed with an exception.

* Where:
Build file '<https://ci-builds.apache.org/job/POI/job/POI-DSL-OpenJDK/ws/poi/build.gradle'> line: 82

* What went wrong:
A problem occurred evaluating project ':poi'.
> Could not resolve all dependencies for configuration ':poi:testRuntimeClasspath'.
   > Failed to calculate the value of task ':poi:compileTestJava' property 'javaCompiler'.
      > Cannot find a Java installation on your machine matching this tasks requirements: {languageVersion=8, vendor=vendor matching('adoptopenjdk'), implementation=vendor-specific} for LINUX on x86_64.
         > No locally installed toolchains match and toolchain download repositories have not been configured.

* Try:
> Learn more about toolchain auto-detection at https://docs.gradle.org/8.10/userguide/toolchains.html#sec:auto_detection.
> Learn more about toolchain repositories at https://docs.gradle.org/8.10/userguide/toolchains.html#sub:download_repositories.
> Run with --stacktrace option to get the stack trace.
> Run with --info or --debug option to get more log output.
> Run with --scan to get full insights.
> Get more help at https://help.gradle.org.

Deprecated Gradle features were used in this build, making it incompatible with Gradle 9.0.

You can use '--warning-mode all' to show the individual deprecation warnings and determine if they come from your own scripts or plugins.

For more on this, please refer to https://docs.gradle.org/8.10/userguide/command_line_interface.html#sec:command_line_warnings in the Gradle documentation.

BUILD FAILED in 1m 9s
Build step 'Invoke Gradle script' changed build result to FAILURE
Build step 'Invoke Gradle script' marked build as failure
[SpotBugs] Skipping execution of recorder since overall result is 'FAILURE'
ERROR: Not all environment variables could be successfully injected. Check for similarly-named environment variables.
No JDK named ‘adoptopenjdk_hotspot_8u282’ found
Archiving artifacts
ERROR: Not all environment variables could be successfully injected. Check for similarly-named environment variables.
No JDK named ‘adoptopenjdk_hotspot_8u282’ found
Recording test results
ERROR: Not all environment variables could be successfully injected. Check for similarly-named environment variables.
No JDK named ‘adoptopenjdk_hotspot_8u282’ found
ERROR: Step ‘Publish JUnit test result report’ failed: No test report files were found. Configuration error?
ERROR: Not all environment variables could be successfully injected. Check for similarly-named environment variables.
No JDK named ‘adoptopenjdk_hotspot_8u282’ found

---------------------------------------------------------------------
To unsubscribe, e-mail: dev-unsubscribe@poi.apache.org
For additional commands, e-mail: dev-help@poi.apache.org


Build failed in Jenkins: POI » POI-DSL-OpenJDK #998

Posted by Apache Jenkins Server <je...@builds.apache.org>.
See <https://ci-builds.apache.org/job/POI/job/POI-DSL-OpenJDK/998/display/redirect?page=changes>

Changes:

[PJ Fanning] commons-io 2.17.0

[PJ Fanning] commons-io 2.17.0


------------------------------------------
Started by an SCM change
Running as SYSTEM
ERROR: Not all environment variables could be successfully injected. Check for similarly-named environment variables.
No JDK named ‘adoptopenjdk_hotspot_8u282’ found
[EnvInject] - Loading node environment variables.
[EnvInject] - Preparing an environment for the build.
[EnvInject] - Keeping Jenkins system variables.
[EnvInject] - Keeping Jenkins build variables.
[EnvInject] - Injecting as environment variables the properties content 
FORREST_HOME=/home/jenkins/tools/forrest/latest
LANG=en_US.UTF-8
CI_BUILD=TRUE

[EnvInject] - Variables injected successfully.
[EnvInject] - Injecting contributions.
Building remotely on builds30 (ubuntu) in workspace <https://ci-builds.apache.org/job/POI/job/POI-DSL-OpenJDK/ws/>
[WS-CLEANUP] Deleting project workspace...
[WS-CLEANUP] Done
ERROR: Not all environment variables could be successfully injected. Check for similarly-named environment variables.
No JDK named ‘adoptopenjdk_hotspot_8u282’ found
Updating https://svn.apache.org/repos/asf/poi/trunk at revision '2024-09-19T12:07:15.651 +0000'
U         build.gradle
U         build.xml
U         jenkins/create_jobs.groovy
U         poi/src/main/java/org/apache/poi/util/DefaultTempFileCreationStrategy.java

<-- Got one external: forrest.properties, svn url: https://svn.apache.org/repos/asf/poi/site/forrest.properties -->
Fetching 'https://svn.apache.org/repos/asf/poi/site/forrest.properties' at -1 into '<https://ci-builds.apache.org/job/POI/job/POI-DSL-OpenJDK/ws/forrest.properties'>
At revision 1920781


<-- Got one external: documentation, svn url: https://svn.apache.org/repos/asf/poi/site/src/documentation -->
Fetching 'https://svn.apache.org/repos/asf/poi/site/src/documentation' at -1 into '<https://ci-builds.apache.org/job/POI/job/POI-DSL-OpenJDK/ws/src/documentation'>
U         src/documentation/content/xdocs/changes.xml
U         src/documentation/content/xdocs/components/index.xml
U         src/documentation/content/xdocs/help/faq.xml
At revision 1920781

At revision 1920781

No changes for https://svn.apache.org/repos/asf/poi/site/forrest.properties since the previous build
ERROR: Not all environment variables could be successfully injected. Check for similarly-named environment variables.
No JDK named ‘adoptopenjdk_hotspot_8u282’ found
ERROR: Not all environment variables could be successfully injected. Check for similarly-named environment variables.
No JDK named ‘adoptopenjdk_hotspot_8u282’ found
[POI-DSL-OpenJDK] $ /bin/sh -xe /tmp/jenkins9823698548494929082.sh
+ rm -rf examples excelant integrationtest main ooxml ooxml-schema scratchpad build.javacheck.xml
+ svn status
    X   forrest.properties
X       src/documentation

Performing status on external item at 'src/documentation':
+ svn revert poi-examples/src/main/java9/module-info.java poi-excelant/src/main/java9/module-info.java poi-excelant/src/test/java9/module-info.java poi-integration/src/test/java9/module-info.java poi-ooxml-full/src/main/java9/module-info.java poi-ooxml-lite-agent/src/main/java9/module-info.java poi-ooxml-lite/src/main/java9/module-info.java poi-ooxml/src/main/java9/module-info.java poi-ooxml/src/test/java9/module-info.java poi-scratchpad/src/main/java9/module-info.java poi-scratchpad/src/test/java9/module-info.java poi/src/main/java9/module-info.java poi/src/test/java9/module-info.java
+ svn revert src/resources/ooxml-lite-report.clazz src/resources/ooxml-lite-report.xsb
+ echo Java-Home:
Java-Home:
+ ls -al /
total 8390536
drwxr-xr-x  19 root root       4096 Aug 27 23:52 .
drwxr-xr-x  19 root root       4096 Aug 27 23:52 ..
lrwxrwxrwx   1 root root          7 Aug 23  2023 bin -> usr/bin
drwxr-xr-x   4 root root       4096 Sep 14 06:26 boot
drwxr-xr-x  20 root root       4360 Sep 16 17:28 dev
drwxr-xr-x 141 root root      12288 Sep 19 06:35 etc
drwxr-xr-x  10 root root       4096 Jul  3 08:39 home
lrwxrwxrwx   1 root root          7 Aug 23  2023 lib -> usr/lib
lrwxrwxrwx   1 root root          9 Aug 23  2023 lib32 -> usr/lib32
lrwxrwxrwx   1 root root          9 Aug 23  2023 lib64 -> usr/lib64
lrwxrwxrwx   1 root root         10 Aug 23  2023 libx32 -> usr/libx32
drwx------   2 root root      16384 Nov 14  2023 lost+found
drwxr-xr-x   2 root root       4096 Aug 23  2023 media
drwxr-xr-x   2 root root       4096 Aug 23  2023 mnt
drwxr-xr-x  14 root root       4096 Apr 19 20:58 opt
dr-xr-xr-x 419 root root          0 Aug 24 10:28 proc
-rw-r--r--   1 root root      11304 May 17  2023 puppet-release-jammy.deb
drwx------  11 root root       4096 Aug 24 10:33 root
drwxr-xr-x  43 root root       1280 Sep 19 12:04 run
lrwxrwxrwx   1 root root          8 Aug 23  2023 sbin -> usr/sbin
drwxr-xr-x  13 root root       4096 Aug 20 17:15 snap
drwxr-xr-x   2 root root       4096 Aug 24 10:33 srv
-rw-------   1 root root 8589934592 Nov 14  2023 swap.img
dr-xr-xr-x  13 root root          0 Aug 24 10:28 sys
drwxrwxrwt 138 root root    1875968 Sep 19 12:07 tmp
drwxr-xr-x  16 root root       4096 Nov 14  2023 usr
drwxr-xr-x  13 root root       4096 Aug 23  2023 var
+ ls -al /bin
lrwxrwxrwx 1 root root 7 Aug 23  2023 /bin -> usr/bin
+ /bin/java -version
openjdk version "11.0.24" 2024-07-16
OpenJDK Runtime Environment (build 11.0.24+8-post-Ubuntu-1ubuntu322.04)
OpenJDK 64-Bit Server VM (build 11.0.24+8-post-Ubuntu-1ubuntu322.04, mixed mode, sharing)
+ echo which java
which java
+ which java
/usr/bin/java
+ java -version
openjdk version "11.0.24" 2024-07-16
OpenJDK Runtime Environment (build 11.0.24+8-post-Ubuntu-1ubuntu322.04)
OpenJDK 64-Bit Server VM (build 11.0.24+8-post-Ubuntu-1ubuntu322.04, mixed mode, sharing)
+ echo which javac
which javac
+ which javac
/usr/bin/javac
+ javac -version
javac 11.0.24
+ echo Ant-Home:
Ant-Home:
+ ls -al
total 520
drwxr-xr-x 22 jenkins jenkins   4096 Sep 13 00:54 .
drwxr-xr-x  6 jenkins jenkins   4096 Sep 10 09:30 ..
-rw-r--r--  1 jenkins jenkins    520 Jul  9 12:08 .asf.yaml
drwxr-xr-x  3 jenkins jenkins   4096 Aug  9 00:08 build
-rw-r--r--  1 jenkins jenkins  33427 Sep 19 12:07 build.gradle
-rw-r--r--  1 jenkins jenkins 151471 Sep 19 12:07 build.xml
-rw-r--r--  1 jenkins jenkins   7709 Jul  9 12:08 doap_POI.rdf
-rw-r--r--  1 jenkins jenkins   3261 Jul  9 12:08 file-leak-detector.exclude
-rw-r--r--  1 jenkins jenkins   6229 Jul  9 12:08 forrest.properties
-rw-r--r--  1 jenkins jenkins     53 Jul  9 12:08 .gitattributes
drwxr-xr-x  3 jenkins jenkins   4096 Jul  9 12:08 .github
-rw-r--r--  1 jenkins jenkins    396 Jul  9 12:08 .gitignore
drwxr-xr-x  5 jenkins jenkins   4096 Jul 31 00:31 .gradle
drwxr-xr-x  3 jenkins jenkins   4096 Jul  9 12:08 gradle
-rw-r--r--  1 jenkins jenkins    494 Jul  9 12:08 gradle.properties
-rwxr-xr-x  1 jenkins jenkins   8762 Sep 13 00:53 gradlew
-rw-r--r--  1 jenkins jenkins   2966 Sep 13 00:53 gradlew.bat
drwxr-xr-x  2 jenkins jenkins   4096 Sep 19 12:07 jenkins
-rw-r--r--  1 jenkins jenkins 167947 Jul  9 12:08 KEYS
drwxr-xr-x  2 jenkins jenkins   4096 Jul  9 12:08 legal
drwxr-xr-x  2 jenkins jenkins   4096 Jul  9 12:08 lib.stored
drwxr-xr-x  3 jenkins jenkins   4096 Jul  9 12:08 osgi
-rw-r--r--  1 jenkins jenkins   4813 Jul  9 12:08 patch.xml
drwxr-xr-x  5 jenkins jenkins   4096 Sep 13 00:53 poi
drwxr-xr-x  4 jenkins jenkins   4096 Aug  9 00:08 poi-examples
drwxr-xr-x  4 jenkins jenkins   4096 Sep 13 00:53 poi-excelant
drwxr-xr-x  4 jenkins jenkins   4096 Sep 13 00:53 poi-integration
drwxr-xr-x  4 jenkins jenkins   4096 Sep 13 00:53 poi-ooxml
drwxr-xr-x  4 jenkins jenkins   4096 Sep 13 00:53 poi-ooxml-full
drwxr-xr-x  4 jenkins jenkins   4096 Aug  9 00:09 poi-ooxml-lite
drwxr-xr-x  4 jenkins jenkins   4096 Sep 13 00:53 poi-ooxml-lite-agent
drwxr-xr-x  5 jenkins jenkins   4096 Aug  9 00:08 poi-scratchpad
-rw-r--r--  1 jenkins jenkins   4354 Jul 20 00:07 README.rst
-rw-r--r--  1 jenkins jenkins    428 Jul  9 12:08 SECURITY.md
-rw-r--r--  1 jenkins jenkins    190 Jul  9 12:08 settings.gradle
drwxr-xr-x  4 jenkins jenkins   4096 Jul  9 12:08 src
drwxr-xr-x  4 jenkins jenkins   4096 Sep 19 12:07 .svn
drwxr-xr-x 15 jenkins jenkins   4096 Jul  9 12:08 test-data
-rw-r--r--  1 jenkins jenkins   3803 Jul  9 12:08 wrapper.gradle
+ echo which ant
which ant
+ which ant
/usr/bin/ant
+ ant -version
Apache Ant(TM) version 1.10.12 compiled on January 17 1970
+ echo <project default="test"><target name="test"><echo>Java ${ant.java.version}/${java.version}</echo><exec executable="javac"><arg value="-version"/></exec></target></project>
+ ant -f build.javacheck.xml -v
Apache Ant(TM) version 1.10.12 compiled on January 17 1970
Buildfile: <https://ci-builds.apache.org/job/POI/job/POI-DSL-OpenJDK/ws/build.javacheck.xml>
Detected Java version: 11 in: /usr/lib/jvm/java-11-openjdk-amd64
Detected OS: Linux
parsing buildfile <https://ci-builds.apache.org/job/POI/job/POI-DSL-OpenJDK/ws/build.javacheck.xml> with URI = <https://ci-builds.apache.org/job/POI/job/POI-DSL-OpenJDK/ws/build.javacheck.xml>
Project base dir set to: <https://ci-builds.apache.org/job/POI/job/POI-DSL-OpenJDK/ws/>
Build sequence for target(s) `test' is [test]
Complete build sequence is [test, ]

test:
parsing buildfile jar:file:/usr/share/ant/lib/ant.jar!/org/apache/tools/ant/antlib.xml with URI = jar:file:/usr/share/ant/lib/ant.jar!/org/apache/tools/ant/antlib.xml from a zip file
     [echo] Java 11/11.0.24
     [exec] Current OS is Linux
     [exec] Executing 'javac' with arguments:
     [exec] '-version'
     [exec] 
     [exec] The ' characters around the executable and arguments are
     [exec] not part of the command.
     [exec] javac 11.0.24

BUILD SUCCESSFUL
Total time: 1 second
+ exit 0
ERROR: Not all environment variables could be successfully injected. Check for similarly-named environment variables.
No JDK named ‘adoptopenjdk_hotspot_8u282’ found
[POI-DSL-OpenJDK] $ /bin/sh -xe /tmp/jenkins11644821219176669649.sh
+ touch --no-create build/*/build/test-results/TEST-*.xml build/*/build/test-results/test/TEST-*.xml
[Gradle] - Launching build.
ERROR: Not all environment variables could be successfully injected. Check for similarly-named environment variables.
No JDK named ‘adoptopenjdk_hotspot_8u282’ found
[POI-DSL-OpenJDK] $ <https://ci-builds.apache.org/job/POI/job/POI-DSL-OpenJDK/ws/gradlew> -PjdkVersion=8 -PjdkVendor=adoptopenjdk --refresh-dependencies clean jenkinsLite
To honour the JVM settings for this build a single-use Daemon process will be forked. For more on this, please refer to https://docs.gradle.org/8.10/userguide/gradle_daemon.html#sec:disabling_the_daemon in the Gradle documentation.
Daemon will be stopped at the end of the build 
Configuration on demand is an incubating feature.

> Configure project :
Trying to override old definition of datatype junit
Run with reduced parallelism for CI build
Run with reduced parallelism for CI build
Run with reduced parallelism for CI build
Run with reduced parallelism for CI build
Run with reduced parallelism for CI build
Run with reduced parallelism for CI build
Run with reduced parallelism for CI build
Run with reduced parallelism for CI build
Run with reduced parallelism for CI build
Invalid Java installation found at '/usr/local/asfpackages/java/oraclejdk-j2sdk1.4.2-19' (Maven Toolchains) auto-detected. It will be re-checked in the next build. This might have performance impact if it keeps failing. Run the 'javaToolchains' task for more details.

FAILURE: Build failed with an exception.

* Where:
Build file '<https://ci-builds.apache.org/job/POI/job/POI-DSL-OpenJDK/ws/poi/build.gradle'> line: 82

* What went wrong:
A problem occurred evaluating project ':poi'.
> Could not resolve all dependencies for configuration ':poi:testRuntimeClasspath'.
   > Failed to calculate the value of task ':poi:compileTestJava' property 'javaCompiler'.
      > Cannot find a Java installation on your machine matching this tasks requirements: {languageVersion=8, vendor=vendor matching('adoptopenjdk'), implementation=vendor-specific} for LINUX on x86_64.
         > No locally installed toolchains match and toolchain download repositories have not been configured.

* Try:
> Learn more about toolchain auto-detection at https://docs.gradle.org/8.10/userguide/toolchains.html#sec:auto_detection.
> Learn more about toolchain repositories at https://docs.gradle.org/8.10/userguide/toolchains.html#sub:download_repositories.
> Run with --stacktrace option to get the stack trace.
> Run with --info or --debug option to get more log output.
> Run with --scan to get full insights.
> Get more help at https://help.gradle.org.

Deprecated Gradle features were used in this build, making it incompatible with Gradle 9.0.

You can use '--warning-mode all' to show the individual deprecation warnings and determine if they come from your own scripts or plugins.

For more on this, please refer to https://docs.gradle.org/8.10/userguide/command_line_interface.html#sec:command_line_warnings in the Gradle documentation.

BUILD FAILED in 57s
Build step 'Invoke Gradle script' changed build result to FAILURE
Build step 'Invoke Gradle script' marked build as failure
[SpotBugs] Skipping execution of recorder since overall result is 'FAILURE'
ERROR: Not all environment variables could be successfully injected. Check for similarly-named environment variables.
No JDK named ‘adoptopenjdk_hotspot_8u282’ found
Archiving artifacts
ERROR: Not all environment variables could be successfully injected. Check for similarly-named environment variables.
No JDK named ‘adoptopenjdk_hotspot_8u282’ found
Recording test results
ERROR: Not all environment variables could be successfully injected. Check for similarly-named environment variables.
No JDK named ‘adoptopenjdk_hotspot_8u282’ found
[Checks API] No suitable checks publisher found.
ERROR: Not all environment variables could be successfully injected. Check for similarly-named environment variables.
No JDK named ‘adoptopenjdk_hotspot_8u282’ found

---------------------------------------------------------------------
To unsubscribe, e-mail: dev-unsubscribe@poi.apache.org
For additional commands, e-mail: dev-help@poi.apache.org


Build failed in Jenkins: POI » POI-DSL-OpenJDK #997

Posted by Apache Jenkins Server <je...@builds.apache.org>.
See <https://ci-builds.apache.org/job/POI/job/POI-DSL-OpenJDK/997/display/redirect?page=changes>

Changes:

[PJ Fanning] fix typo


------------------------------------------
[...truncated 434.55 KB...]
AU        src/documentation/resources/images/logoKarmokar2s.png
AU        src/documentation/resources/images/logoRaPiGmbH5.png
AU        src/documentation/resources/images/logoRaPiGmbH6.png
AU        src/documentation/resources/images/logoKarmokar6s.png
AU        src/documentation/resources/images/logoRaPiGmbH7.png
AU        src/documentation/resources/images/logoRaPiGmbH8.png
AU        src/documentation/resources/images/logoRaPiGmbH9.png
AU        src/documentation/resources/images/logoDanielFernandez.png
AU        src/documentation/resources/images/logoAndrewClements2.png
AU        src/documentation/resources/images/hslf_shapes.gif
AU        src/documentation/resources/images/logoWendyWise2.png
AU        src/documentation/resources/images/POIFSLifeCycle.gif
AU        src/documentation/resources/images/logoAdria1.png
AU        src/documentation/resources/images/logoAdria2.png
AU        src/documentation/resources/images/logoAdria3.png
AU        src/documentation/resources/images/remove.jpg
AU        src/documentation/resources/images/logoKarmokar3s.png
AU        src/documentation/resources/images/logoGlenStampoutlzis.png
AU        src/documentation/resources/images/logoKarmokar1.png
AU        src/documentation/resources/images/POIFSInitialization.gif
AU        src/documentation/resources/images/logoKarmokar2.png
AU        src/documentation/resources/images/logoRaPiGmbH10.png
AU        src/documentation/resources/images/logoKarmokar3.png
AU        src/documentation/resources/images/logoRaPiGmbH11.png
AU        src/documentation/resources/images/logoMichaelMosmann.png
AU        src/documentation/resources/images/logoKarmokar4.png
AU        src/documentation/resources/images/logoRaPiGmbH12.png
AU        src/documentation/resources/images/logoKarmokar5.png
AU        src/documentation/resources/images/logoKarmokar6.png
AU        src/documentation/resources/images/ApacheConEu08.jpg
AU        src/documentation/resources/images/BlockClassDiagram.gif
AU        src/documentation/resources/images/calculatePayment.jpg
AU        src/documentation/resources/images/PropertyTableClassDiagram.gif
AU        src/documentation/resources/images/logoRussellBeattie1.png
AU        src/documentation/resources/images/logoRussellBeattie2.png
AU        src/documentation/resources/images/logoRussellBeattie3.png
A         src/documentation/sitemap.xmap
A         src/documentation/cli.xconf
AU        src/documentation/README.txt
A         src/documentation/classes
A         src/documentation/classes/CatalogManager.properties
At revision 1920715

At revision 1920715

No changes for https://svn.apache.org/repos/asf/poi/trunk since the previous build
No changes for https://svn.apache.org/repos/asf/poi/site/forrest.properties since the previous build
ERROR: Not all environment variables could be successfully injected. Check for similarly-named environment variables.
No JDK named ‘adoptopenjdk_hotspot_8u282’ found
ERROR: Not all environment variables could be successfully injected. Check for similarly-named environment variables.
No JDK named ‘adoptopenjdk_hotspot_8u282’ found
[POI-DSL-OpenJDK] $ /bin/sh -xe /tmp/jenkins9585573074518329188.sh
+ rm -rf examples excelant integrationtest main ooxml ooxml-schema scratchpad build.javacheck.xml
+ svn status
    X   forrest.properties
X       src/documentation

Performing status on external item at 'src/documentation':
+ svn revert poi-examples/src/main/java9/module-info.java poi-excelant/src/main/java9/module-info.java poi-excelant/src/test/java9/module-info.java poi-integration/src/test/java9/module-info.java poi-ooxml-full/src/main/java9/module-info.java poi-ooxml-lite-agent/src/main/java9/module-info.java poi-ooxml-lite/src/main/java9/module-info.java poi-ooxml/src/main/java9/module-info.java poi-ooxml/src/test/java9/module-info.java poi-scratchpad/src/main/java9/module-info.java poi-scratchpad/src/test/java9/module-info.java poi/src/main/java9/module-info.java poi/src/test/java9/module-info.java
+ svn revert src/resources/ooxml-lite-report.clazz src/resources/ooxml-lite-report.xsb
+ echo Java-Home:
Java-Home:
+ ls -al /
total 8391136
drwxr-xr-x  19 root root       4096 Aug 28 03:11 .
drwxr-xr-x  19 root root       4096 Aug 28 03:11 ..
lrwxrwxrwx   1 root root          7 Aug 23  2023 bin -> usr/bin
drwxr-xr-x   4 root root       4096 Sep 16 06:16 boot
drwxr-xr-x  21 root root       4500 Sep 11 21:25 dev
drwxr-xr-x 141 root root      12288 Sep 10 06:58 etc
drwxr-xr-x  10 root root       4096 Dec 12  2023 home
lrwxrwxrwx   1 root root          7 Aug 23  2023 lib -> usr/lib
lrwxrwxrwx   1 root root          9 Aug 23  2023 lib32 -> usr/lib32
lrwxrwxrwx   1 root root          9 Aug 23  2023 lib64 -> usr/lib64
lrwxrwxrwx   1 root root         10 Aug 23  2023 libx32 -> usr/libx32
drwx------   2 root root      16384 Nov  7  2023 lost+found
drwxr-xr-x   2 root root       4096 Aug 23  2023 media
drwxr-xr-x   2 root root       4096 Aug 23  2023 mnt
drwxr-xr-x  14 root root       4096 Apr 19 20:59 opt
dr-xr-xr-x 437 root root          0 Jul 27 10:24 proc
-rw-r--r--   1 root root      11304 May 17  2023 puppet-release-jammy.deb
drwx------  11 root root       4096 Jul 27 10:28 root
drwxr-xr-x  42 root root       1260 Sep 16 11:58 run
lrwxrwxrwx   1 root root          8 Aug 23  2023 sbin -> usr/sbin
drwxr-xr-x  13 root root       4096 Aug 15 10:28 snap
drwxr-xr-x   2 root root       4096 Jul 27 10:28 srv
-rw-------   1 root root 8589934592 Nov  7  2023 swap.img
dr-xr-xr-x  13 root root          0 Jul 27 10:24 sys
drwxrwxrwt 365 root root    2490368 Sep 16 12:26 tmp
drwxr-xr-x  16 root root       4096 Nov  7  2023 usr
drwxr-xr-x  13 root root       4096 Aug 23  2023 var
+ ls -al /bin
lrwxrwxrwx 1 root root 7 Aug 23  2023 /bin -> usr/bin
+ /bin/java -version
openjdk version "11.0.24" 2024-07-16
OpenJDK Runtime Environment (build 11.0.24+8-post-Ubuntu-1ubuntu322.04)
OpenJDK 64-Bit Server VM (build 11.0.24+8-post-Ubuntu-1ubuntu322.04, mixed mode, sharing)
+ echo which java
which java
+ which java
/usr/bin/java
+ java -version
openjdk version "11.0.24" 2024-07-16
OpenJDK Runtime Environment (build 11.0.24+8-post-Ubuntu-1ubuntu322.04)
OpenJDK 64-Bit Server VM (build 11.0.24+8-post-Ubuntu-1ubuntu322.04, mixed mode, sharing)
+ echo which javac
which javac
+ which javac
/usr/bin/javac
+ javac -version
javac 11.0.24
+ echo Ant-Home:
Ant-Home:
+ ls -al
total 512
drwxr-xr-x 20 jenkins jenkins   4096 Sep 16 12:26 .
drwxr-xr-x  8 jenkins jenkins   4096 Sep 16 12:25 ..
-rw-r--r--  1 jenkins jenkins    520 Sep 16 12:26 .asf.yaml
-rw-r--r--  1 jenkins jenkins  33427 Sep 16 12:25 build.gradle
-rw-r--r--  1 jenkins jenkins 151471 Sep 16 12:25 build.xml
-rw-r--r--  1 jenkins jenkins   7709 Sep 16 12:26 doap_POI.rdf
-rw-r--r--  1 jenkins jenkins   3261 Sep 16 12:26 file-leak-detector.exclude
-rw-r--r--  1 jenkins jenkins   6229 Sep 16 12:26 forrest.properties
-rw-r--r--  1 jenkins jenkins     53 Sep 16 12:26 .gitattributes
drwxr-xr-x  3 jenkins jenkins   4096 Sep 16 12:26 .github
-rw-r--r--  1 jenkins jenkins    396 Sep 16 12:26 .gitignore
drwxr-xr-x  3 jenkins jenkins   4096 Sep 16 12:25 gradle
-rw-r--r--  1 jenkins jenkins    494 Sep 16 12:26 gradle.properties
-rwxr-xr-x  1 jenkins jenkins   8762 Sep 16 12:25 gradlew
-rw-r--r--  1 jenkins jenkins   2966 Sep 16 12:25 gradlew.bat
drwxr-xr-x  2 jenkins jenkins   4096 Sep 16 12:25 jenkins
-rw-r--r--  1 jenkins jenkins 167947 Sep 16 12:26 KEYS
drwxr-xr-x  2 jenkins jenkins   4096 Sep 16 12:26 legal
drwxr-xr-x  2 jenkins jenkins   4096 Sep 16 12:26 lib.stored
drwxr-xr-x  3 jenkins jenkins   4096 Sep 16 12:25 osgi
-rw-r--r--  1 jenkins jenkins   4813 Sep 16 12:26 patch.xml
drwxr-xr-x  4 jenkins jenkins   4096 Sep 16 12:25 poi
drwxr-xr-x  3 jenkins jenkins   4096 Sep 16 12:26 poi-examples
drwxr-xr-x  3 jenkins jenkins   4096 Sep 16 12:25 poi-excelant
drwxr-xr-x  3 jenkins jenkins   4096 Sep 16 12:25 poi-integration
drwxr-xr-x  3 jenkins jenkins   4096 Sep 16 12:25 poi-ooxml
drwxr-xr-x  3 jenkins jenkins   4096 Sep 16 12:25 poi-ooxml-full
drwxr-xr-x  3 jenkins jenkins   4096 Sep 16 12:26 poi-ooxml-lite
drwxr-xr-x  3 jenkins jenkins   4096 Sep 16 12:25 poi-ooxml-lite-agent
drwxr-xr-x  4 jenkins jenkins   4096 Sep 16 12:26 poi-scratchpad
-rw-r--r--  1 jenkins jenkins   4354 Sep 16 12:26 README.rst
-rw-r--r--  1 jenkins jenkins    428 Sep 16 12:26 SECURITY.md
-rw-r--r--  1 jenkins jenkins    190 Sep 16 12:26 settings.gradle
drwxr-xr-x  4 jenkins jenkins   4096 Sep 16 12:26 src
drwxr-xr-x  4 jenkins jenkins   4096 Sep 16 12:26 .svn
drwxr-xr-x 15 jenkins jenkins   4096 Sep 16 12:26 test-data
-rw-r--r--  1 jenkins jenkins   3803 Sep 16 12:26 wrapper.gradle
+ echo which ant
which ant
+ which ant
/usr/bin/ant
+ ant -version
Apache Ant(TM) version 1.10.12 compiled on January 17 1970
+ echo <project default="test"><target name="test"><echo>Java ${ant.java.version}/${java.version}</echo><exec executable="javac"><arg value="-version"/></exec></target></project>
+ ant -f build.javacheck.xml -v
Apache Ant(TM) version 1.10.12 compiled on January 17 1970
Buildfile: <https://ci-builds.apache.org/job/POI/job/POI-DSL-OpenJDK/ws/build.javacheck.xml>
Detected Java version: 11 in: /usr/lib/jvm/java-11-openjdk-amd64
Detected OS: Linux
parsing buildfile <https://ci-builds.apache.org/job/POI/job/POI-DSL-OpenJDK/ws/build.javacheck.xml> with URI = <https://ci-builds.apache.org/job/POI/job/POI-DSL-OpenJDK/ws/build.javacheck.xml>
Project base dir set to: <https://ci-builds.apache.org/job/POI/job/POI-DSL-OpenJDK/ws/>
Build sequence for target(s) `test' is [test]
Complete build sequence is [test, ]

test:
parsing buildfile jar:file:/usr/share/ant/lib/ant.jar!/org/apache/tools/ant/antlib.xml with URI = jar:file:/usr/share/ant/lib/ant.jar!/org/apache/tools/ant/antlib.xml from a zip file
     [echo] Java 11/11.0.24
     [exec] Current OS is Linux
     [exec] Executing 'javac' with arguments:
     [exec] '-version'
     [exec] 
     [exec] The ' characters around the executable and arguments are
     [exec] not part of the command.
     [exec] javac 11.0.24

BUILD SUCCESSFUL
Total time: 0 seconds
+ exit 0
ERROR: Not all environment variables could be successfully injected. Check for similarly-named environment variables.
No JDK named ‘adoptopenjdk_hotspot_8u282’ found
[POI-DSL-OpenJDK] $ /bin/sh -xe /tmp/jenkins10128016325894878509.sh
+ touch --no-create build/*/build/test-results/TEST-*.xml build/*/build/test-results/test/TEST-*.xml
[Gradle] - Launching build.
ERROR: Not all environment variables could be successfully injected. Check for similarly-named environment variables.
No JDK named ‘adoptopenjdk_hotspot_8u282’ found
[POI-DSL-OpenJDK] $ <https://ci-builds.apache.org/job/POI/job/POI-DSL-OpenJDK/ws/gradlew> -PjdkVersion=8 -PjdkVendor=adoptopenjdk --refresh-dependencies clean jenkinsLite
To honour the JVM settings for this build a single-use Daemon process will be forked. For more on this, please refer to https://docs.gradle.org/8.10/userguide/gradle_daemon.html#sec:disabling_the_daemon in the Gradle documentation.
Daemon will be stopped at the end of the build 
Configuration on demand is an incubating feature.

> Configure project :
Trying to override old definition of datatype junit
Run with reduced parallelism for CI build
Run with reduced parallelism for CI build
Run with reduced parallelism for CI build
Run with reduced parallelism for CI build
Run with reduced parallelism for CI build
Run with reduced parallelism for CI build
Run with reduced parallelism for CI build
Run with reduced parallelism for CI build
Run with reduced parallelism for CI build
Invalid Java installation found at '/usr/local/asfpackages/java/oraclejdk-j2sdk1.4.2-19' (Maven Toolchains) auto-detected. It will be re-checked in the next build. This might have performance impact if it keeps failing. Run the 'javaToolchains' task for more details.

FAILURE: Build failed with an exception.

* Where:
Build file '<https://ci-builds.apache.org/job/POI/job/POI-DSL-OpenJDK/ws/poi/build.gradle'> line: 82

* What went wrong:
A problem occurred evaluating project ':poi'.
> Could not resolve all dependencies for configuration ':poi:testRuntimeClasspath'.
   > Failed to calculate the value of task ':poi:compileTestJava' property 'javaCompiler'.
      > Cannot find a Java installation on your machine matching this tasks requirements: {languageVersion=8, vendor=vendor matching('adoptopenjdk'), implementation=vendor-specific} for LINUX on x86_64.
         > No locally installed toolchains match and toolchain download repositories have not been configured.

* Try:
> Learn more about toolchain auto-detection at https://docs.gradle.org/8.10/userguide/toolchains.html#sec:auto_detection.
> Learn more about toolchain repositories at https://docs.gradle.org/8.10/userguide/toolchains.html#sub:download_repositories.
> Run with --stacktrace option to get the stack trace.
> Run with --info or --debug option to get more log output.
> Run with --scan to get full insights.
> Get more help at https://help.gradle.org.

Deprecated Gradle features were used in this build, making it incompatible with Gradle 9.0.

You can use '--warning-mode all' to show the individual deprecation warnings and determine if they come from your own scripts or plugins.

For more on this, please refer to https://docs.gradle.org/8.10/userguide/command_line_interface.html#sec:command_line_warnings in the Gradle documentation.

BUILD FAILED in 30s
Build step 'Invoke Gradle script' changed build result to FAILURE
Build step 'Invoke Gradle script' marked build as failure
[SpotBugs] Skipping execution of recorder since overall result is 'FAILURE'
ERROR: Not all environment variables could be successfully injected. Check for similarly-named environment variables.
No JDK named ‘adoptopenjdk_hotspot_8u282’ found
Archiving artifacts
ERROR: Not all environment variables could be successfully injected. Check for similarly-named environment variables.
No JDK named ‘adoptopenjdk_hotspot_8u282’ found
Recording test results
ERROR: Not all environment variables could be successfully injected. Check for similarly-named environment variables.
No JDK named ‘adoptopenjdk_hotspot_8u282’ found
ERROR: Step ‘Publish JUnit test result report’ failed: No test report files were found. Configuration error?
ERROR: Not all environment variables could be successfully injected. Check for similarly-named environment variables.
No JDK named ‘adoptopenjdk_hotspot_8u282’ found

---------------------------------------------------------------------
To unsubscribe, e-mail: dev-unsubscribe@poi.apache.org
For additional commands, e-mail: dev-help@poi.apache.org


Build failed in Jenkins: POI » POI-DSL-OpenJDK #996

Posted by Apache Jenkins Server <je...@builds.apache.org>.
See <https://ci-builds.apache.org/job/POI/job/POI-DSL-OpenJDK/996/display/redirect?page=changes>

Changes:

[PJ Fanning] back to ant

[PJ Fanning] back to ant

[PJ Fanning] use gradle for java 22 builds

[PJ Fanning] try jupiter junit 5.11.0 again

[PJ Fanning] upgrade spotbugs

[PJ Fanning] revert junit upgrade due to CI issues


------------------------------------------
Started by an SCM change
Running as SYSTEM
ERROR: Not all environment variables could be successfully injected. Check for similarly-named environment variables.
No JDK named ‘adoptopenjdk_hotspot_8u282’ found
[EnvInject] - Loading node environment variables.
[EnvInject] - Preparing an environment for the build.
[EnvInject] - Keeping Jenkins system variables.
[EnvInject] - Keeping Jenkins build variables.
[EnvInject] - Injecting as environment variables the properties content 
FORREST_HOME=/home/jenkins/tools/forrest/latest
LANG=en_US.UTF-8
CI_BUILD=TRUE

[EnvInject] - Variables injected successfully.
[EnvInject] - Injecting contributions.
Building remotely on builds39 (ubuntu) in workspace <https://ci-builds.apache.org/job/POI/job/POI-DSL-OpenJDK/ws/>
[WS-CLEANUP] Deleting project workspace...
[WS-CLEANUP] Done
ERROR: Not all environment variables could be successfully injected. Check for similarly-named environment variables.
No JDK named ‘adoptopenjdk_hotspot_8u282’ found
Updating https://svn.apache.org/repos/asf/poi/trunk at revision '2024-09-16T00:07:12.955 +0000'
U         jenkins/create_jobs.groovy
U         build.gradle
U         build.xml
U         poi/src/main/java/org/apache/poi/util/DefaultTempFileCreationStrategy.java
U         poi/src/main/java/org/apache/poi/ss/util/SheetUtil.java
U         poi/src/test/java/org/apache/poi/ss/util/TestSheetUtil.java

<-- Got one external: documentation, svn url: https://svn.apache.org/repos/asf/poi/site/src/documentation -->
Fetching 'https://svn.apache.org/repos/asf/poi/site/src/documentation' at -1 into '<https://ci-builds.apache.org/job/POI/job/POI-DSL-OpenJDK/ws/src/documentation'>
U         src/documentation/content/xdocs/changes.xml
At revision 1920703


<-- Got one external: forrest.properties, svn url: https://svn.apache.org/repos/asf/poi/site/forrest.properties -->
Fetching 'https://svn.apache.org/repos/asf/poi/site/forrest.properties' at -1 into '<https://ci-builds.apache.org/job/POI/job/POI-DSL-OpenJDK/ws/forrest.properties'>
At revision 1920703

At revision 1920703

No changes for https://svn.apache.org/repos/asf/poi/site/src/documentation since the previous build
No changes for https://svn.apache.org/repos/asf/poi/site/forrest.properties since the previous build
ERROR: Not all environment variables could be successfully injected. Check for similarly-named environment variables.
No JDK named ‘adoptopenjdk_hotspot_8u282’ found
ERROR: Not all environment variables could be successfully injected. Check for similarly-named environment variables.
No JDK named ‘adoptopenjdk_hotspot_8u282’ found
[POI-DSL-OpenJDK] $ /bin/sh -xe /tmp/jenkins4684573830695627739.sh
+ rm -rf examples excelant integrationtest main ooxml ooxml-schema scratchpad build.javacheck.xml
+ svn status
    X   forrest.properties
X       src/documentation

Performing status on external item at 'src/documentation':
+ svn revert poi-examples/src/main/java9/module-info.java poi-excelant/src/main/java9/module-info.java poi-excelant/src/test/java9/module-info.java poi-integration/src/test/java9/module-info.java poi-ooxml-full/src/main/java9/module-info.java poi-ooxml-lite-agent/src/main/java9/module-info.java poi-ooxml-lite/src/main/java9/module-info.java poi-ooxml/src/main/java9/module-info.java poi-ooxml/src/test/java9/module-info.java poi-scratchpad/src/main/java9/module-info.java poi-scratchpad/src/test/java9/module-info.java poi/src/main/java9/module-info.java poi/src/test/java9/module-info.java
+ svn revert src/resources/ooxml-lite-report.clazz src/resources/ooxml-lite-report.xsb
+ echo Java-Home:
Java-Home:
+ ls -al /
total 8390608
drwxr-xr-x  20 root root       4096 Aug 20 22:49 .
drwxr-xr-x  20 root root       4096 Aug 20 22:49 ..
lrwxrwxrwx   1 root root          7 Aug 23  2023 bin -> usr/bin
drwxr-xr-x   4 root root       4096 Sep 13 06:22 boot
drwxr-xr-x  21 root root       4340 Sep  3 14:50 dev
drwxr-xr-x 141 root root      12288 Sep 10 06:50 etc
drwxr-xr-x  10 root root       4096 Dec 21  2023 home
lrwxrwxrwx   1 root root          7 Aug 23  2023 lib -> usr/lib
lrwxrwxrwx   1 root root          9 Aug 23  2023 lib32 -> usr/lib32
lrwxrwxrwx   1 root root          9 Aug 23  2023 lib64 -> usr/lib64
lrwxrwxrwx   1 root root         10 Aug 23  2023 libx32 -> usr/libx32
drwx------   2 root root      16384 Nov 13  2023 lost+found
drwxr-xr-x   2 root root       4096 Aug 23  2023 media
drwxr-xr-x   2 root root       4096 Aug 23  2023 mnt
drwxr-xr-x  14 root root       4096 Apr 19 20:57 opt
dr-xr-xr-x 403 root root          0 Aug 20 22:45 proc
-rw-r--r--   1 root root      11304 May 17  2023 puppet-release-jammy.deb
drwx------  11 root root       4096 Aug 20 22:50 root
drwxr-xr-x  44 root root       1320 Sep 15 23:51 run
lrwxrwxrwx   1 root root          8 Aug 23  2023 sbin -> usr/sbin
drwxr-xr-x  13 root root       4096 Aug 21 11:19 snap
drwxr-xr-x   2 root root       4096 Aug 20 22:50 srv
-rw-------   1 root root 8589934592 Nov 13  2023 swap.img
dr-xr-xr-x  13 root root          0 Aug 20 22:45 sys
drwxrwxrwt 285 root root    1941504 Sep 16 00:07 tmp
drwx------   3 root root       4096 Nov 17  2023 Users
drwxr-xr-x  16 root root       4096 Nov 13  2023 usr
drwxr-xr-x  13 root root       4096 Aug 23  2023 var
+ ls -al /bin
lrwxrwxrwx 1 root root 7 Aug 23  2023 /bin -> usr/bin
+ /bin/java -version
openjdk version "11.0.24" 2024-07-16
OpenJDK Runtime Environment (build 11.0.24+8-post-Ubuntu-1ubuntu322.04)
OpenJDK 64-Bit Server VM (build 11.0.24+8-post-Ubuntu-1ubuntu322.04, mixed mode, sharing)
+ echo which java
which java
+ which java
/usr/bin/java
+ java -version
openjdk version "11.0.24" 2024-07-16
OpenJDK Runtime Environment (build 11.0.24+8-post-Ubuntu-1ubuntu322.04)
OpenJDK 64-Bit Server VM (build 11.0.24+8-post-Ubuntu-1ubuntu322.04, mixed mode, sharing)
+ echo which javac
which javac
+ which javac
/usr/bin/javac
+ javac -version
javac 11.0.24
+ echo Ant-Home:
Ant-Home:
+ ls -al
total 516
drwxr-xr-x 21 jenkins jenkins   4096 Sep 16 00:07 .
drwxr-xr-x  3 jenkins jenkins   4096 Aug 31 00:07 ..
-rw-r--r--  1 jenkins jenkins    520 Aug 31 00:08 .asf.yaml
-rw-r--r--  1 jenkins jenkins  33427 Sep 16 00:07 build.gradle
-rw-r--r--  1 jenkins jenkins 151471 Sep 16 00:07 build.xml
-rw-r--r--  1 jenkins jenkins   7709 Aug 31 00:08 doap_POI.rdf
-rw-r--r--  1 jenkins jenkins   3261 Aug 31 00:08 file-leak-detector.exclude
-rw-r--r--  1 jenkins jenkins   6229 Aug 31 00:08 forrest.properties
-rw-r--r--  1 jenkins jenkins     53 Aug 31 00:08 .gitattributes
drwxr-xr-x  3 jenkins jenkins   4096 Aug 31 00:08 .github
-rw-r--r--  1 jenkins jenkins    396 Aug 31 00:08 .gitignore
drwxr-xr-x  5 jenkins jenkins   4096 Aug 31 00:08 .gradle
drwxr-xr-x  3 jenkins jenkins   4096 Aug 31 00:07 gradle
-rw-r--r--  1 jenkins jenkins    494 Aug 31 00:08 gradle.properties
-rwxr-xr-x  1 jenkins jenkins   8762 Aug 31 00:07 gradlew
-rw-r--r--  1 jenkins jenkins   2966 Aug 31 00:07 gradlew.bat
drwxr-xr-x  2 jenkins jenkins   4096 Sep 16 00:07 jenkins
-rw-r--r--  1 jenkins jenkins 167947 Aug 31 00:08 KEYS
drwxr-xr-x  2 jenkins jenkins   4096 Aug 31 00:08 legal
drwxr-xr-x  2 jenkins jenkins   4096 Aug 31 00:08 lib.stored
drwxr-xr-x  3 jenkins jenkins   4096 Aug 31 00:08 osgi
-rw-r--r--  1 jenkins jenkins   4813 Aug 31 00:08 patch.xml
drwxr-xr-x  4 jenkins jenkins   4096 Aug 31 00:07 poi
drwxr-xr-x  3 jenkins jenkins   4096 Aug 31 00:08 poi-examples
drwxr-xr-x  3 jenkins jenkins   4096 Aug 31 00:07 poi-excelant
drwxr-xr-x  3 jenkins jenkins   4096 Aug 31 00:07 poi-integration
drwxr-xr-x  3 jenkins jenkins   4096 Aug 31 00:07 poi-ooxml
drwxr-xr-x  3 jenkins jenkins   4096 Aug 31 00:07 poi-ooxml-full
drwxr-xr-x  3 jenkins jenkins   4096 Aug 31 00:08 poi-ooxml-lite
drwxr-xr-x  3 jenkins jenkins   4096 Aug 31 00:07 poi-ooxml-lite-agent
drwxr-xr-x  4 jenkins jenkins   4096 Aug 31 00:08 poi-scratchpad
-rw-r--r--  1 jenkins jenkins   4354 Aug 31 00:08 README.rst
-rw-r--r--  1 jenkins jenkins    428 Aug 31 00:08 SECURITY.md
-rw-r--r--  1 jenkins jenkins    190 Aug 31 00:08 settings.gradle
drwxr-xr-x  4 jenkins jenkins   4096 Aug 31 00:08 src
drwxr-xr-x  4 jenkins jenkins   4096 Sep 16 00:07 .svn
drwxr-xr-x 15 jenkins jenkins   4096 Aug 31 00:08 test-data
-rw-r--r--  1 jenkins jenkins   3803 Aug 31 00:08 wrapper.gradle
+ echo which ant
which ant
+ which ant
/usr/bin/ant
+ ant -version
Apache Ant(TM) version 1.10.12 compiled on January 17 1970
+ echo <project default="test"><target name="test"><echo>Java ${ant.java.version}/${java.version}</echo><exec executable="javac"><arg value="-version"/></exec></target></project>
+ ant -f build.javacheck.xml -v
Apache Ant(TM) version 1.10.12 compiled on January 17 1970
Buildfile: <https://ci-builds.apache.org/job/POI/job/POI-DSL-OpenJDK/ws/build.javacheck.xml>
Detected Java version: 11 in: /usr/lib/jvm/java-11-openjdk-amd64
Detected OS: Linux
parsing buildfile <https://ci-builds.apache.org/job/POI/job/POI-DSL-OpenJDK/ws/build.javacheck.xml> with URI = <https://ci-builds.apache.org/job/POI/job/POI-DSL-OpenJDK/ws/build.javacheck.xml>
Project base dir set to: <https://ci-builds.apache.org/job/POI/job/POI-DSL-OpenJDK/ws/>
Build sequence for target(s) `test' is [test]
Complete build sequence is [test, ]

test:
parsing buildfile jar:file:/usr/share/ant/lib/ant.jar!/org/apache/tools/ant/antlib.xml with URI = jar:file:/usr/share/ant/lib/ant.jar!/org/apache/tools/ant/antlib.xml from a zip file
     [echo] Java 11/11.0.24
     [exec] Current OS is Linux
     [exec] Executing 'javac' with arguments:
     [exec] '-version'
     [exec] 
     [exec] The ' characters around the executable and arguments are
     [exec] not part of the command.
     [exec] javac 11.0.24

BUILD SUCCESSFUL
Total time: 1 second
+ exit 0
ERROR: Not all environment variables could be successfully injected. Check for similarly-named environment variables.
No JDK named ‘adoptopenjdk_hotspot_8u282’ found
[POI-DSL-OpenJDK] $ /bin/sh -xe /tmp/jenkins18119323122180051902.sh
+ touch --no-create build/*/build/test-results/TEST-*.xml build/*/build/test-results/test/TEST-*.xml
[Gradle] - Launching build.
ERROR: Not all environment variables could be successfully injected. Check for similarly-named environment variables.
No JDK named ‘adoptopenjdk_hotspot_8u282’ found
[POI-DSL-OpenJDK] $ <https://ci-builds.apache.org/job/POI/job/POI-DSL-OpenJDK/ws/gradlew> -PjdkVersion=8 -PjdkVendor=adoptopenjdk --refresh-dependencies clean jenkinsLite
To honour the JVM settings for this build a single-use Daemon process will be forked. For more on this, please refer to https://docs.gradle.org/8.10/userguide/gradle_daemon.html#sec:disabling_the_daemon in the Gradle documentation.
Daemon will be stopped at the end of the build 
Configuration on demand is an incubating feature.

> Configure project :
Trying to override old definition of datatype junit
Run with reduced parallelism for CI build
Run with reduced parallelism for CI build
Run with reduced parallelism for CI build
Run with reduced parallelism for CI build
Run with reduced parallelism for CI build
Run with reduced parallelism for CI build
Run with reduced parallelism for CI build
Run with reduced parallelism for CI build
Run with reduced parallelism for CI build
Invalid Java installation found at '/usr/local/asfpackages/java/oraclejdk-j2sdk1.4.2-19' (Maven Toolchains) auto-detected. It will be re-checked in the next build. This might have performance impact if it keeps failing. Run the 'javaToolchains' task for more details.

FAILURE: Build failed with an exception.

* Where:
Build file '<https://ci-builds.apache.org/job/POI/job/POI-DSL-OpenJDK/ws/poi/build.gradle'> line: 82

* What went wrong:
A problem occurred evaluating project ':poi'.
> Could not resolve all dependencies for configuration ':poi:testRuntimeClasspath'.
   > Failed to calculate the value of task ':poi:compileTestJava' property 'javaCompiler'.
      > Cannot find a Java installation on your machine matching this tasks requirements: {languageVersion=8, vendor=vendor matching('adoptopenjdk'), implementation=vendor-specific} for LINUX on x86_64.
         > No locally installed toolchains match and toolchain download repositories have not been configured.

* Try:
> Learn more about toolchain auto-detection at https://docs.gradle.org/8.10/userguide/toolchains.html#sec:auto_detection.
> Learn more about toolchain repositories at https://docs.gradle.org/8.10/userguide/toolchains.html#sub:download_repositories.
> Run with --stacktrace option to get the stack trace.
> Run with --info or --debug option to get more log output.
> Run with --scan to get full insights.
> Get more help at https://help.gradle.org.

Deprecated Gradle features were used in this build, making it incompatible with Gradle 9.0.

You can use '--warning-mode all' to show the individual deprecation warnings and determine if they come from your own scripts or plugins.

For more on this, please refer to https://docs.gradle.org/8.10/userguide/command_line_interface.html#sec:command_line_warnings in the Gradle documentation.

BUILD FAILED in 1m 8s
Build step 'Invoke Gradle script' changed build result to FAILURE
Build step 'Invoke Gradle script' marked build as failure
[SpotBugs] Skipping execution of recorder since overall result is 'FAILURE'
ERROR: Not all environment variables could be successfully injected. Check for similarly-named environment variables.
No JDK named ‘adoptopenjdk_hotspot_8u282’ found
Archiving artifacts
ERROR: Not all environment variables could be successfully injected. Check for similarly-named environment variables.
No JDK named ‘adoptopenjdk_hotspot_8u282’ found
Recording test results
ERROR: Not all environment variables could be successfully injected. Check for similarly-named environment variables.
No JDK named ‘adoptopenjdk_hotspot_8u282’ found
ERROR: Step ‘Publish JUnit test result report’ failed: No test report files were found. Configuration error?
ERROR: Not all environment variables could be successfully injected. Check for similarly-named environment variables.
No JDK named ‘adoptopenjdk_hotspot_8u282’ found

---------------------------------------------------------------------
To unsubscribe, e-mail: dev-unsubscribe@poi.apache.org
For additional commands, e-mail: dev-help@poi.apache.org


Build failed in Jenkins: POI » POI-DSL-OpenJDK #995

Posted by Apache Jenkins Server <je...@builds.apache.org>.
See <https://ci-builds.apache.org/job/POI/job/POI-DSL-OpenJDK/995/display/redirect?page=changes>

Changes:

[PJ Fanning] [bug-69323] DefaultTempFileCreationStrategy should worry about OS deleting the temp dir. Thanks to Palle Girgensohn. This closes #691

[PJ Fanning] [bug-69323] DefaultTempFileCreationStrategy should worry about OS deleting the temp dir. Thanks to Palle Girgensohn. This closes #691


------------------------------------------
Started by an SCM change
Running as SYSTEM
ERROR: Not all environment variables could be successfully injected. Check for similarly-named environment variables.
[EnvInject] - Loading node environment variables.
[EnvInject] - Preparing an environment for the build.
[EnvInject] - Keeping Jenkins system variables.
[EnvInject] - Keeping Jenkins build variables.
[EnvInject] - Injecting as environment variables the properties content 
FORREST_HOME=/home/jenkins/tools/forrest/latest
LANG=en_US.UTF-8
CI_BUILD=TRUE

[EnvInject] - Variables injected successfully.
[EnvInject] - Injecting contributions.
Building remotely on builds45 (tmp-22 ubuntu) in workspace <https://ci-builds.apache.org/job/POI/job/POI-DSL-OpenJDK/ws/>
[WS-CLEANUP] Deleting project workspace...
[WS-CLEANUP] Done
ERROR: Not all environment variables could be successfully injected. Check for similarly-named environment variables.
Updating https://svn.apache.org/repos/asf/poi/trunk at revision '2024-09-13T12:07:14.553 +0000'
U         poi/src/main/java/org/apache/poi/util/DefaultTempFileCreationStrategy.java
U         poi/src/main/java/org/apache/poi/ss/util/SheetUtil.java
U         poi/src/main/java/org/apache/poi/ss/util/RegionUtil.java
U         poi/src/main/java/org/apache/poi/ss/util/CellUtil.java
U         poi/src/main/java/org/apache/poi/ss/util/PropertyTemplate.java
U         poi/src/main/java/org/apache/poi/ss/usermodel/Cell.java
A         poi/src/main/java/org/apache/poi/ss/usermodel/CellPropertyCategory.java
A         poi/src/main/java/org/apache/poi/ss/usermodel/CellPropertyType.java
U         poi/src/main/java/org/apache/poi/hssf/usermodel/HSSFCell.java
U         poi/src/test/java/org/apache/poi/ss/util/TestSheetUtil.java
U         poi/src/test/java/org/apache/poi/ss/util/BaseTestCellUtil.java
U         poi/src/test/java/org/apache/poi/ss/util/TestPropertyTemplate.java
U         poi/build.gradle
U         build.gradle
U         build.xml
U         poi-excelant/build.gradle
U         poi-integration/build.gradle
U         poi-ooxml-lite-agent/build.gradle
U         poi-ooxml/src/main/java/org/apache/poi/xssf/streaming/SXSSFCell.java
U         poi-ooxml/src/main/java/org/apache/poi/xssf/streaming/AutoSizeColumnTracker.java
U         poi-ooxml/src/main/java/org/apache/poi/xssf/streaming/SXSSFSheet.java
U         poi-ooxml/src/main/java/org/apache/poi/xssf/usermodel/XSSFCell.java
U         poi-ooxml/src/test/java/org/apache/poi/ss/tests/util/TestXSSFCellUtil.java

<-- Got one external: forrest.properties, svn url: https://svn.apache.org/repos/asf/poi/site/forrest.properties -->
Fetching 'https://svn.apache.org/repos/asf/poi/site/forrest.properties' at -1 into '<https://ci-builds.apache.org/job/POI/job/POI-DSL-OpenJDK/ws/forrest.properties'>
At revision 1920611


<-- Got one external: documentation, svn url: https://svn.apache.org/repos/asf/poi/site/src/documentation -->
Fetching 'https://svn.apache.org/repos/asf/poi/site/src/documentation' at -1 into '<https://ci-builds.apache.org/job/POI/job/POI-DSL-OpenJDK/ws/src/documentation'>
U         src/documentation/content/xdocs/changes.xml
At revision 1920611

At revision 1920611

No changes for https://svn.apache.org/repos/asf/poi/site/forrest.properties since the previous build
ERROR: Not all environment variables could be successfully injected. Check for similarly-named environment variables.
ERROR: Not all environment variables could be successfully injected. Check for similarly-named environment variables.
[POI-DSL-OpenJDK] $ /bin/sh -xe /tmp/jenkins13797979637570060295.sh
+ rm -rf examples excelant integrationtest main ooxml ooxml-schema scratchpad build.javacheck.xml
+ svn status
    X   forrest.properties
X       src/documentation

Performing status on external item at 'src/documentation':
+ svn revert poi-examples/src/main/java9/module-info.java poi-excelant/src/main/java9/module-info.java poi-excelant/src/test/java9/module-info.java poi-integration/src/test/java9/module-info.java poi-ooxml-full/src/main/java9/module-info.java poi-ooxml-lite-agent/src/main/java9/module-info.java poi-ooxml-lite/src/main/java9/module-info.java poi-ooxml/src/main/java9/module-info.java poi-ooxml/src/test/java9/module-info.java poi-scratchpad/src/main/java9/module-info.java poi-scratchpad/src/test/java9/module-info.java poi/src/main/java9/module-info.java poi/src/test/java9/module-info.java
+ svn revert src/resources/ooxml-lite-report.clazz src/resources/ooxml-lite-report.xsb
+ echo Java-Home: /home/jenkins/tools/java/adoptium_jdk_8u362_b09
Java-Home: /home/jenkins/tools/java/adoptium_jdk_8u362_b09
+ ls -al /home/jenkins/tools/java/adoptium_jdk_8u362_b09/
ls: cannot access '/home/jenkins/tools/java/adoptium_jdk_8u362_b09/': No such file or directory
Build step 'Execute shell' marked build as failure
[SpotBugs] Skipping execution of recorder since overall result is 'FAILURE'
ERROR: Not all environment variables could be successfully injected. Check for similarly-named environment variables.
Archiving artifacts
ERROR: Not all environment variables could be successfully injected. Check for similarly-named environment variables.
Recording test results
ERROR: Not all environment variables could be successfully injected. Check for similarly-named environment variables.
ERROR: Step ‘Publish JUnit test result report’ failed: No test report files were found. Configuration error?
ERROR: Not all environment variables could be successfully injected. Check for similarly-named environment variables.

---------------------------------------------------------------------
To unsubscribe, e-mail: dev-unsubscribe@poi.apache.org
For additional commands, e-mail: dev-help@poi.apache.org


Build failed in Jenkins: POI » POI-DSL-OpenJDK #994

Posted by Apache Jenkins Server <je...@builds.apache.org>.
See <https://ci-builds.apache.org/job/POI/job/POI-DSL-OpenJDK/994/display/redirect>

Changes:


------------------------------------------
Started by user PJ Fanning
Running as SYSTEM
ERROR: Not all environment variables could be successfully injected. Check for similarly-named environment variables.
[EnvInject] - Loading node environment variables.
[EnvInject] - Preparing an environment for the build.
[EnvInject] - Keeping Jenkins system variables.
[EnvInject] - Keeping Jenkins build variables.
[EnvInject] - Injecting as environment variables the properties content 
FORREST_HOME=/home/jenkins/tools/forrest/latest
LANG=en_US.UTF-8
CI_BUILD=TRUE

[EnvInject] - Variables injected successfully.
[EnvInject] - Injecting contributions.
Building remotely on builds30 (ubuntu) in workspace <https://ci-builds.apache.org/job/POI/job/POI-DSL-OpenJDK/ws/>
[WS-CLEANUP] Deleting project workspace...
[WS-CLEANUP] Done
ERROR: Not all environment variables could be successfully injected. Check for similarly-named environment variables.
Updating https://svn.apache.org/repos/asf/poi/trunk at revision '2024-09-13T00:53:44.933 +0000'
U         poi/src/test/java/org/apache/poi/ss/util/TestSheetUtil.java
U         poi/src/test/java/org/apache/poi/ss/util/BaseTestCellUtil.java
U         poi/src/test/java/org/apache/poi/ss/util/TestPropertyTemplate.java
U         poi/src/main/java/org/apache/poi/ss/util/SheetUtil.java
U         poi/src/main/java/org/apache/poi/ss/util/RegionUtil.java
U         poi/src/main/java/org/apache/poi/ss/util/CellUtil.java
U         poi/src/main/java/org/apache/poi/ss/util/PropertyTemplate.java
U         poi/src/main/java/org/apache/poi/ss/usermodel/Cell.java
A         poi/src/main/java/org/apache/poi/ss/usermodel/CellPropertyCategory.java
A         poi/src/main/java/org/apache/poi/ss/usermodel/CellPropertyType.java
U         poi/src/main/java/org/apache/poi/hssf/usermodel/HSSFCell.java
U         poi/build.gradle
U         build.gradle
U         build.xml
U         poi-excelant/build.gradle
U         poi-integration/build.gradle
U         poi-ooxml-lite-agent/build.gradle
U         poi-ooxml/src/main/java/org/apache/poi/xssf/streaming/SXSSFCell.java
U         poi-ooxml/src/main/java/org/apache/poi/xssf/streaming/AutoSizeColumnTracker.java
U         poi-ooxml/src/main/java/org/apache/poi/xssf/streaming/SXSSFSheet.java
U         poi-ooxml/src/main/java/org/apache/poi/xssf/usermodel/XSSFCell.java
U         poi-ooxml/src/main/java/org/apache/poi/ooxml/POIXMLTypeLoader.java
U         poi-ooxml/src/main/java/org/apache/poi/xwpf/usermodel/XWPFStyles.java
U         poi-ooxml/src/test/java/org/apache/poi/ss/tests/util/TestXSSFCellUtil.java
U         poi-ooxml/src/test/java/org/apache/poi/xwpf/usermodel/TestXWPFStyles.java
U         poi-ooxml/build.gradle
U         gradle/wrapper/gradle-wrapper.jar
U         gradle/wrapper/gradle-wrapper.properties
U         gradlew
U         gradlew.bat
U         poi-ooxml-full/build.gradle
A         poi-ooxml-full/src/main/xmlschema/org/apache/poi/schemas/word10.xsd

<-- Got one external: forrest.properties, svn url: https://svn.apache.org/repos/asf/poi/site/forrest.properties -->
Fetching 'https://svn.apache.org/repos/asf/poi/site/forrest.properties' at -1 into '<https://ci-builds.apache.org/job/POI/job/POI-DSL-OpenJDK/ws/forrest.properties'>
At revision 1920602


<-- Got one external: documentation, svn url: https://svn.apache.org/repos/asf/poi/site/src/documentation -->
Fetching 'https://svn.apache.org/repos/asf/poi/site/src/documentation' at -1 into '<https://ci-builds.apache.org/job/POI/job/POI-DSL-OpenJDK/ws/src/documentation'>
U         src/documentation/content/xdocs/changes.xml
U         src/documentation/content/xdocs/components/index.xml
At revision 1920602

At revision 1920602

No changes for https://svn.apache.org/repos/asf/poi/trunk since the previous build
No changes for https://svn.apache.org/repos/asf/poi/site/forrest.properties since the previous build
No changes for https://svn.apache.org/repos/asf/poi/site/src/documentation since the previous build
ERROR: Not all environment variables could be successfully injected. Check for similarly-named environment variables.
ERROR: Not all environment variables could be successfully injected. Check for similarly-named environment variables.
[POI-DSL-OpenJDK] $ /bin/sh -xe /tmp/jenkins4174811323314331675.sh
+ rm -rf examples excelant integrationtest main ooxml ooxml-schema scratchpad build.javacheck.xml
+ svn status
    X   forrest.properties
X       src/documentation

Performing status on external item at 'src/documentation':
+ svn revert poi-examples/src/main/java9/module-info.java poi-excelant/src/main/java9/module-info.java poi-excelant/src/test/java9/module-info.java poi-integration/src/test/java9/module-info.java poi-ooxml-full/src/main/java9/module-info.java poi-ooxml-lite-agent/src/main/java9/module-info.java poi-ooxml-lite/src/main/java9/module-info.java poi-ooxml/src/main/java9/module-info.java poi-ooxml/src/test/java9/module-info.java poi-scratchpad/src/main/java9/module-info.java poi-scratchpad/src/test/java9/module-info.java poi/src/main/java9/module-info.java poi/src/test/java9/module-info.java
+ svn revert src/resources/ooxml-lite-report.clazz src/resources/ooxml-lite-report.xsb
+ echo Java-Home: /home/jenkins/tools/java/adoptium_jdk_8u362_b09
Java-Home: /home/jenkins/tools/java/adoptium_jdk_8u362_b09
+ ls -al /home/jenkins/tools/java/adoptium_jdk_8u362_b09/
ls: cannot access '/home/jenkins/tools/java/adoptium_jdk_8u362_b09/': No such file or directory
Build step 'Execute shell' marked build as failure
[SpotBugs] Skipping execution of recorder since overall result is 'FAILURE'
ERROR: Not all environment variables could be successfully injected. Check for similarly-named environment variables.
Archiving artifacts
ERROR: Not all environment variables could be successfully injected. Check for similarly-named environment variables.
Recording test results
ERROR: Not all environment variables could be successfully injected. Check for similarly-named environment variables.
[Checks API] No suitable checks publisher found.
ERROR: Not all environment variables could be successfully injected. Check for similarly-named environment variables.

---------------------------------------------------------------------
To unsubscribe, e-mail: dev-unsubscribe@poi.apache.org
For additional commands, e-mail: dev-help@poi.apache.org


Build failed in Jenkins: POI » POI-DSL-OpenJDK #993

Posted by Apache Jenkins Server <je...@builds.apache.org>.
See <https://ci-builds.apache.org/job/POI/job/POI-DSL-OpenJDK/993/display/redirect?page=changes>

Changes:

[PJ Fanning] [bug-69209] default ignoreMissingFontSystem to true

[PJ Fanning] [bug-69209] default ignoreMissingFontSystem to true

[PJ Fanning] [bug-69209] default ignoreMissingFontSystem to true


------------------------------------------
Started by an SCM change
Running as SYSTEM
ERROR: Not all environment variables could be successfully injected. Check for similarly-named environment variables.
No JDK named ‘adoptopenjdk_hotspot_8u282’ found
[EnvInject] - Loading node environment variables.
[EnvInject] - Preparing an environment for the build.
[EnvInject] - Keeping Jenkins system variables.
[EnvInject] - Keeping Jenkins build variables.
[EnvInject] - Injecting as environment variables the properties content 
FORREST_HOME=/home/jenkins/tools/forrest/latest
LANG=en_US.UTF-8
CI_BUILD=TRUE

[EnvInject] - Variables injected successfully.
[EnvInject] - Injecting contributions.
Building remotely on builds46 (tmp-22 ubuntu) in workspace <https://ci-builds.apache.org/job/POI/job/POI-DSL-OpenJDK/ws/>
[WS-CLEANUP] Deleting project workspace...
[WS-CLEANUP] Done
ERROR: Not all environment variables could be successfully injected. Check for similarly-named environment variables.
No JDK named ‘adoptopenjdk_hotspot_8u282’ found
Updating https://svn.apache.org/repos/asf/poi/trunk at revision '2024-09-13T00:07:13.775 +0000'
U         poi/src/test/java/org/apache/poi/ss/util/TestSheetUtil.java
U         poi/src/main/java/org/apache/poi/ss/util/SheetUtil.java
U         poi/build.gradle
U         build.gradle
U         build.xml
U         poi-excelant/build.gradle
U         poi-integration/build.gradle
U         poi-ooxml-lite-agent/build.gradle

<-- Got one external: forrest.properties, svn url: https://svn.apache.org/repos/asf/poi/site/forrest.properties -->
Fetching 'https://svn.apache.org/repos/asf/poi/site/forrest.properties' at -1 into '<https://ci-builds.apache.org/job/POI/job/POI-DSL-OpenJDK/ws/forrest.properties'>
At revision 1920602


<-- Got one external: documentation, svn url: https://svn.apache.org/repos/asf/poi/site/src/documentation -->
Fetching 'https://svn.apache.org/repos/asf/poi/site/src/documentation' at -1 into '<https://ci-builds.apache.org/job/POI/job/POI-DSL-OpenJDK/ws/src/documentation'>
U         src/documentation/content/xdocs/changes.xml
At revision 1920602

At revision 1920602

No changes for https://svn.apache.org/repos/asf/poi/site/forrest.properties since the previous build
ERROR: Not all environment variables could be successfully injected. Check for similarly-named environment variables.
No JDK named ‘adoptopenjdk_hotspot_8u282’ found
ERROR: Not all environment variables could be successfully injected. Check for similarly-named environment variables.
No JDK named ‘adoptopenjdk_hotspot_8u282’ found
[POI-DSL-OpenJDK] $ /bin/sh -xe /tmp/jenkins13005293610880712525.sh
+ rm -rf examples excelant integrationtest main ooxml ooxml-schema scratchpad build.javacheck.xml
+ svn status
    X   forrest.properties
X       src/documentation

Performing status on external item at 'src/documentation':
+ svn revert poi-examples/src/main/java9/module-info.java poi-excelant/src/main/java9/module-info.java poi-excelant/src/test/java9/module-info.java poi-integration/src/test/java9/module-info.java poi-ooxml-full/src/main/java9/module-info.java poi-ooxml-lite-agent/src/main/java9/module-info.java poi-ooxml-lite/src/main/java9/module-info.java poi-ooxml/src/main/java9/module-info.java poi-ooxml/src/test/java9/module-info.java poi-scratchpad/src/main/java9/module-info.java poi-scratchpad/src/test/java9/module-info.java poi/src/main/java9/module-info.java poi/src/test/java9/module-info.java
+ svn revert src/resources/ooxml-lite-report.clazz src/resources/ooxml-lite-report.xsb
+ echo Java-Home:
Java-Home:
+ ls -al /
total 8390660
drwxr-xr-x  19 root root       4096 Sep 10 20:35 .
drwxr-xr-x  19 root root       4096 Sep 10 20:35 ..
lrwxrwxrwx   1 root root          7 Aug 23  2023 bin -> usr/bin
drwxr-xr-x   4 root root       4096 Aug 24 10:20 boot
drwxr-xr-x  20 root root       4280 Sep  4 09:46 dev
drwxr-xr-x 142 root root      12288 Sep 10 06:09 etc
drwxr-xr-x  10 root root       4096 Feb  2  2024 home
lrwxrwxrwx   1 root root          7 Aug 23  2023 lib -> usr/lib
lrwxrwxrwx   1 root root          9 Aug 23  2023 lib32 -> usr/lib32
lrwxrwxrwx   1 root root          9 Aug 23  2023 lib64 -> usr/lib64
lrwxrwxrwx   1 root root         10 Aug 23  2023 libx32 -> usr/libx32
drwx------   2 root root      16384 Nov  9  2023 lost+found
drwxr-xr-x   2 root root       4096 Aug 23  2023 media
drwxr-xr-x   2 root root       4096 Aug 23  2023 mnt
drwxr-xr-x  15 root root       4096 Apr 19 21:03 opt
dr-xr-xr-x 337 root root          0 Aug 24 10:27 proc
-rw-r--r--   1 root root      11304 May 17  2023 puppet-release-jammy.deb
drwx------  11 root root       4096 Aug 24 10:31 root
drwxr-xr-x  43 root root       1240 Sep 12 23:42 run
lrwxrwxrwx   1 root root          8 Aug 23  2023 sbin -> usr/sbin
drwxr-xr-x  13 root root       4096 Aug 21 12:17 snap
drwxr-xr-x   2 root root       4096 Aug 24 10:31 srv
-rw-------   1 root root 8589934592 Nov  9  2023 swap.img
dr-xr-xr-x  13 root root          0 Aug 24 10:27 sys
drwxrwxrwt 164 root root    1998848 Sep 13 00:10 tmp
drwxr-xr-x  17 root root       4096 Nov 17  2023 usr
drwxr-xr-x  13 root root       4096 Aug 23  2023 var
+ ls -al /bin
lrwxrwxrwx 1 root root 7 Aug 23  2023 /bin -> usr/bin
+ /bin/java -version
openjdk version "11.0.24" 2024-07-16
OpenJDK Runtime Environment (build 11.0.24+8-post-Ubuntu-1ubuntu322.04)
OpenJDK 64-Bit Server VM (build 11.0.24+8-post-Ubuntu-1ubuntu322.04, mixed mode, sharing)
+ echo which java
which java
+ which java
/usr/bin/java
+ java -version
openjdk version "11.0.24" 2024-07-16
OpenJDK Runtime Environment (build 11.0.24+8-post-Ubuntu-1ubuntu322.04)
OpenJDK 64-Bit Server VM (build 11.0.24+8-post-Ubuntu-1ubuntu322.04, mixed mode, sharing)
+ echo which javac
which javac
+ which javac
/usr/bin/javac
+ javac -version
javac 11.0.24
+ echo Ant-Home:
Ant-Home:
+ ls -al
total 520
drwxr-xr-x 22 jenkins jenkins   4096 Sep 13 00:10 .
drwxr-xr-x  3 jenkins jenkins   4096 Aug 20 08:31 ..
-rw-r--r--  1 jenkins jenkins    520 Jun  2 12:08 .asf.yaml
drwxr-xr-x  3 jenkins jenkins   4096 Aug  2 00:09 build
-rw-r--r--  1 jenkins jenkins  33427 Sep 13 00:10 build.gradle
-rw-r--r--  1 jenkins jenkins 151471 Sep 13 00:10 build.xml
-rw-r--r--  1 jenkins jenkins   7709 Jul 10 00:08 doap_POI.rdf
-rw-r--r--  1 jenkins jenkins   3261 Jun  2 12:08 file-leak-detector.exclude
-rw-r--r--  1 jenkins jenkins   6229 Jun  2 12:08 forrest.properties
-rw-r--r--  1 jenkins jenkins     53 Jun  2 12:08 .gitattributes
drwxr-xr-x  3 jenkins jenkins   4096 Jun  2 12:08 .github
-rw-r--r--  1 jenkins jenkins    396 Jun  2 12:08 .gitignore
drwxr-xr-x  5 jenkins jenkins   4096 Aug 28 00:11 .gradle
drwxr-xr-x  3 jenkins jenkins   4096 Jun  2 12:08 gradle
-rw-r--r--  1 jenkins jenkins    494 Jun  2 12:08 gradle.properties
-rwxr-xr-x  1 jenkins jenkins   8762 Aug 17 00:07 gradlew
-rw-r--r--  1 jenkins jenkins   2966 Aug 17 00:07 gradlew.bat
drwxr-xr-x  2 jenkins jenkins   4096 Jun  2 12:08 jenkins
-rw-r--r--  1 jenkins jenkins 167947 Jun  2 12:08 KEYS
drwxr-xr-x  2 jenkins jenkins   4096 Jun  2 12:08 legal
drwxr-xr-x  2 jenkins jenkins   4096 Jun  2 12:08 lib.stored
drwxr-xr-x  3 jenkins jenkins   4096 Jul 10 00:08 osgi
-rw-r--r--  1 jenkins jenkins   4813 Jun  2 12:08 patch.xml
drwxr-xr-x  5 jenkins jenkins   4096 Sep 13 00:10 poi
drwxr-xr-x  4 jenkins jenkins   4096 Aug  2 00:09 poi-examples
drwxr-xr-x  4 jenkins jenkins   4096 Sep 13 00:10 poi-excelant
drwxr-xr-x  4 jenkins jenkins   4096 Sep 13 00:10 poi-integration
drwxr-xr-x  4 jenkins jenkins   4096 Aug 28 00:07 poi-ooxml
drwxr-xr-x  4 jenkins jenkins   4096 Aug 17 00:07 poi-ooxml-full
drwxr-xr-x  4 jenkins jenkins   4096 Aug  2 00:10 poi-ooxml-lite
drwxr-xr-x  4 jenkins jenkins   4096 Sep 13 00:10 poi-ooxml-lite-agent
drwxr-xr-x  5 jenkins jenkins   4096 Aug  2 00:09 poi-scratchpad
-rw-r--r--  1 jenkins jenkins   4354 Jul 17 00:07 README.rst
-rw-r--r--  1 jenkins jenkins    428 Jun  2 12:08 SECURITY.md
-rw-r--r--  1 jenkins jenkins    190 Jun  2 12:08 settings.gradle
drwxr-xr-x  4 jenkins jenkins   4096 Jun  2 12:08 src
drwxr-xr-x  4 jenkins jenkins   4096 Sep 13 00:10 .svn
drwxr-xr-x 15 jenkins jenkins   4096 Jun  2 12:07 test-data
-rw-r--r--  1 jenkins jenkins   3803 Jun  2 12:08 wrapper.gradle
+ echo which ant
which ant
+ which ant
/usr/bin/ant
+ ant -version
Apache Ant(TM) version 1.10.12 compiled on January 17 1970
+ echo <project default="test"><target name="test"><echo>Java ${ant.java.version}/${java.version}</echo><exec executable="javac"><arg value="-version"/></exec></target></project>
+ ant -f build.javacheck.xml -v
Apache Ant(TM) version 1.10.12 compiled on January 17 1970
Buildfile: <https://ci-builds.apache.org/job/POI/job/POI-DSL-OpenJDK/ws/build.javacheck.xml>
Detected Java version: 11 in: /usr/lib/jvm/java-11-openjdk-amd64
Detected OS: Linux
parsing buildfile <https://ci-builds.apache.org/job/POI/job/POI-DSL-OpenJDK/ws/build.javacheck.xml> with URI = <https://ci-builds.apache.org/job/POI/job/POI-DSL-OpenJDK/ws/build.javacheck.xml>
Project base dir set to: <https://ci-builds.apache.org/job/POI/job/POI-DSL-OpenJDK/ws/>
Build sequence for target(s) `test' is [test]
Complete build sequence is [test, ]

test:
parsing buildfile jar:file:/usr/share/ant/lib/ant.jar!/org/apache/tools/ant/antlib.xml with URI = jar:file:/usr/share/ant/lib/ant.jar!/org/apache/tools/ant/antlib.xml from a zip file
     [echo] Java 11/11.0.24
     [exec] Current OS is Linux
     [exec] Executing 'javac' with arguments:
     [exec] '-version'
     [exec] 
     [exec] The ' characters around the executable and arguments are
     [exec] not part of the command.
     [exec] javac 11.0.24

BUILD SUCCESSFUL
Total time: 1 second
+ exit 0
ERROR: Not all environment variables could be successfully injected. Check for similarly-named environment variables.
No JDK named ‘adoptopenjdk_hotspot_8u282’ found
[POI-DSL-OpenJDK] $ /bin/sh -xe /tmp/jenkins8679566165193196823.sh
+ touch --no-create build/*/build/test-results/TEST-*.xml build/*/build/test-results/test/TEST-*.xml
[Gradle] - Launching build.
ERROR: Not all environment variables could be successfully injected. Check for similarly-named environment variables.
No JDK named ‘adoptopenjdk_hotspot_8u282’ found
[POI-DSL-OpenJDK] $ <https://ci-builds.apache.org/job/POI/job/POI-DSL-OpenJDK/ws/gradlew> -PjdkVersion=8 -PjdkVendor=adoptopenjdk --refresh-dependencies clean jenkinsLite
To honour the JVM settings for this build a single-use Daemon process will be forked. For more on this, please refer to https://docs.gradle.org/8.10/userguide/gradle_daemon.html#sec:disabling_the_daemon in the Gradle documentation.
Daemon will be stopped at the end of the build 
Configuration on demand is an incubating feature.

> Configure project :
Trying to override old definition of datatype junit
Run with reduced parallelism for CI build
Run with reduced parallelism for CI build
Run with reduced parallelism for CI build
Run with reduced parallelism for CI build
Run with reduced parallelism for CI build
Run with reduced parallelism for CI build
Run with reduced parallelism for CI build
Run with reduced parallelism for CI build
Run with reduced parallelism for CI build
Invalid Java installation found at '/usr/local/asfpackages/java/oraclejdk-j2sdk1.4.2-19' (Maven Toolchains) auto-detected. It will be re-checked in the next build. This might have performance impact if it keeps failing. Run the 'javaToolchains' task for more details.

FAILURE: Build failed with an exception.

* Where:
Build file '<https://ci-builds.apache.org/job/POI/job/POI-DSL-OpenJDK/ws/poi/build.gradle'> line: 82

* What went wrong:
A problem occurred evaluating project ':poi'.
> Could not resolve all dependencies for configuration ':poi:testRuntimeClasspath'.
   > Failed to calculate the value of task ':poi:compileTestJava' property 'javaCompiler'.
      > Cannot find a Java installation on your machine matching this tasks requirements: {languageVersion=8, vendor=vendor matching('adoptopenjdk'), implementation=vendor-specific} for LINUX on x86_64.
         > No locally installed toolchains match and toolchain download repositories have not been configured.

* Try:
> Learn more about toolchain auto-detection at https://docs.gradle.org/8.10/userguide/toolchains.html#sec:auto_detection.
> Learn more about toolchain repositories at https://docs.gradle.org/8.10/userguide/toolchains.html#sub:download_repositories.
> Run with --stacktrace option to get the stack trace.
> Run with --info or --debug option to get more log output.
> Run with --scan to get full insights.
> Get more help at https://help.gradle.org.

Deprecated Gradle features were used in this build, making it incompatible with Gradle 9.0.

You can use '--warning-mode all' to show the individual deprecation warnings and determine if they come from your own scripts or plugins.

For more on this, please refer to https://docs.gradle.org/8.10/userguide/command_line_interface.html#sec:command_line_warnings in the Gradle documentation.

BUILD FAILED in 1m 7s
Build step 'Invoke Gradle script' changed build result to FAILURE
Build step 'Invoke Gradle script' marked build as failure
[SpotBugs] Skipping execution of recorder since overall result is 'FAILURE'
ERROR: Not all environment variables could be successfully injected. Check for similarly-named environment variables.
No JDK named ‘adoptopenjdk_hotspot_8u282’ found
Archiving artifacts
ERROR: Not all environment variables could be successfully injected. Check for similarly-named environment variables.
No JDK named ‘adoptopenjdk_hotspot_8u282’ found
Recording test results
ERROR: Not all environment variables could be successfully injected. Check for similarly-named environment variables.
No JDK named ‘adoptopenjdk_hotspot_8u282’ found
[Checks API] No suitable checks publisher found.
ERROR: Not all environment variables could be successfully injected. Check for similarly-named environment variables.
No JDK named ‘adoptopenjdk_hotspot_8u282’ found

---------------------------------------------------------------------
To unsubscribe, e-mail: dev-unsubscribe@poi.apache.org
For additional commands, e-mail: dev-help@poi.apache.org


Build failed in Jenkins: POI » POI-DSL-OpenJDK #992

Posted by Apache Jenkins Server <je...@builds.apache.org>.
See <https://ci-builds.apache.org/job/POI/job/POI-DSL-OpenJDK/992/display/redirect?page=changes>

Changes:

[PJ Fanning] revert spotbugs due to build issues


------------------------------------------
Started by an SCM change
Running as SYSTEM
ERROR: Not all environment variables could be successfully injected. Check for similarly-named environment variables.
No JDK named ‘adoptopenjdk_hotspot_8u282’ found
[EnvInject] - Loading node environment variables.
[EnvInject] - Preparing an environment for the build.
[EnvInject] - Keeping Jenkins system variables.
[EnvInject] - Keeping Jenkins build variables.
[EnvInject] - Injecting as environment variables the properties content 
FORREST_HOME=/home/jenkins/tools/forrest/latest
LANG=en_US.UTF-8
CI_BUILD=TRUE

[EnvInject] - Variables injected successfully.
[EnvInject] - Injecting contributions.
Building remotely on builds29 (ubuntu) in workspace <https://ci-builds.apache.org/job/POI/job/POI-DSL-OpenJDK/ws/>
[WS-CLEANUP] Deleting project workspace...
[WS-CLEANUP] Done
ERROR: Not all environment variables could be successfully injected. Check for similarly-named environment variables.
No JDK named ‘adoptopenjdk_hotspot_8u282’ found
Updating https://svn.apache.org/repos/asf/poi/trunk at revision '2024-09-09T00:07:13.697 +0000'
U         build.gradle

<-- Got one external: documentation, svn url: https://svn.apache.org/repos/asf/poi/site/src/documentation -->
Fetching 'https://svn.apache.org/repos/asf/poi/site/src/documentation' at -1 into '<https://ci-builds.apache.org/job/POI/job/POI-DSL-OpenJDK/ws/src/documentation'>
At revision 1920522


<-- Got one external: forrest.properties, svn url: https://svn.apache.org/repos/asf/poi/site/forrest.properties -->
Fetching 'https://svn.apache.org/repos/asf/poi/site/forrest.properties' at -1 into '<https://ci-builds.apache.org/job/POI/job/POI-DSL-OpenJDK/ws/forrest.properties'>
At revision 1920522

At revision 1920522

No changes for https://svn.apache.org/repos/asf/poi/site/src/documentation since the previous build
No changes for https://svn.apache.org/repos/asf/poi/site/forrest.properties since the previous build
ERROR: Not all environment variables could be successfully injected. Check for similarly-named environment variables.
No JDK named ‘adoptopenjdk_hotspot_8u282’ found
ERROR: Not all environment variables could be successfully injected. Check for similarly-named environment variables.
No JDK named ‘adoptopenjdk_hotspot_8u282’ found
[POI-DSL-OpenJDK] $ /bin/sh -xe /tmp/jenkins1035357818688576925.sh
+ rm -rf examples excelant integrationtest main ooxml ooxml-schema scratchpad build.javacheck.xml
+ svn status
    X   forrest.properties
X       src/documentation

Performing status on external item at 'src/documentation':
+ svn revert poi-examples/src/main/java9/module-info.java poi-excelant/src/main/java9/module-info.java poi-excelant/src/test/java9/module-info.java poi-integration/src/test/java9/module-info.java poi-ooxml-full/src/main/java9/module-info.java poi-ooxml-lite-agent/src/main/java9/module-info.java poi-ooxml-lite/src/main/java9/module-info.java poi-ooxml/src/main/java9/module-info.java poi-ooxml/src/test/java9/module-info.java poi-scratchpad/src/main/java9/module-info.java poi-scratchpad/src/test/java9/module-info.java poi/src/main/java9/module-info.java poi/src/test/java9/module-info.java
+ svn revert src/resources/ooxml-lite-report.clazz src/resources/ooxml-lite-report.xsb
+ echo Java-Home:
Java-Home:
+ ls -al /
total 8390664
drwxr-xr-x  20 root root       4096 Aug 27 23:54 .
drwxr-xr-x  20 root root       4096 Aug 27 23:54 ..
lrwxrwxrwx   1 root root          7 Aug 23  2023 bin -> usr/bin
drwxr-xr-x   4 root root       4096 Aug 24 10:19 boot
drwxr-xr-x  20 root root       4360 Sep  5 21:56 dev
drwxr-xr-x 141 root root      12288 Sep  8 06:43 etc
drwxr-xr-x  10 root root       4096 Jul  3 08:39 home
-rw-------   1 root root        963 Jun  1 18:50 index.html
lrwxrwxrwx   1 root root          7 Aug 23  2023 lib -> usr/lib
lrwxrwxrwx   1 root root          9 Aug 23  2023 lib32 -> usr/lib32
lrwxrwxrwx   1 root root          9 Aug 23  2023 lib64 -> usr/lib64
lrwxrwxrwx   1 root root         10 Aug 23  2023 libx32 -> usr/libx32
drwx------   2 root root      16384 Nov 14  2023 lost+found
drwxr-xr-x   2 root root       4096 Aug 23  2023 media
drwxr-xr-x   2 root root       4096 Aug 23  2023 mnt
drwxr-xr-x  14 root root       4096 Apr 19 20:58 opt
dr-xr-xr-x 413 root root          0 Aug 24 10:32 proc
-rw-r--r--   1 root root      11304 May 17  2023 puppet-release-jammy.deb
drwx------  11 root root       4096 Aug 24 10:38 root
drwxr-xr-x  43 root root       1240 Sep  8 23:37 run
lrwxrwxrwx   1 root root          8 Aug 23  2023 sbin -> usr/sbin
drwxr-xr-x  13 root root       4096 Aug 20 17:03 snap
drwxr-xr-x   2 root root       4096 Aug 24 10:38 srv
-rw-------   1 root root 8589934592 Nov 14  2023 swap.img
dr-xr-xr-x  13 root root          0 Aug 24 10:32 sys
drwxrwxrwt 125 root root    1998848 Sep  9 00:07 tmp
drwxr-xr-x  16 root root       4096 Nov 14  2023 usr
drwxr-xr-x  13 root root       4096 Aug 23  2023 var
drwx------   2 root root       4096 Jun  1 18:50 WEB-INF
+ ls -al /bin
lrwxrwxrwx 1 root root 7 Aug 23  2023 /bin -> usr/bin
+ /bin/java -version
openjdk version "11.0.24" 2024-07-16
OpenJDK Runtime Environment (build 11.0.24+8-post-Ubuntu-1ubuntu322.04)
OpenJDK 64-Bit Server VM (build 11.0.24+8-post-Ubuntu-1ubuntu322.04, mixed mode, sharing)
+ echo which java
which java
+ which java
/usr/bin/java
+ java -version
openjdk version "11.0.24" 2024-07-16
OpenJDK Runtime Environment (build 11.0.24+8-post-Ubuntu-1ubuntu322.04)
OpenJDK 64-Bit Server VM (build 11.0.24+8-post-Ubuntu-1ubuntu322.04, mixed mode, sharing)
+ echo which javac
which javac
+ which javac
/usr/bin/javac
+ javac -version
javac 11.0.24
+ echo Ant-Home:
Ant-Home:
+ ls -al
total 520
drwxr-xr-x 22 jenkins jenkins   4096 Sep  9 00:07 .
drwxr-xr-x  5 jenkins jenkins   4096 Sep  4 08:27 ..
-rw-r--r--  1 jenkins jenkins    520 Jul 16 00:08 .asf.yaml
drwxr-xr-x  3 jenkins jenkins   4096 Jul 18 12:09 build
-rw-r--r--  1 jenkins jenkins  33427 Sep  9 00:07 build.gradle
-rw-r--r--  1 jenkins jenkins 151471 Sep  8 12:07 build.xml
-rw-r--r--  1 jenkins jenkins   7709 Jul 16 00:08 doap_POI.rdf
-rw-r--r--  1 jenkins jenkins   3261 Jul 16 00:08 file-leak-detector.exclude
-rw-r--r--  1 jenkins jenkins   6229 Jul 16 00:08 forrest.properties
-rw-r--r--  1 jenkins jenkins     53 Jul 16 00:08 .gitattributes
drwxr-xr-x  3 jenkins jenkins   4096 Jul 16 00:08 .github
-rw-r--r--  1 jenkins jenkins    396 Jul 16 00:08 .gitignore
drwxr-xr-x  5 jenkins jenkins   4096 Sep  8 12:09 .gradle
drwxr-xr-x  3 jenkins jenkins   4096 Jul 16 00:08 gradle
-rw-r--r--  1 jenkins jenkins    494 Jul 16 00:08 gradle.properties
-rwxr-xr-x  1 jenkins jenkins   8762 Sep  8 12:07 gradlew
-rw-r--r--  1 jenkins jenkins   2966 Sep  8 12:07 gradlew.bat
drwxr-xr-x  2 jenkins jenkins   4096 Jul 16 00:08 jenkins
-rw-r--r--  1 jenkins jenkins 167947 Jul 16 00:08 KEYS
drwxr-xr-x  2 jenkins jenkins   4096 Jul 16 00:08 legal
drwxr-xr-x  2 jenkins jenkins   4096 Jul 16 00:08 lib.stored
drwxr-xr-x  3 jenkins jenkins   4096 Jul 16 00:08 osgi
-rw-r--r--  1 jenkins jenkins   4813 Jul 16 00:08 patch.xml
drwxr-xr-x  5 jenkins jenkins   4096 Sep  8 12:07 poi
drwxr-xr-x  4 jenkins jenkins   4096 Jul 18 12:09 poi-examples
drwxr-xr-x  4 jenkins jenkins   4096 Sep  8 12:07 poi-excelant
drwxr-xr-x  4 jenkins jenkins   4096 Sep  8 12:07 poi-integration
drwxr-xr-x  4 jenkins jenkins   4096 Sep  8 12:07 poi-ooxml
drwxr-xr-x  4 jenkins jenkins   4096 Aug 16 12:07 poi-ooxml-full
drwxr-xr-x  4 jenkins jenkins   4096 Jul 18 12:09 poi-ooxml-lite
drwxr-xr-x  4 jenkins jenkins   4096 Sep  8 12:07 poi-ooxml-lite-agent
drwxr-xr-x  5 jenkins jenkins   4096 Jul 18 12:09 poi-scratchpad
-rw-r--r--  1 jenkins jenkins   4354 Jul 18 12:07 README.rst
-rw-r--r--  1 jenkins jenkins    428 Jul 16 00:08 SECURITY.md
-rw-r--r--  1 jenkins jenkins    190 Jul 16 00:08 settings.gradle
drwxr-xr-x  4 jenkins jenkins   4096 Jul 16 00:08 src
drwxr-xr-x  4 jenkins jenkins   4096 Sep  9 00:07 .svn
drwxr-xr-x 15 jenkins jenkins   4096 Jul 16 00:08 test-data
-rw-r--r--  1 jenkins jenkins   3803 Jul 16 00:08 wrapper.gradle
+ echo which ant
which ant
+ which ant
/usr/bin/ant
+ ant -version
Apache Ant(TM) version 1.10.12 compiled on January 17 1970
+ echo <project default="test"><target name="test"><echo>Java ${ant.java.version}/${java.version}</echo><exec executable="javac"><arg value="-version"/></exec></target></project>
+ ant -f build.javacheck.xml -v
Apache Ant(TM) version 1.10.12 compiled on January 17 1970
Buildfile: <https://ci-builds.apache.org/job/POI/job/POI-DSL-OpenJDK/ws/build.javacheck.xml>
Detected Java version: 11 in: /usr/lib/jvm/java-11-openjdk-amd64
Detected OS: Linux
parsing buildfile <https://ci-builds.apache.org/job/POI/job/POI-DSL-OpenJDK/ws/build.javacheck.xml> with URI = <https://ci-builds.apache.org/job/POI/job/POI-DSL-OpenJDK/ws/build.javacheck.xml>
Project base dir set to: <https://ci-builds.apache.org/job/POI/job/POI-DSL-OpenJDK/ws/>
Build sequence for target(s) `test' is [test]
Complete build sequence is [test, ]

test:
parsing buildfile jar:file:/usr/share/ant/lib/ant.jar!/org/apache/tools/ant/antlib.xml with URI = jar:file:/usr/share/ant/lib/ant.jar!/org/apache/tools/ant/antlib.xml from a zip file
     [echo] Java 11/11.0.24
     [exec] Current OS is Linux
     [exec] Executing 'javac' with arguments:
     [exec] '-version'
     [exec] 
     [exec] The ' characters around the executable and arguments are
     [exec] not part of the command.
     [exec] javac 11.0.24

BUILD SUCCESSFUL
Total time: 0 seconds
+ exit 0
ERROR: Not all environment variables could be successfully injected. Check for similarly-named environment variables.
No JDK named ‘adoptopenjdk_hotspot_8u282’ found
[POI-DSL-OpenJDK] $ /bin/sh -xe /tmp/jenkins995762216423285703.sh
+ touch --no-create build/*/build/test-results/TEST-*.xml build/*/build/test-results/test/TEST-*.xml
[Gradle] - Launching build.
ERROR: Not all environment variables could be successfully injected. Check for similarly-named environment variables.
No JDK named ‘adoptopenjdk_hotspot_8u282’ found
[POI-DSL-OpenJDK] $ <https://ci-builds.apache.org/job/POI/job/POI-DSL-OpenJDK/ws/gradlew> -PjdkVersion=8 -PjdkVendor=adoptopenjdk --refresh-dependencies clean jenkinsLite
To honour the JVM settings for this build a single-use Daemon process will be forked. For more on this, please refer to https://docs.gradle.org/8.10/userguide/gradle_daemon.html#sec:disabling_the_daemon in the Gradle documentation.
Daemon will be stopped at the end of the build 
Configuration on demand is an incubating feature.

> Configure project :
Trying to override old definition of datatype junit
Run with reduced parallelism for CI build
Run with reduced parallelism for CI build
Run with reduced parallelism for CI build
Run with reduced parallelism for CI build
Run with reduced parallelism for CI build
Run with reduced parallelism for CI build
Run with reduced parallelism for CI build
Run with reduced parallelism for CI build
Run with reduced parallelism for CI build
Invalid Java installation found at '/usr/local/asfpackages/java/oraclejdk-j2sdk1.4.2-19' (Maven Toolchains) auto-detected. It will be re-checked in the next build. This might have performance impact if it keeps failing. Run the 'javaToolchains' task for more details.

FAILURE: Build failed with an exception.

* Where:
Build file '<https://ci-builds.apache.org/job/POI/job/POI-DSL-OpenJDK/ws/poi/build.gradle'> line: 82

* What went wrong:
A problem occurred evaluating project ':poi'.
> Could not resolve all dependencies for configuration ':poi:testRuntimeClasspath'.
   > Failed to calculate the value of task ':poi:compileTestJava' property 'javaCompiler'.
      > Cannot find a Java installation on your machine matching this tasks requirements: {languageVersion=8, vendor=vendor matching('adoptopenjdk'), implementation=vendor-specific} for LINUX on x86_64.
         > No locally installed toolchains match and toolchain download repositories have not been configured.

* Try:
> Learn more about toolchain auto-detection at https://docs.gradle.org/8.10/userguide/toolchains.html#sec:auto_detection.
> Learn more about toolchain repositories at https://docs.gradle.org/8.10/userguide/toolchains.html#sub:download_repositories.
> Run with --stacktrace option to get the stack trace.
> Run with --info or --debug option to get more log output.
> Run with --scan to get full insights.
> Get more help at https://help.gradle.org.

Deprecated Gradle features were used in this build, making it incompatible with Gradle 9.0.

You can use '--warning-mode all' to show the individual deprecation warnings and determine if they come from your own scripts or plugins.

For more on this, please refer to https://docs.gradle.org/8.10/userguide/command_line_interface.html#sec:command_line_warnings in the Gradle documentation.

BUILD FAILED in 49s
Build step 'Invoke Gradle script' changed build result to FAILURE
Build step 'Invoke Gradle script' marked build as failure
[SpotBugs] Skipping execution of recorder since overall result is 'FAILURE'
ERROR: Not all environment variables could be successfully injected. Check for similarly-named environment variables.
No JDK named ‘adoptopenjdk_hotspot_8u282’ found
Archiving artifacts
ERROR: Not all environment variables could be successfully injected. Check for similarly-named environment variables.
No JDK named ‘adoptopenjdk_hotspot_8u282’ found
Recording test results
ERROR: Not all environment variables could be successfully injected. Check for similarly-named environment variables.
No JDK named ‘adoptopenjdk_hotspot_8u282’ found
[Checks API] No suitable checks publisher found.
ERROR: Not all environment variables could be successfully injected. Check for similarly-named environment variables.
No JDK named ‘adoptopenjdk_hotspot_8u282’ found

---------------------------------------------------------------------
To unsubscribe, e-mail: dev-unsubscribe@poi.apache.org
For additional commands, e-mail: dev-help@poi.apache.org


Build failed in Jenkins: POI » POI-DSL-OpenJDK #991

Posted by Apache Jenkins Server <je...@builds.apache.org>.
See <https://ci-builds.apache.org/job/POI/job/POI-DSL-OpenJDK/991/display/redirect?page=changes>

Changes:

[PJ Fanning] revert log4j 2.24.0 due to build issue

[PJ Fanning] revert log4j 2.24.0 due to build issue

[PJ Fanning] log4j 2.24.0

[PJ Fanning] log4j 2.24.0


------------------------------------------
[...truncated 1.04 KB...]
ERROR: Not all environment variables could be successfully injected. Check for similarly-named environment variables.
No JDK named ‘adoptopenjdk_hotspot_8u282’ found
Updating https://svn.apache.org/repos/asf/poi/trunk at revision '2024-09-08T12:07:27.224 +0000'
U         build.gradle
U         build.xml
U         poi/build.gradle
U         poi/src/main/java/org/apache/poi/ss/util/RegionUtil.java
U         poi/src/main/java/org/apache/poi/ss/util/CellUtil.java
U         poi/src/main/java/org/apache/poi/ss/util/PropertyTemplate.java
U         poi/src/main/java/org/apache/poi/ss/usermodel/Cell.java
A         poi/src/main/java/org/apache/poi/ss/usermodel/CellPropertyCategory.java
A         poi/src/main/java/org/apache/poi/ss/usermodel/CellPropertyType.java
U         poi/src/main/java/org/apache/poi/hssf/usermodel/HSSFCell.java
U         poi/src/test/java/org/apache/poi/ss/util/BaseTestCellUtil.java
U         poi/src/test/java/org/apache/poi/ss/util/TestPropertyTemplate.java
U         poi-excelant/build.gradle
U         poi-integration/build.gradle
U         poi-ooxml-lite-agent/build.gradle
U         poi-ooxml/src/main/java/org/apache/poi/xssf/streaming/SXSSFCell.java
U         poi-ooxml/src/main/java/org/apache/poi/xssf/streaming/AutoSizeColumnTracker.java
U         poi-ooxml/src/main/java/org/apache/poi/xssf/streaming/SXSSFSheet.java
U         poi-ooxml/src/main/java/org/apache/poi/xssf/usermodel/XSSFCell.java
U         poi-ooxml/src/test/java/org/apache/poi/ss/tests/util/TestXSSFCellUtil.java
U         poi-ooxml/build.gradle
U         gradle/wrapper/gradle-wrapper.jar
U         gradle/wrapper/gradle-wrapper.properties
U         gradlew
U         gradlew.bat

<-- Got one external: documentation, svn url: https://svn.apache.org/repos/asf/poi/site/src/documentation -->
Fetching 'https://svn.apache.org/repos/asf/poi/site/src/documentation' at -1 into '<https://ci-builds.apache.org/job/POI/job/POI-DSL-OpenJDK/ws/src/documentation'>
U         src/documentation/content/xdocs/changes.xml
U         src/documentation/content/xdocs/components/index.xml
At revision 1920519


<-- Got one external: forrest.properties, svn url: https://svn.apache.org/repos/asf/poi/site/forrest.properties -->
Fetching 'https://svn.apache.org/repos/asf/poi/site/forrest.properties' at -1 into '<https://ci-builds.apache.org/job/POI/job/POI-DSL-OpenJDK/ws/forrest.properties'>
At revision 1920519

At revision 1920519

No changes for https://svn.apache.org/repos/asf/poi/site/forrest.properties since the previous build
ERROR: Not all environment variables could be successfully injected. Check for similarly-named environment variables.
No JDK named ‘adoptopenjdk_hotspot_8u282’ found
ERROR: Not all environment variables could be successfully injected. Check for similarly-named environment variables.
No JDK named ‘adoptopenjdk_hotspot_8u282’ found
[POI-DSL-OpenJDK] $ /bin/sh -xe /tmp/jenkins10278580556347500044.sh
+ rm -rf examples excelant integrationtest main ooxml ooxml-schema scratchpad build.javacheck.xml
+ svn status
    X   forrest.properties
X       src/documentation

Performing status on external item at 'src/documentation':
+ svn revert poi-examples/src/main/java9/module-info.java poi-excelant/src/main/java9/module-info.java poi-excelant/src/test/java9/module-info.java poi-integration/src/test/java9/module-info.java poi-ooxml-full/src/main/java9/module-info.java poi-ooxml-lite-agent/src/main/java9/module-info.java poi-ooxml-lite/src/main/java9/module-info.java poi-ooxml/src/main/java9/module-info.java poi-ooxml/src/test/java9/module-info.java poi-scratchpad/src/main/java9/module-info.java poi-scratchpad/src/test/java9/module-info.java poi/src/main/java9/module-info.java poi/src/test/java9/module-info.java
+ svn revert src/resources/ooxml-lite-report.clazz src/resources/ooxml-lite-report.xsb
+ echo Java-Home:
Java-Home:
+ ls -al /
total 8390664
drwxr-xr-x  20 root root       4096 Aug 27 23:54 .
drwxr-xr-x  20 root root       4096 Aug 27 23:54 ..
lrwxrwxrwx   1 root root          7 Aug 23  2023 bin -> usr/bin
drwxr-xr-x   4 root root       4096 Aug 24 10:19 boot
drwxr-xr-x  20 root root       4360 Sep  5 21:56 dev
drwxr-xr-x 141 root root      12288 Sep  8 06:43 etc
drwxr-xr-x  10 root root       4096 Jul  3 08:39 home
-rw-------   1 root root        963 Jun  1 18:50 index.html
lrwxrwxrwx   1 root root          7 Aug 23  2023 lib -> usr/lib
lrwxrwxrwx   1 root root          9 Aug 23  2023 lib32 -> usr/lib32
lrwxrwxrwx   1 root root          9 Aug 23  2023 lib64 -> usr/lib64
lrwxrwxrwx   1 root root         10 Aug 23  2023 libx32 -> usr/libx32
drwx------   2 root root      16384 Nov 14  2023 lost+found
drwxr-xr-x   2 root root       4096 Aug 23  2023 media
drwxr-xr-x   2 root root       4096 Aug 23  2023 mnt
drwxr-xr-x  14 root root       4096 Apr 19 20:58 opt
dr-xr-xr-x 419 root root          0 Aug 24 10:32 proc
-rw-r--r--   1 root root      11304 May 17  2023 puppet-release-jammy.deb
drwx------  11 root root       4096 Aug 24 10:38 root
drwxr-xr-x  43 root root       1240 Sep  8 12:07 run
lrwxrwxrwx   1 root root          8 Aug 23  2023 sbin -> usr/sbin
drwxr-xr-x  13 root root       4096 Aug 20 17:03 snap
drwxr-xr-x   2 root root       4096 Aug 24 10:38 srv
-rw-------   1 root root 8589934592 Nov 14  2023 swap.img
dr-xr-xr-x  13 root root          0 Aug 24 10:32 sys
drwxrwxrwt 103 root root    1998848 Sep  8 12:07 tmp
drwxr-xr-x  16 root root       4096 Nov 14  2023 usr
drwxr-xr-x  13 root root       4096 Aug 23  2023 var
drwx------   2 root root       4096 Jun  1 18:50 WEB-INF
+ ls -al /bin
lrwxrwxrwx 1 root root 7 Aug 23  2023 /bin -> usr/bin
+ /bin/java -version
openjdk version "11.0.24" 2024-07-16
OpenJDK Runtime Environment (build 11.0.24+8-post-Ubuntu-1ubuntu322.04)
OpenJDK 64-Bit Server VM (build 11.0.24+8-post-Ubuntu-1ubuntu322.04, mixed mode, sharing)
+ echo which java
which java
+ which java
/usr/bin/java
+ java -version
openjdk version "11.0.24" 2024-07-16
OpenJDK Runtime Environment (build 11.0.24+8-post-Ubuntu-1ubuntu322.04)
OpenJDK 64-Bit Server VM (build 11.0.24+8-post-Ubuntu-1ubuntu322.04, mixed mode, sharing)
+ echo which javac
which javac
+ which javac
/usr/bin/javac
+ javac -version
javac 11.0.24
+ echo Ant-Home:
Ant-Home:
+ ls -al
total 520
drwxr-xr-x 22 jenkins jenkins   4096 Sep  8 12:07 .
drwxr-xr-x  5 jenkins jenkins   4096 Sep  4 08:27 ..
-rw-r--r--  1 jenkins jenkins    520 Jul 16 00:08 .asf.yaml
drwxr-xr-x  3 jenkins jenkins   4096 Jul 18 12:09 build
-rw-r--r--  1 jenkins jenkins  33427 Sep  8 12:07 build.gradle
-rw-r--r--  1 jenkins jenkins 151471 Sep  8 12:07 build.xml
-rw-r--r--  1 jenkins jenkins   7709 Jul 16 00:08 doap_POI.rdf
-rw-r--r--  1 jenkins jenkins   3261 Jul 16 00:08 file-leak-detector.exclude
-rw-r--r--  1 jenkins jenkins   6229 Jul 16 00:08 forrest.properties
-rw-r--r--  1 jenkins jenkins     53 Jul 16 00:08 .gitattributes
drwxr-xr-x  3 jenkins jenkins   4096 Jul 16 00:08 .github
-rw-r--r--  1 jenkins jenkins    396 Jul 16 00:08 .gitignore
drwxr-xr-x  5 jenkins jenkins   4096 Aug 16 12:08 .gradle
drwxr-xr-x  3 jenkins jenkins   4096 Jul 16 00:08 gradle
-rw-r--r--  1 jenkins jenkins    494 Jul 16 00:08 gradle.properties
-rwxr-xr-x  1 jenkins jenkins   8762 Sep  8 12:07 gradlew
-rw-r--r--  1 jenkins jenkins   2966 Sep  8 12:07 gradlew.bat
drwxr-xr-x  2 jenkins jenkins   4096 Jul 16 00:08 jenkins
-rw-r--r--  1 jenkins jenkins 167947 Jul 16 00:08 KEYS
drwxr-xr-x  2 jenkins jenkins   4096 Jul 16 00:08 legal
drwxr-xr-x  2 jenkins jenkins   4096 Jul 16 00:08 lib.stored
drwxr-xr-x  3 jenkins jenkins   4096 Jul 16 00:08 osgi
-rw-r--r--  1 jenkins jenkins   4813 Jul 16 00:08 patch.xml
drwxr-xr-x  5 jenkins jenkins   4096 Sep  8 12:07 poi
drwxr-xr-x  4 jenkins jenkins   4096 Jul 18 12:09 poi-examples
drwxr-xr-x  4 jenkins jenkins   4096 Sep  8 12:07 poi-excelant
drwxr-xr-x  4 jenkins jenkins   4096 Sep  8 12:07 poi-integration
drwxr-xr-x  4 jenkins jenkins   4096 Sep  8 12:07 poi-ooxml
drwxr-xr-x  4 jenkins jenkins   4096 Aug 16 12:07 poi-ooxml-full
drwxr-xr-x  4 jenkins jenkins   4096 Jul 18 12:09 poi-ooxml-lite
drwxr-xr-x  4 jenkins jenkins   4096 Sep  8 12:07 poi-ooxml-lite-agent
drwxr-xr-x  5 jenkins jenkins   4096 Jul 18 12:09 poi-scratchpad
-rw-r--r--  1 jenkins jenkins   4354 Jul 18 12:07 README.rst
-rw-r--r--  1 jenkins jenkins    428 Jul 16 00:08 SECURITY.md
-rw-r--r--  1 jenkins jenkins    190 Jul 16 00:08 settings.gradle
drwxr-xr-x  4 jenkins jenkins   4096 Jul 16 00:08 src
drwxr-xr-x  4 jenkins jenkins   4096 Sep  8 12:07 .svn
drwxr-xr-x 15 jenkins jenkins   4096 Jul 16 00:08 test-data
-rw-r--r--  1 jenkins jenkins   3803 Jul 16 00:08 wrapper.gradle
+ echo which ant
which ant
+ which ant
/usr/bin/ant
+ ant -version
Apache Ant(TM) version 1.10.12 compiled on January 17 1970
+ echo <project default="test"><target name="test"><echo>Java ${ant.java.version}/${java.version}</echo><exec executable="javac"><arg value="-version"/></exec></target></project>
+ ant -f build.javacheck.xml -v
Apache Ant(TM) version 1.10.12 compiled on January 17 1970
Buildfile: <https://ci-builds.apache.org/job/POI/job/POI-DSL-OpenJDK/ws/build.javacheck.xml>
Detected Java version: 11 in: /usr/lib/jvm/java-11-openjdk-amd64
Detected OS: Linux
parsing buildfile <https://ci-builds.apache.org/job/POI/job/POI-DSL-OpenJDK/ws/build.javacheck.xml> with URI = <https://ci-builds.apache.org/job/POI/job/POI-DSL-OpenJDK/ws/build.javacheck.xml>
Project base dir set to: <https://ci-builds.apache.org/job/POI/job/POI-DSL-OpenJDK/ws/>
Build sequence for target(s) `test' is [test]
Complete build sequence is [test, ]

test:
parsing buildfile jar:file:/usr/share/ant/lib/ant.jar!/org/apache/tools/ant/antlib.xml with URI = jar:file:/usr/share/ant/lib/ant.jar!/org/apache/tools/ant/antlib.xml from a zip file
     [echo] Java 11/11.0.24
     [exec] Current OS is Linux
     [exec] Executing 'javac' with arguments:
     [exec] '-version'
     [exec] 
     [exec] The ' characters around the executable and arguments are
     [exec] not part of the command.
     [exec] javac 11.0.24

BUILD SUCCESSFUL
Total time: 1 second
+ exit 0
ERROR: Not all environment variables could be successfully injected. Check for similarly-named environment variables.
No JDK named ‘adoptopenjdk_hotspot_8u282’ found
[POI-DSL-OpenJDK] $ /bin/sh -xe /tmp/jenkins4994655432962215719.sh
+ touch --no-create build/*/build/test-results/TEST-*.xml build/*/build/test-results/test/TEST-*.xml
[Gradle] - Launching build.
ERROR: Not all environment variables could be successfully injected. Check for similarly-named environment variables.
No JDK named ‘adoptopenjdk_hotspot_8u282’ found
[POI-DSL-OpenJDK] $ <https://ci-builds.apache.org/job/POI/job/POI-DSL-OpenJDK/ws/gradlew> -PjdkVersion=8 -PjdkVendor=adoptopenjdk --refresh-dependencies clean jenkinsLite
To honour the JVM settings for this build a single-use Daemon process will be forked. For more on this, please refer to https://docs.gradle.org/8.10/userguide/gradle_daemon.html#sec:disabling_the_daemon in the Gradle documentation.
Daemon will be stopped at the end of the build 
Configuration on demand is an incubating feature.

> Configure project :
Trying to override old definition of datatype junit
Run with reduced parallelism for CI build
Run with reduced parallelism for CI build
Run with reduced parallelism for CI build
Run with reduced parallelism for CI build
Run with reduced parallelism for CI build
Run with reduced parallelism for CI build
Run with reduced parallelism for CI build
Run with reduced parallelism for CI build
Run with reduced parallelism for CI build
Invalid Java installation found at '/usr/local/asfpackages/java/oraclejdk-j2sdk1.4.2-19' (Maven Toolchains) auto-detected. It will be re-checked in the next build. This might have performance impact if it keeps failing. Run the 'javaToolchains' task for more details.

FAILURE: Build failed with an exception.

* Where:
Build file '<https://ci-builds.apache.org/job/POI/job/POI-DSL-OpenJDK/ws/poi/build.gradle'> line: 82

* What went wrong:
A problem occurred evaluating project ':poi'.
> Could not resolve all dependencies for configuration ':poi:testRuntimeClasspath'.
   > Failed to calculate the value of task ':poi:compileTestJava' property 'javaCompiler'.
      > Cannot find a Java installation on your machine matching this tasks requirements: {languageVersion=8, vendor=vendor matching('adoptopenjdk'), implementation=vendor-specific} for LINUX on x86_64.
         > No locally installed toolchains match and toolchain download repositories have not been configured.

* Try:
> Learn more about toolchain auto-detection at https://docs.gradle.org/8.10/userguide/toolchains.html#sec:auto_detection.
> Learn more about toolchain repositories at https://docs.gradle.org/8.10/userguide/toolchains.html#sub:download_repositories.
> Run with --stacktrace option to get the stack trace.
> Run with --info or --debug option to get more log output.
> Run with --scan to get full insights.
> Get more help at https://help.gradle.org.

Deprecated Gradle features were used in this build, making it incompatible with Gradle 9.0.

You can use '--warning-mode all' to show the individual deprecation warnings and determine if they come from your own scripts or plugins.

For more on this, please refer to https://docs.gradle.org/8.10/userguide/command_line_interface.html#sec:command_line_warnings in the Gradle documentation.

BUILD FAILED in 1m 6s
Build step 'Invoke Gradle script' changed build result to FAILURE
Build step 'Invoke Gradle script' marked build as failure
[SpotBugs] Skipping execution of recorder since overall result is 'FAILURE'
ERROR: Not all environment variables could be successfully injected. Check for similarly-named environment variables.
No JDK named ‘adoptopenjdk_hotspot_8u282’ found
Archiving artifacts
ERROR: Not all environment variables could be successfully injected. Check for similarly-named environment variables.
No JDK named ‘adoptopenjdk_hotspot_8u282’ found
Recording test results
ERROR: Not all environment variables could be successfully injected. Check for similarly-named environment variables.
No JDK named ‘adoptopenjdk_hotspot_8u282’ found
[Checks API] No suitable checks publisher found.
ERROR: Not all environment variables could be successfully injected. Check for similarly-named environment variables.
No JDK named ‘adoptopenjdk_hotspot_8u282’ found

---------------------------------------------------------------------
To unsubscribe, e-mail: dev-unsubscribe@poi.apache.org
For additional commands, e-mail: dev-help@poi.apache.org


Build failed in Jenkins: POI » POI-DSL-OpenJDK #990

Posted by Apache Jenkins Server <je...@builds.apache.org>.
See <https://ci-builds.apache.org/job/POI/job/POI-DSL-OpenJDK/990/display/redirect?page=changes>

Changes:

[PJ Fanning] upgrade spotbugs


------------------------------------------
Started by an SCM change
Running as SYSTEM
ERROR: Not all environment variables could be successfully injected. Check for similarly-named environment variables.
No JDK named ‘adoptopenjdk_hotspot_8u282’ found
[EnvInject] - Loading node environment variables.
[EnvInject] - Preparing an environment for the build.
[EnvInject] - Keeping Jenkins system variables.
[EnvInject] - Keeping Jenkins build variables.
[EnvInject] - Injecting as environment variables the properties content 
FORREST_HOME=/home/jenkins/tools/forrest/latest
LANG=en_US.UTF-8
CI_BUILD=TRUE

[EnvInject] - Variables injected successfully.
[EnvInject] - Injecting contributions.
Building remotely on builds39 (ubuntu) in workspace <https://ci-builds.apache.org/job/POI/job/POI-DSL-OpenJDK/ws/>
[WS-CLEANUP] Deleting project workspace...
[WS-CLEANUP] Done
ERROR: Not all environment variables could be successfully injected. Check for similarly-named environment variables.
No JDK named ‘adoptopenjdk_hotspot_8u282’ found
Updating https://svn.apache.org/repos/asf/poi/trunk at revision '2024-09-06T00:07:11.925 +0000'
U         build.gradle

<-- Got one external: documentation, svn url: https://svn.apache.org/repos/asf/poi/site/src/documentation -->
Fetching 'https://svn.apache.org/repos/asf/poi/site/src/documentation' at -1 into '<https://ci-builds.apache.org/job/POI/job/POI-DSL-OpenJDK/ws/src/documentation'>
At revision 1920483


<-- Got one external: forrest.properties, svn url: https://svn.apache.org/repos/asf/poi/site/forrest.properties -->
Fetching 'https://svn.apache.org/repos/asf/poi/site/forrest.properties' at -1 into '<https://ci-builds.apache.org/job/POI/job/POI-DSL-OpenJDK/ws/forrest.properties'>
At revision 1920483

At revision 1920483

No changes for https://svn.apache.org/repos/asf/poi/site/src/documentation since the previous build
No changes for https://svn.apache.org/repos/asf/poi/site/forrest.properties since the previous build
ERROR: Not all environment variables could be successfully injected. Check for similarly-named environment variables.
No JDK named ‘adoptopenjdk_hotspot_8u282’ found
ERROR: Not all environment variables could be successfully injected. Check for similarly-named environment variables.
No JDK named ‘adoptopenjdk_hotspot_8u282’ found
[POI-DSL-OpenJDK] $ /bin/sh -xe /tmp/jenkins3582964078324606245.sh
+ rm -rf examples excelant integrationtest main ooxml ooxml-schema scratchpad build.javacheck.xml
+ svn status
    X   forrest.properties
X       src/documentation

Performing status on external item at 'src/documentation':
+ svn revert poi-examples/src/main/java9/module-info.java poi-excelant/src/main/java9/module-info.java poi-excelant/src/test/java9/module-info.java poi-integration/src/test/java9/module-info.java poi-ooxml-full/src/main/java9/module-info.java poi-ooxml-lite-agent/src/main/java9/module-info.java poi-ooxml-lite/src/main/java9/module-info.java poi-ooxml/src/main/java9/module-info.java poi-ooxml/src/test/java9/module-info.java poi-scratchpad/src/main/java9/module-info.java poi-scratchpad/src/test/java9/module-info.java poi/src/main/java9/module-info.java poi/src/test/java9/module-info.java
+ svn revert src/resources/ooxml-lite-report.clazz src/resources/ooxml-lite-report.xsb
+ echo Java-Home:
Java-Home:
+ ls -al /
total 8390608
drwxr-xr-x  20 root root       4096 Aug 20 22:49 .
drwxr-xr-x  20 root root       4096 Aug 20 22:49 ..
lrwxrwxrwx   1 root root          7 Aug 23  2023 bin -> usr/bin
drwxr-xr-x   4 root root       4096 Aug 22 06:49 boot
drwxr-xr-x  21 root root       4340 Sep  3 14:50 dev
drwxr-xr-x 141 root root      12288 Sep  5 06:38 etc
drwxr-xr-x  10 root root       4096 Dec 21  2023 home
lrwxrwxrwx   1 root root          7 Aug 23  2023 lib -> usr/lib
lrwxrwxrwx   1 root root          9 Aug 23  2023 lib32 -> usr/lib32
lrwxrwxrwx   1 root root          9 Aug 23  2023 lib64 -> usr/lib64
lrwxrwxrwx   1 root root         10 Aug 23  2023 libx32 -> usr/libx32
drwx------   2 root root      16384 Nov 13  2023 lost+found
drwxr-xr-x   2 root root       4096 Aug 23  2023 media
drwxr-xr-x   2 root root       4096 Aug 23  2023 mnt
drwxr-xr-x  14 root root       4096 Apr 19 20:57 opt
dr-xr-xr-x 406 root root          0 Aug 20 22:45 proc
-rw-r--r--   1 root root      11304 May 17  2023 puppet-release-jammy.deb
drwx------  11 root root       4096 Aug 20 22:50 root
drwxr-xr-x  44 root root       1320 Sep  5 23:50 run
lrwxrwxrwx   1 root root          8 Aug 23  2023 sbin -> usr/sbin
drwxr-xr-x  13 root root       4096 Aug 21 11:19 snap
drwxr-xr-x   2 root root       4096 Aug 20 22:50 srv
-rw-------   1 root root 8589934592 Nov 13  2023 swap.img
dr-xr-xr-x  13 root root          0 Aug 20 22:45 sys
drwxrwxrwt 436 root root    1941504 Sep  6 00:07 tmp
drwx------   3 root root       4096 Nov 17  2023 Users
drwxr-xr-x  16 root root       4096 Nov 13  2023 usr
drwxr-xr-x  13 root root       4096 Aug 23  2023 var
+ ls -al /bin
lrwxrwxrwx 1 root root 7 Aug 23  2023 /bin -> usr/bin
+ /bin/java -version
openjdk version "11.0.24" 2024-07-16
OpenJDK Runtime Environment (build 11.0.24+8-post-Ubuntu-1ubuntu322.04)
OpenJDK 64-Bit Server VM (build 11.0.24+8-post-Ubuntu-1ubuntu322.04, mixed mode, sharing)
+ echo which java
which java
+ which java
/usr/bin/java
+ java -version
openjdk version "11.0.24" 2024-07-16
OpenJDK Runtime Environment (build 11.0.24+8-post-Ubuntu-1ubuntu322.04)
OpenJDK 64-Bit Server VM (build 11.0.24+8-post-Ubuntu-1ubuntu322.04, mixed mode, sharing)
+ echo which javac
which javac
+ which javac
/usr/bin/javac
+ javac -version
javac 11.0.24
+ echo Ant-Home:
Ant-Home:
+ ls -al
total 516
drwxr-xr-x 21 jenkins jenkins   4096 Sep  6 00:07 .
drwxr-xr-x  3 jenkins jenkins   4096 Aug 31 00:07 ..
-rw-r--r--  1 jenkins jenkins    520 Aug 31 00:08 .asf.yaml
-rw-r--r--  1 jenkins jenkins  33427 Sep  6 00:07 build.gradle
-rw-r--r--  1 jenkins jenkins 151471 Aug 31 00:07 build.xml
-rw-r--r--  1 jenkins jenkins   7709 Aug 31 00:08 doap_POI.rdf
-rw-r--r--  1 jenkins jenkins   3261 Aug 31 00:08 file-leak-detector.exclude
-rw-r--r--  1 jenkins jenkins   6229 Aug 31 00:08 forrest.properties
-rw-r--r--  1 jenkins jenkins     53 Aug 31 00:08 .gitattributes
drwxr-xr-x  3 jenkins jenkins   4096 Aug 31 00:08 .github
-rw-r--r--  1 jenkins jenkins    396 Aug 31 00:08 .gitignore
drwxr-xr-x  5 jenkins jenkins   4096 Aug 31 00:08 .gradle
drwxr-xr-x  3 jenkins jenkins   4096 Aug 31 00:07 gradle
-rw-r--r--  1 jenkins jenkins    494 Aug 31 00:08 gradle.properties
-rwxr-xr-x  1 jenkins jenkins   8762 Aug 31 00:07 gradlew
-rw-r--r--  1 jenkins jenkins   2966 Aug 31 00:07 gradlew.bat
drwxr-xr-x  2 jenkins jenkins   4096 Aug 31 00:08 jenkins
-rw-r--r--  1 jenkins jenkins 167947 Aug 31 00:08 KEYS
drwxr-xr-x  2 jenkins jenkins   4096 Aug 31 00:08 legal
drwxr-xr-x  2 jenkins jenkins   4096 Aug 31 00:08 lib.stored
drwxr-xr-x  3 jenkins jenkins   4096 Aug 31 00:08 osgi
-rw-r--r--  1 jenkins jenkins   4813 Aug 31 00:08 patch.xml
drwxr-xr-x  4 jenkins jenkins   4096 Aug 31 00:07 poi
drwxr-xr-x  3 jenkins jenkins   4096 Aug 31 00:08 poi-examples
drwxr-xr-x  3 jenkins jenkins   4096 Aug 31 00:07 poi-excelant
drwxr-xr-x  3 jenkins jenkins   4096 Aug 31 00:07 poi-integration
drwxr-xr-x  3 jenkins jenkins   4096 Aug 31 00:07 poi-ooxml
drwxr-xr-x  3 jenkins jenkins   4096 Aug 31 00:07 poi-ooxml-full
drwxr-xr-x  3 jenkins jenkins   4096 Aug 31 00:08 poi-ooxml-lite
drwxr-xr-x  3 jenkins jenkins   4096 Aug 31 00:07 poi-ooxml-lite-agent
drwxr-xr-x  4 jenkins jenkins   4096 Aug 31 00:08 poi-scratchpad
-rw-r--r--  1 jenkins jenkins   4354 Aug 31 00:08 README.rst
-rw-r--r--  1 jenkins jenkins    428 Aug 31 00:08 SECURITY.md
-rw-r--r--  1 jenkins jenkins    190 Aug 31 00:08 settings.gradle
drwxr-xr-x  4 jenkins jenkins   4096 Aug 31 00:08 src
drwxr-xr-x  4 jenkins jenkins   4096 Sep  6 00:07 .svn
drwxr-xr-x 15 jenkins jenkins   4096 Aug 31 00:08 test-data
-rw-r--r--  1 jenkins jenkins   3803 Aug 31 00:08 wrapper.gradle
+ echo which ant
which ant
+ which ant
/usr/bin/ant
+ ant -version
Apache Ant(TM) version 1.10.12 compiled on January 17 1970
+ echo <project default="test"><target name="test"><echo>Java ${ant.java.version}/${java.version}</echo><exec executable="javac"><arg value="-version"/></exec></target></project>
+ ant -f build.javacheck.xml -v
Apache Ant(TM) version 1.10.12 compiled on January 17 1970
Buildfile: <https://ci-builds.apache.org/job/POI/job/POI-DSL-OpenJDK/ws/build.javacheck.xml>
Detected Java version: 11 in: /usr/lib/jvm/java-11-openjdk-amd64
Detected OS: Linux
parsing buildfile <https://ci-builds.apache.org/job/POI/job/POI-DSL-OpenJDK/ws/build.javacheck.xml> with URI = <https://ci-builds.apache.org/job/POI/job/POI-DSL-OpenJDK/ws/build.javacheck.xml>
Project base dir set to: <https://ci-builds.apache.org/job/POI/job/POI-DSL-OpenJDK/ws/>
Build sequence for target(s) `test' is [test]
Complete build sequence is [test, ]

test:
parsing buildfile jar:file:/usr/share/ant/lib/ant.jar!/org/apache/tools/ant/antlib.xml with URI = jar:file:/usr/share/ant/lib/ant.jar!/org/apache/tools/ant/antlib.xml from a zip file
     [echo] Java 11/11.0.24
     [exec] Current OS is Linux
     [exec] Executing 'javac' with arguments:
     [exec] '-version'
     [exec] 
     [exec] The ' characters around the executable and arguments are
     [exec] not part of the command.
     [exec] javac 11.0.24

BUILD SUCCESSFUL
Total time: 1 second
+ exit 0
ERROR: Not all environment variables could be successfully injected. Check for similarly-named environment variables.
No JDK named ‘adoptopenjdk_hotspot_8u282’ found
[POI-DSL-OpenJDK] $ /bin/sh -xe /tmp/jenkins9849555041535806398.sh
+ touch --no-create build/*/build/test-results/TEST-*.xml build/*/build/test-results/test/TEST-*.xml
[Gradle] - Launching build.
ERROR: Not all environment variables could be successfully injected. Check for similarly-named environment variables.
No JDK named ‘adoptopenjdk_hotspot_8u282’ found
[POI-DSL-OpenJDK] $ <https://ci-builds.apache.org/job/POI/job/POI-DSL-OpenJDK/ws/gradlew> -PjdkVersion=8 -PjdkVendor=adoptopenjdk --refresh-dependencies clean jenkinsLite
To honour the JVM settings for this build a single-use Daemon process will be forked. For more on this, please refer to https://docs.gradle.org/8.10/userguide/gradle_daemon.html#sec:disabling_the_daemon in the Gradle documentation.
Daemon will be stopped at the end of the build 
Configuration on demand is an incubating feature.

> Configure project :
Trying to override old definition of datatype junit
Run with reduced parallelism for CI build
Run with reduced parallelism for CI build
Run with reduced parallelism for CI build
Run with reduced parallelism for CI build
Run with reduced parallelism for CI build
Run with reduced parallelism for CI build
Run with reduced parallelism for CI build
Run with reduced parallelism for CI build
Run with reduced parallelism for CI build
Invalid Java installation found at '/usr/local/asfpackages/java/oraclejdk-j2sdk1.4.2-19' (Maven Toolchains) auto-detected. It will be re-checked in the next build. This might have performance impact if it keeps failing. Run the 'javaToolchains' task for more details.

FAILURE: Build failed with an exception.

* Where:
Build file '<https://ci-builds.apache.org/job/POI/job/POI-DSL-OpenJDK/ws/poi/build.gradle'> line: 82

* What went wrong:
A problem occurred evaluating project ':poi'.
> Could not resolve all dependencies for configuration ':poi:testRuntimeClasspath'.
   > Failed to calculate the value of task ':poi:compileTestJava' property 'javaCompiler'.
      > Cannot find a Java installation on your machine matching this tasks requirements: {languageVersion=8, vendor=vendor matching('adoptopenjdk'), implementation=vendor-specific} for LINUX on x86_64.
         > No locally installed toolchains match and toolchain download repositories have not been configured.

* Try:
> Learn more about toolchain auto-detection at https://docs.gradle.org/8.10/userguide/toolchains.html#sec:auto_detection.
> Learn more about toolchain repositories at https://docs.gradle.org/8.10/userguide/toolchains.html#sub:download_repositories.
> Run with --stacktrace option to get the stack trace.
> Run with --info or --debug option to get more log output.
> Run with --scan to get full insights.
> Get more help at https://help.gradle.org.

Deprecated Gradle features were used in this build, making it incompatible with Gradle 9.0.

You can use '--warning-mode all' to show the individual deprecation warnings and determine if they come from your own scripts or plugins.

For more on this, please refer to https://docs.gradle.org/8.10/userguide/command_line_interface.html#sec:command_line_warnings in the Gradle documentation.

BUILD FAILED in 1m 4s
Build step 'Invoke Gradle script' changed build result to FAILURE
Build step 'Invoke Gradle script' marked build as failure
[SpotBugs] Skipping execution of recorder since overall result is 'FAILURE'
ERROR: Not all environment variables could be successfully injected. Check for similarly-named environment variables.
No JDK named ‘adoptopenjdk_hotspot_8u282’ found
Archiving artifacts
ERROR: Not all environment variables could be successfully injected. Check for similarly-named environment variables.
No JDK named ‘adoptopenjdk_hotspot_8u282’ found
Recording test results
ERROR: Not all environment variables could be successfully injected. Check for similarly-named environment variables.
No JDK named ‘adoptopenjdk_hotspot_8u282’ found
ERROR: Step ‘Publish JUnit test result report’ failed: No test report files were found. Configuration error?
ERROR: Not all environment variables could be successfully injected. Check for similarly-named environment variables.
No JDK named ‘adoptopenjdk_hotspot_8u282’ found

---------------------------------------------------------------------
To unsubscribe, e-mail: dev-unsubscribe@poi.apache.org
For additional commands, e-mail: dev-help@poi.apache.org