You are viewing a plain text version of this content. The canonical link for it is here.
Posted to issues@tez.apache.org by Apache Jenkins Server <je...@builds.apache.org> on 2015/11/17 23:28:55 UTC

Failed: TEZ-2723 PreCommit Build #1322

Jira: https://issues.apache.org/jira/browse/TEZ-2723
Build: https://builds.apache.org/job/PreCommit-TEZ-Build/1322/

###################################################################################
########################## LAST 60 LINES OF THE CONSOLE ###########################
[...truncated 24 lines...]

======================================================================
======================================================================
    Testing patch for TEZ-2723.
======================================================================
======================================================================


HEAD is now at 77dfdc0 TEZ-2908. Tez UI: Errors are logged, but not displayed in the UI when AM fetch fails (sree)
Previous HEAD position was 77dfdc0... TEZ-2908. Tez UI: Errors are logged, but not displayed in the UI when AM fetch fails (sree)
Switched to branch 'master'
Your branch is behind 'origin/master' by 1 commit, and can be fast-forwarded.
  (use "git pull" to update your local branch)
First, rewinding head to replay your work on top of it...
Fast-forwarded master to 77dfdc0ddaa294622e54c8e2ef7f1dea1e1bdc6d.
TEZ-2723 patch is being downloaded at Tue Nov 17 22:28:52 UTC 2015 from
http://issues.apache.org/jira/secure/attachment/12750720/TEZ-2723.1.patch
The patch does not appear to apply with p0 to p2
PATCH APPLICATION FAILED




{color:red}-1 overall{color}.  Here are the results of testing the latest attachment
  http://issues.apache.org/jira/secure/attachment/12750720/TEZ-2723.1.patch
  against master revision 77dfdc0.

    {color:red}-1 patch{color}.  The patch command could not apply the patch.

Console output: https://builds.apache.org/job/PreCommit-TEZ-Build/1322//console

This message is automatically generated.


======================================================================
======================================================================
    Adding comment to Jira.
======================================================================
======================================================================


Comment added.
a77a258730b79d632f2c625410db3e268333c4d5 logged out


======================================================================
======================================================================
    Finished build.
======================================================================
======================================================================


Build step 'Execute shell' marked build as failure
Archiving artifacts
[description-setter] Could not determine description.
Recording test results
ERROR: Publisher 'Publish JUnit test result report' failed: No test report files were found. Configuration error?
Email was triggered for: Failure - Any
Sending email for trigger: Failure - Any



###################################################################################
############################## FAILED TESTS (if any) ##############################
No tests ran.

Success: TEZ-2949 PreCommit Build #1327

Posted by Apache Jenkins Server <je...@builds.apache.org>.
Jira: https://issues.apache.org/jira/browse/TEZ-2949
Build: https://builds.apache.org/job/PreCommit-TEZ-Build/1327/

###################################################################################
########################## LAST 60 LINES OF THE CONSOLE ###########################
[...truncated 3744 lines...]
[INFO] Tez ............................................... SUCCESS [  0.061 s]
[INFO] ------------------------------------------------------------------------
[INFO] BUILD SUCCESS
[INFO] ------------------------------------------------------------------------
[INFO] Total time: 52:59 min
[INFO] Finished at: 2015-11-19T22:34:10+00:00
[INFO] Final Memory: 76M/1048M
[INFO] ------------------------------------------------------------------------




{color:green}+1 overall{color}.  Here are the results of testing the latest attachment
  http://issues.apache.org/jira/secure/attachment/12773335/TEZ-2949.2.patch
  against master revision 4561b82.

    {color:green}+1 @author{color}.  The patch does not contain any @author tags.

    {color:green}+1 tests included{color}.  The patch appears to include 3 new or modified test files.

    {color:green}+1 javac{color}.  The applied patch does not increase the total number of javac compiler warnings.

    {color:green}+1 javadoc{color}.  There were no new javadoc warning messages.

    {color:green}+1 findbugs{color}.  The patch does not introduce any new Findbugs (version 3.0.1) warnings.

    {color:green}+1 release audit{color}.  The applied patch does not increase the total number of release audit warnings.

    {color:green}+1 core tests{color}.  The patch passed unit tests in .

Test results: https://builds.apache.org/job/PreCommit-TEZ-Build/1327//testReport/
Console output: https://builds.apache.org/job/PreCommit-TEZ-Build/1327//console

This message is automatically generated.


======================================================================
======================================================================
    Adding comment to Jira.
======================================================================
======================================================================


Comment added.
f08baee5b5f1131862a82b21848b4c77980870fa logged out


======================================================================
======================================================================
    Finished build.
======================================================================
======================================================================


Archiving artifacts
[description-setter] Description set: TEZ-2949
Recording test results
Email was triggered for: Success
Sending email for trigger: Success



###################################################################################
############################## FAILED TESTS (if any) ##############################
All tests passed

Failed: TEZ-2949 PreCommit Build #1326

Posted by Apache Jenkins Server <je...@builds.apache.org>.
Jira: https://issues.apache.org/jira/browse/TEZ-2949
Build: https://builds.apache.org/job/PreCommit-TEZ-Build/1326/

###################################################################################
########################## LAST 60 LINES OF THE CONSOLE ###########################
[...truncated 3747 lines...]
[INFO] ------------------------------------------------------------------------
[INFO] Total time: 53:00 min
[INFO] Finished at: 2015-11-19T20:53:28+00:00
[INFO] Final Memory: 73M/938M
[INFO] ------------------------------------------------------------------------




{color:red}-1 overall{color}.  Here are the results of testing the latest attachment
  http://issues.apache.org/jira/secure/attachment/12773063/TEZ-2949.1.patch
  against master revision 4561b82.

    {color:green}+1 @author{color}.  The patch does not contain any @author tags.

    {color:green}+1 tests included{color}.  The patch appears to include 3 new or modified test files.

    {color:green}+1 javac{color}.  The applied patch does not increase the total number of javac compiler warnings.

    {color:green}+1 javadoc{color}.  There were no new javadoc warning messages.

    {color:red}-1 findbugs{color}.  The patch appears to introduce 1 new Findbugs (version 3.0.1) warnings.

    {color:green}+1 release audit{color}.  The applied patch does not increase the total number of release audit warnings.

    {color:green}+1 core tests{color}.  The patch passed unit tests in .

Test results: https://builds.apache.org/job/PreCommit-TEZ-Build/1326//testReport/
Findbugs warnings: https://builds.apache.org/job/PreCommit-TEZ-Build/1326//artifact/patchprocess/newPatchFindbugsWarningstez-dag.html
Console output: https://builds.apache.org/job/PreCommit-TEZ-Build/1326//console

This message is automatically generated.


======================================================================
======================================================================
    Adding comment to Jira.
======================================================================
======================================================================


Comment added.
18e4c30b47451f9186398a34a6eb2815c95cec2a logged out


======================================================================
======================================================================
    Finished build.
======================================================================
======================================================================


Build step 'Execute shell' marked build as failure
Archiving artifacts
Compressed 3.15 MB of artifacts by 20.8% relative to #1306
[description-setter] Could not determine description.
Recording test results
Email was triggered for: Failure - Any
Sending email for trigger: Failure - Any



###################################################################################
############################## FAILED TESTS (if any) ##############################
All tests passed

Failed: TEZ-2952 PreCommit Build #1325

Posted by Apache Jenkins Server <je...@builds.apache.org>.
Jira: https://issues.apache.org/jira/browse/TEZ-2952
Build: https://builds.apache.org/job/PreCommit-TEZ-Build/1325/

###################################################################################
########################## LAST 60 LINES OF THE CONSOLE ###########################
[...truncated 3537 lines...]
[ERROR] [Help 1] http://cwiki.apache.org/confluence/display/MAVEN/MojoFailureException
[ERROR] [Help 2] http://cwiki.apache.org/confluence/display/MAVEN/MojoExecutionException
[ERROR] 
[ERROR] After correcting the problems, you can resume the build with the command
[ERROR]   mvn <goals> -rf :tez-job-analyzer




{color:red}-1 overall{color}.  Here are the results of testing the latest attachment
  http://issues.apache.org/jira/secure/attachment/12773275/TEZ-2952.1.patch
  against master revision c07f284.

    {color:green}+1 @author{color}.  The patch does not contain any @author tags.

    {color:green}+1 tests included{color}.  The patch appears to include 2 new or modified test files.

    {color:green}+1 javac{color}.  The applied patch does not increase the total number of javac compiler warnings.

    {color:green}+1 javadoc{color}.  There were no new javadoc warning messages.

    {color:green}+1 findbugs{color}.  The patch does not introduce any new Findbugs (version 3.0.1) warnings.

    {color:green}+1 release audit{color}.  The applied patch does not increase the total number of release audit warnings.

    {color:red}-1 core tests{color}.  The patch failed these unit tests in :
                   org.apache.tez.analyzer.TestAnalyzer

Test results: https://builds.apache.org/job/PreCommit-TEZ-Build/1325//testReport/
Console output: https://builds.apache.org/job/PreCommit-TEZ-Build/1325//console

This message is automatically generated.


======================================================================
======================================================================
    Adding comment to Jira.
======================================================================
======================================================================


Comment added.
52a21845f5406919149d354eca64f7cd22e70ace logged out


======================================================================
======================================================================
    Finished build.
======================================================================
======================================================================


Build step 'Execute shell' marked build as failure
Archiving artifacts
Compressed 3.14 MB of artifacts by 20.9% relative to #1306
[description-setter] Could not determine description.
Recording test results
Email was triggered for: Failure - Any
Sending email for trigger: Failure - Any



###################################################################################
############################## FAILED TESTS (if any) ##############################
1 tests failed.
FAILED:  org.apache.tez.analyzer.TestAnalyzer.testWithATS

Error Message:
v3 : 000000_1

Stack Trace:
java.lang.AssertionError: v3 : 000000_1
	at org.junit.Assert.fail(Assert.java:88)
	at org.junit.Assert.assertTrue(Assert.java:41)
	at org.apache.tez.analyzer.TestAnalyzer.verifyCriticalPath(TestAnalyzer.java:322)
	at org.apache.tez.analyzer.TestAnalyzer.verify(TestAnalyzer.java:250)
	at org.apache.tez.analyzer.TestAnalyzer.runTests(TestAnalyzer.java:387)
	at org.apache.tez.analyzer.TestAnalyzer.testWithATS(TestAnalyzer.java:351)



Failed: TEZ-2948 PreCommit Build #1324

Posted by Apache Jenkins Server <je...@builds.apache.org>.
Jira: https://issues.apache.org/jira/browse/TEZ-2948
Build: https://builds.apache.org/job/PreCommit-TEZ-Build/1324/

###################################################################################
########################## LAST 60 LINES OF THE CONSOLE ###########################
[...truncated 2511 lines...]
[ERROR] For more information about the errors and possible solutions, please read the following articles:
[ERROR] [Help 1] http://cwiki.apache.org/confluence/display/MAVEN/MojoFailureException
[ERROR] 
[ERROR] After correcting the problems, you can resume the build with the command
[ERROR]   mvn <goals> -rf :tez-api




{color:red}-1 overall{color}.  Here are the results of testing the latest attachment
  http://issues.apache.org/jira/secure/attachment/12773050/TEZ-2948.1.txt
  against master revision e5e4fc7.

    {color:green}+1 @author{color}.  The patch does not contain any @author tags.

    {color:green}+1 tests included{color}.  The patch appears to include 1 new or modified test files.

    {color:green}+1 javac{color}.  The applied patch does not increase the total number of javac compiler warnings.

    {color:green}+1 javadoc{color}.  There were no new javadoc warning messages.

    {color:green}+1 findbugs{color}.  The patch does not introduce any new Findbugs (version 3.0.1) warnings.

    {color:green}+1 release audit{color}.  The applied patch does not increase the total number of release audit warnings.

    {color:red}-1 core tests{color}.  The patch failed these unit tests in :
                   org.apache.tez.client.TestTezClient

Test results: https://builds.apache.org/job/PreCommit-TEZ-Build/1324//testReport/
Console output: https://builds.apache.org/job/PreCommit-TEZ-Build/1324//console

This message is automatically generated.


======================================================================
======================================================================
    Adding comment to Jira.
======================================================================
======================================================================


Comment added.
fc9809f0f7925865f7aafa952cb9741e97c1043e logged out


======================================================================
======================================================================
    Finished build.
======================================================================
======================================================================


Build step 'Execute shell' marked build as failure
Archiving artifacts
Compressed 3.09 MB of artifacts by 21.3% relative to #1306
[description-setter] Could not determine description.
Recording test results
Email was triggered for: Failure - Any
Sending email for trigger: Failure - Any



###################################################################################
############################## FAILED TESTS (if any) ##############################
1 tests failed.
FAILED:  org.apache.tez.client.TestTezClient.testStopRetriesUntilTimeout

Error Message:
test timed out after 5000 milliseconds

Stack Trace:
java.lang.Exception: test timed out after 5000 milliseconds
	at java.lang.Thread.sleep(Native Method)
	at org.apache.tez.client.TezClient.stop(TezClient.java:589)
	at org.apache.tez.client.TestTezClient.testStopRetriesUntilTimeout(TestTezClient.java:557)



Failed: TEZ-2480 PreCommit Build #1323

Posted by Apache Jenkins Server <je...@builds.apache.org>.
Jira: https://issues.apache.org/jira/browse/TEZ-2480
Build: https://builds.apache.org/job/PreCommit-TEZ-Build/1323/

###################################################################################
########################## LAST 60 LINES OF THE CONSOLE ###########################
[...truncated 2693 lines...]
[ERROR] [Help 1] http://cwiki.apache.org/confluence/display/MAVEN/MojoFailureException
[ERROR] 
[ERROR] After correcting the problems, you can resume the build with the command
[ERROR]   mvn <goals> -rf :tez-runtime-internals




{color:red}-1 overall{color}.  Here are the results of testing the latest attachment
  http://issues.apache.org/jira/secure/attachment/12773051/TEZ-2480.1.txt
  against master revision e5e4fc7.

    {color:green}+1 @author{color}.  The patch does not contain any @author tags.

    {color:red}-1 tests included{color}.  The patch doesn't appear to include any new or modified tests.
                        Please justify why no new tests are needed for this patch.
                        Also please list what manual steps were performed to verify this patch.

    {color:green}+1 javac{color}.  The applied patch does not increase the total number of javac compiler warnings.

    {color:green}+1 javadoc{color}.  There were no new javadoc warning messages.

    {color:green}+1 findbugs{color}.  The patch does not introduce any new Findbugs (version 3.0.1) warnings.

    {color:green}+1 release audit{color}.  The applied patch does not increase the total number of release audit warnings.

    {color:red}-1 core tests{color}.  The patch failed these unit tests in :
                   org.apache.tez.runtime.api.impl.TestProcessorContext

Test results: https://builds.apache.org/job/PreCommit-TEZ-Build/1323//testReport/
Console output: https://builds.apache.org/job/PreCommit-TEZ-Build/1323//console

This message is automatically generated.


======================================================================
======================================================================
    Adding comment to Jira.
======================================================================
======================================================================


Comment added.
3d02b8709a5867f7165e36f23da23441d4e3df47 logged out


======================================================================
======================================================================
    Finished build.
======================================================================
======================================================================


Build step 'Execute shell' marked build as failure
Archiving artifacts
[description-setter] Could not determine description.
Recording test results
Email was triggered for: Failure - Any
Sending email for trigger: Failure - Any



###################################################################################
############################## FAILED TESTS (if any) ##############################
1 tests failed.
FAILED:  org.apache.tez.runtime.api.impl.TestProcessorContext.testDagNumber

Error Message:
null

Stack Trace:
java.lang.NullPointerException: null
	at org.apache.tez.runtime.RuntimeTask.notifyProgressInvocation(RuntimeTask.java:109)
	at org.apache.tez.runtime.api.impl.TezTaskContextImpl.notifyProgress(TezTaskContextImpl.java:178)
	at org.apache.tez.runtime.api.impl.TezProcessorContextImpl.setProgress(TezProcessorContextImpl.java:97)
	at org.apache.tez.runtime.api.impl.TestProcessorContext.testDagNumber(TestProcessorContext.java:101)