You are viewing a plain text version of this content. The canonical link for it is here.
Posted to commits@beam.apache.org by Apache Jenkins Server <je...@builds.apache.org> on 2018/02/17 15:46:33 UTC
Build failed in Jenkins: beam_PostCommit_Python_Verify #4252
See <https://builds.apache.org/job/beam_PostCommit_Python_Verify/4252/display/redirect>
------------------------------------------
[...truncated 1.40 MB...]
value {
spec {
spec {
urn: "beam:coder:varint:v1"
}
}
}
}
coders {
key: "ref_Coder_WindowedValueCoder_1"
value {
spec {
spec {
urn: "beam:coder:windowed_value:v1"
}
}
component_coder_ids: "ref_Coder_VarIntCoder_2"
component_coder_ids: "ref_Coder_GlobalWindowCoder_3"
}
}
coders {
key: "ref_Coder_WindowedValueCoder_10"
value {
spec {
spec {
urn: "beam:coder:windowed_value:v1"
}
}
component_coder_ids: "ref_Coder_TupleCoder_11"
component_coder_ids: "ref_Coder_GlobalWindowCoder_3"
}
}
coders {
key: "ref_Coder_WindowedValueCoder_12"
value {
spec {
spec {
urn: "beam:coder:windowed_value:v1"
}
}
component_coder_ids: "ref_Coder_TupleCoder_9"
component_coder_ids: "ref_Coder_GlobalWindowCoder_3"
}
}
coders {
key: "ref_Coder_WindowedValueCoder_12_bytes"
value {
spec {
spec {
urn: "beam:coder:windowed_value:v1"
}
}
component_coder_ids: "ref_Coder_TupleCoder_9_bytes"
component_coder_ids: "ref_Coder_GlobalWindowCoder_3"
}
}
coders {
key: "ref_Coder_WindowedValueCoder_12_len_prefix"
value {
spec {
spec {
urn: "beam:coder:windowed_value:v1"
}
}
component_coder_ids: "ref_Coder_TupleCoder_9_len_prefix"
component_coder_ids: "ref_Coder_GlobalWindowCoder_3"
}
}
coders {
key: "ref_Coder_WindowedValueCoder_13"
value {
spec {
spec {
urn: "beam:coder:windowed_value:v1"
}
}
component_coder_ids: "ref_Coder_TupleCoder_14"
component_coder_ids: "ref_Coder_GlobalWindowCoder_3"
}
}
coders {
key: "ref_Coder_WindowedValueCoder_13_bytes"
value {
spec {
spec {
urn: "beam:coder:windowed_value:v1"
}
}
component_coder_ids: "ref_Coder_TupleCoder_14_bytes"
component_coder_ids: "ref_Coder_GlobalWindowCoder_3"
}
}
coders {
key: "ref_Coder_WindowedValueCoder_13_len_prefix"
value {
spec {
spec {
urn: "beam:coder:windowed_value:v1"
}
}
component_coder_ids: "ref_Coder_TupleCoder_14_len_prefix"
component_coder_ids: "ref_Coder_GlobalWindowCoder_3"
}
}
coders {
key: "ref_Coder_WindowedValueCoder_16"
value {
spec {
spec {
urn: "beam:coder:windowed_value:v1"
}
}
component_coder_ids: "ref_Coder_FastPrimitivesCoder_6"
component_coder_ids: "ref_Coder_GlobalWindowCoder_3"
}
}
coders {
key: "ref_Coder_WindowedValueCoder_4"
value {
spec {
spec {
urn: "beam:coder:windowed_value:v1"
}
}
component_coder_ids: "ref_Coder_TupleCoder_5"
component_coder_ids: "ref_Coder_GlobalWindowCoder_3"
}
}
coders {
key: "ref_Coder_WindowedValueCoder_7"
value {
spec {
spec {
urn: "beam:coder:windowed_value:v1"
}
}
component_coder_ids: "ref_Coder_TupleCoder_8"
component_coder_ids: "ref_Coder_GlobalWindowCoder_3"
}
}
}
}
root: DEBUG: CONTROL RESPONSE instruction_id: "control_4"
register {
}
root: DEBUG: CONTROL REQUEST instruction_id: "bundle_1211"
process_bundle {
process_bundle_descriptor_reference: "3"
}
root: INFO: start <DoOperation assert_that/Match output_tags=['out']>
root: INFO: start <DoOperation assert_that/Unkey output_tags=['out']>
root: INFO: start <DoOperation assert_that/Group/Map(_merge_tagged_vals_under_key) output_tags=['out']>
root: INFO: start <DataInputOperation assert_that/Group/GroupByKey/Read receivers=[ConsumerSet[assert_that/Group/GroupByKey/Read.out0, coder=WindowedValueCoder[TupleCoder[LengthPrefixCoder[FastPrimitivesCoder], IterableCoder[LengthPrefixCoder[FastPrimitivesCoder]]]], len(consumers)=1]]>
root: INFO: finish <DataInputOperation assert_that/Group/GroupByKey/Read receivers=[ConsumerSet[assert_that/Group/GroupByKey/Read.out0, coder=WindowedValueCoder[TupleCoder[LengthPrefixCoder[FastPrimitivesCoder], IterableCoder[LengthPrefixCoder[FastPrimitivesCoder]]]], len(consumers)=1]]>
root: INFO: finish <DoOperation assert_that/Group/Map(_merge_tagged_vals_under_key) output_tags=['out'], receivers=[ConsumerSet[assert_that/Group/Map(_merge_tagged_vals_under_key).out0, coder=WindowedValueCoder[FastPrimitivesCoder], len(consumers)=1]]>
root: INFO: finish <DoOperation assert_that/Unkey output_tags=['out'], receivers=[ConsumerSet[assert_that/Unkey.out0, coder=WindowedValueCoder[FastPrimitivesCoder], len(consumers)=1]]>
root: INFO: finish <DoOperation assert_that/Match output_tags=['out'], receivers=[ConsumerSet[assert_that/Match.out0, coder=WindowedValueCoder[FastPrimitivesCoder], len(consumers)=0]]>
root: DEBUG: CONTROL RESPONSE instruction_id: "bundle_1211"
process_bundle {
metrics {
ptransforms {
key: "assert_that/Group/GroupByKey/Read"
value {
processed_elements {
measured {
output_element_counts {
key: "None"
value: 1
}
}
}
}
}
ptransforms {
key: "assert_that/Group/Map(_merge_tagged_vals_under_key)"
value {
processed_elements {
measured {
output_element_counts {
key: "None"
value: 1
}
}
}
}
}
ptransforms {
key: "assert_that/Match"
value {
processed_elements {
measured {
output_element_counts {
key: "None"
value: 1
}
}
}
}
}
ptransforms {
key: "assert_that/Unkey"
value {
processed_elements {
measured {
output_element_counts {
key: "None"
value: 1
}
}
}
}
}
}
}
root: DEBUG: Gather all output data from [].
root: DEBUG: Wait for the bundle to finish.
--------------------- >> end captured logging << ---------------------
======================================================================
FAIL: test_using_slow_impl (apache_beam.coders.slow_coders_test.SlowCoders)
----------------------------------------------------------------------
Traceback (most recent call last):
File "<https://builds.apache.org/job/beam_PostCommit_Python_Verify/ws/src/sdks/python/apache_beam/coders/slow_coders_test.py",> line 41, in test_using_slow_impl
import apache_beam.coders.stream
AssertionError: ImportError not raised
----------------------------------------------------------------------
Ran 1551 tests in 894.758s
FAILED (failures=1, errors=1, skipped=42)
Test failed: <unittest.runner.TextTestResult run=1551 errors=1 failures=1>
error: Test failed: <unittest.runner.TextTestResult run=1551 errors=1 failures=1>
ERROR: InvocationError: '<https://builds.apache.org/job/beam_PostCommit_Python_Verify/ws/src/sdks/python/target/.tox/py27gcp/bin/python> setup.py test'
___________________________________ summary ____________________________________
ERROR: cover: commands failed
docs: commands succeeded
lint: commands succeeded
ERROR: py27: commands failed
ERROR: py27cython: commands failed
ERROR: py27gcp: commands failed
Build step 'Execute shell' marked build as failure
Not sending mail to unregistered user ccy@google.com
Not sending mail to unregistered user apilloud@google.com
Not sending mail to unregistered user dcavazos@google.com
Not sending mail to unregistered user cclauss@bluewin.ch
Jenkins build is back to normal : beam_PostCommit_Python_Verify
#4268
Posted by Apache Jenkins Server <je...@builds.apache.org>.
See <https://builds.apache.org/job/beam_PostCommit_Python_Verify/4268/display/redirect>
Build failed in Jenkins: beam_PostCommit_Python_Verify #4267
Posted by Apache Jenkins Server <je...@builds.apache.org>.
See <https://builds.apache.org/job/beam_PostCommit_Python_Verify/4267/display/redirect?page=changes>
Changes:
[kirpichov] Updates BigQuery dependency version
[kirpichov] Updates BigQuery documentation
------------------------------------------
[...truncated 1.40 MB...]
spec {
urn: "beam:coder:varint:v1"
}
}
}
}
coders {
key: "ref_Coder_WindowedValueCoder_1"
value {
spec {
spec {
urn: "beam:coder:windowed_value:v1"
}
}
component_coder_ids: "ref_Coder_TupleCoder_2"
component_coder_ids: "ref_Coder_GlobalWindowCoder_5"
}
}
coders {
key: "ref_Coder_WindowedValueCoder_11"
value {
spec {
spec {
urn: "beam:coder:windowed_value:v1"
}
}
component_coder_ids: "ref_Coder_TupleCoder_12"
component_coder_ids: "ref_Coder_GlobalWindowCoder_5"
}
}
coders {
key: "ref_Coder_WindowedValueCoder_13"
value {
spec {
spec {
urn: "beam:coder:windowed_value:v1"
}
}
component_coder_ids: "ref_Coder_TupleCoder_14"
component_coder_ids: "ref_Coder_GlobalWindowCoder_5"
}
}
coders {
key: "ref_Coder_WindowedValueCoder_15"
value {
spec {
spec {
urn: "beam:coder:windowed_value:v1"
}
}
component_coder_ids: "ref_Coder_TupleCoder_16"
component_coder_ids: "ref_Coder_GlobalWindowCoder_5"
}
}
coders {
key: "ref_Coder_WindowedValueCoder_1_bytes"
value {
spec {
spec {
urn: "beam:coder:windowed_value:v1"
}
}
component_coder_ids: "ref_Coder_TupleCoder_2_bytes"
component_coder_ids: "ref_Coder_GlobalWindowCoder_5"
}
}
coders {
key: "ref_Coder_WindowedValueCoder_1_len_prefix"
value {
spec {
spec {
urn: "beam:coder:windowed_value:v1"
}
}
component_coder_ids: "ref_Coder_TupleCoder_2_len_prefix"
component_coder_ids: "ref_Coder_GlobalWindowCoder_5"
}
}
coders {
key: "ref_Coder_WindowedValueCoder_6"
value {
spec {
spec {
urn: "beam:coder:windowed_value:v1"
}
}
component_coder_ids: "ref_Coder_FastPrimitivesCoder_3"
component_coder_ids: "ref_Coder_GlobalWindowCoder_5"
}
}
coders {
key: "ref_Coder_WindowedValueCoder_7"
value {
spec {
spec {
urn: "beam:coder:windowed_value:v1"
}
}
component_coder_ids: "ref_Coder_VarIntCoder_8"
component_coder_ids: "ref_Coder_GlobalWindowCoder_5"
}
}
coders {
key: "ref_Coder_WindowedValueCoder_9"
value {
spec {
spec {
urn: "beam:coder:windowed_value:v1"
}
}
component_coder_ids: "ref_Coder_TupleCoder_10"
component_coder_ids: "ref_Coder_GlobalWindowCoder_5"
}
}
coders {
key: "ref_Coder_WindowedValueCoder_9_bytes"
value {
spec {
spec {
urn: "beam:coder:windowed_value:v1"
}
}
component_coder_ids: "ref_Coder_TupleCoder_10_bytes"
component_coder_ids: "ref_Coder_GlobalWindowCoder_5"
}
}
coders {
key: "ref_Coder_WindowedValueCoder_9_len_prefix"
value {
spec {
spec {
urn: "beam:coder:windowed_value:v1"
}
}
component_coder_ids: "ref_Coder_TupleCoder_10_len_prefix"
component_coder_ids: "ref_Coder_GlobalWindowCoder_5"
}
}
}
}
root: DEBUG: CONTROL RESPONSE instruction_id: "control_4"
register {
}
root: DEBUG: CONTROL REQUEST instruction_id: "bundle_1212"
process_bundle {
process_bundle_descriptor_reference: "3"
}
root: INFO: start <DoOperation assert_that/Match output_tags=['out']>
root: INFO: start <DoOperation assert_that/Unkey output_tags=['out']>
root: INFO: start <DoOperation assert_that/Group/Map(_merge_tagged_vals_under_key) output_tags=['out']>
root: INFO: start <DataInputOperation assert_that/Group/GroupByKey/Read receivers=[ConsumerSet[assert_that/Group/GroupByKey/Read.out0, coder=WindowedValueCoder[TupleCoder[LengthPrefixCoder[FastPrimitivesCoder], IterableCoder[LengthPrefixCoder[FastPrimitivesCoder]]]], len(consumers)=1]]>
root: INFO: finish <DataInputOperation assert_that/Group/GroupByKey/Read receivers=[ConsumerSet[assert_that/Group/GroupByKey/Read.out0, coder=WindowedValueCoder[TupleCoder[LengthPrefixCoder[FastPrimitivesCoder], IterableCoder[LengthPrefixCoder[FastPrimitivesCoder]]]], len(consumers)=1]]>
root: INFO: finish <DoOperation assert_that/Group/Map(_merge_tagged_vals_under_key) output_tags=['out'], receivers=[ConsumerSet[assert_that/Group/Map(_merge_tagged_vals_under_key).out0, coder=WindowedValueCoder[FastPrimitivesCoder], len(consumers)=1]]>
root: INFO: finish <DoOperation assert_that/Unkey output_tags=['out'], receivers=[ConsumerSet[assert_that/Unkey.out0, coder=WindowedValueCoder[FastPrimitivesCoder], len(consumers)=1]]>
root: INFO: finish <DoOperation assert_that/Match output_tags=['out'], receivers=[ConsumerSet[assert_that/Match.out0, coder=WindowedValueCoder[FastPrimitivesCoder], len(consumers)=0]]>
root: DEBUG: CONTROL RESPONSE instruction_id: "bundle_1212"
process_bundle {
metrics {
ptransforms {
key: "assert_that/Group/GroupByKey/Read"
value {
processed_elements {
measured {
output_element_counts {
key: "None"
value: 1
}
}
}
}
}
ptransforms {
key: "assert_that/Group/Map(_merge_tagged_vals_under_key)"
value {
processed_elements {
measured {
output_element_counts {
key: "None"
value: 1
}
}
}
}
}
ptransforms {
key: "assert_that/Match"
value {
processed_elements {
measured {
output_element_counts {
key: "None"
value: 1
}
}
}
}
}
ptransforms {
key: "assert_that/Unkey"
value {
processed_elements {
measured {
output_element_counts {
key: "None"
value: 1
}
}
}
}
}
}
}
root: DEBUG: Gather all output data from [].
root: DEBUG: Wait for the bundle to finish.
--------------------- >> end captured logging << ---------------------
======================================================================
FAIL: test_using_slow_impl (apache_beam.coders.slow_coders_test.SlowCoders)
----------------------------------------------------------------------
Traceback (most recent call last):
File "<https://builds.apache.org/job/beam_PostCommit_Python_Verify/ws/src/sdks/python/apache_beam/coders/slow_coders_test.py",> line 41, in test_using_slow_impl
import apache_beam.coders.stream
AssertionError: ImportError not raised
----------------------------------------------------------------------
Ran 1551 tests in 653.123s
FAILED (failures=1, errors=1, skipped=42)
Test failed: <unittest.runner.TextTestResult run=1551 errors=1 failures=1>
error: Test failed: <unittest.runner.TextTestResult run=1551 errors=1 failures=1>
ERROR: InvocationError: '<https://builds.apache.org/job/beam_PostCommit_Python_Verify/ws/src/sdks/python/target/.tox/py27gcp/bin/python> setup.py test'
___________________________________ summary ____________________________________
ERROR: cover: commands failed
docs: commands succeeded
lint: commands succeeded
ERROR: py27: commands failed
ERROR: py27cython: commands failed
ERROR: py27gcp: commands failed
Build step 'Execute shell' marked build as failure
Not sending mail to unregistered user kirpichov@google.com
Not sending mail to unregistered user cclauss@bluewin.ch
Not sending mail to unregistered user github@alasdairhodge.co.uk
Not sending mail to unregistered user apilloud@google.com
Not sending mail to unregistered user ccy@google.com
Not sending mail to unregistered user dcavazos@google.com
Build failed in Jenkins: beam_PostCommit_Python_Verify #4266
Posted by Apache Jenkins Server <je...@builds.apache.org>.
See <https://builds.apache.org/job/beam_PostCommit_Python_Verify/4266/display/redirect>
------------------------------------------
[...truncated 1.40 MB...]
spec {
spec {
urn: "beam:coder:varint:v1"
}
}
}
}
coders {
key: "ref_Coder_WindowedValueCoder_1"
value {
spec {
spec {
urn: "beam:coder:windowed_value:v1"
}
}
component_coder_ids: "ref_Coder_TupleCoder_2"
component_coder_ids: "ref_Coder_GlobalWindowCoder_5"
}
}
coders {
key: "ref_Coder_WindowedValueCoder_11"
value {
spec {
spec {
urn: "beam:coder:windowed_value:v1"
}
}
component_coder_ids: "ref_Coder_TupleCoder_12"
component_coder_ids: "ref_Coder_GlobalWindowCoder_5"
}
}
coders {
key: "ref_Coder_WindowedValueCoder_13"
value {
spec {
spec {
urn: "beam:coder:windowed_value:v1"
}
}
component_coder_ids: "ref_Coder_TupleCoder_14"
component_coder_ids: "ref_Coder_GlobalWindowCoder_5"
}
}
coders {
key: "ref_Coder_WindowedValueCoder_15"
value {
spec {
spec {
urn: "beam:coder:windowed_value:v1"
}
}
component_coder_ids: "ref_Coder_TupleCoder_16"
component_coder_ids: "ref_Coder_GlobalWindowCoder_5"
}
}
coders {
key: "ref_Coder_WindowedValueCoder_1_bytes"
value {
spec {
spec {
urn: "beam:coder:windowed_value:v1"
}
}
component_coder_ids: "ref_Coder_TupleCoder_2_bytes"
component_coder_ids: "ref_Coder_GlobalWindowCoder_5"
}
}
coders {
key: "ref_Coder_WindowedValueCoder_1_len_prefix"
value {
spec {
spec {
urn: "beam:coder:windowed_value:v1"
}
}
component_coder_ids: "ref_Coder_TupleCoder_2_len_prefix"
component_coder_ids: "ref_Coder_GlobalWindowCoder_5"
}
}
coders {
key: "ref_Coder_WindowedValueCoder_6"
value {
spec {
spec {
urn: "beam:coder:windowed_value:v1"
}
}
component_coder_ids: "ref_Coder_FastPrimitivesCoder_3"
component_coder_ids: "ref_Coder_GlobalWindowCoder_5"
}
}
coders {
key: "ref_Coder_WindowedValueCoder_7"
value {
spec {
spec {
urn: "beam:coder:windowed_value:v1"
}
}
component_coder_ids: "ref_Coder_VarIntCoder_8"
component_coder_ids: "ref_Coder_GlobalWindowCoder_5"
}
}
coders {
key: "ref_Coder_WindowedValueCoder_9"
value {
spec {
spec {
urn: "beam:coder:windowed_value:v1"
}
}
component_coder_ids: "ref_Coder_TupleCoder_10"
component_coder_ids: "ref_Coder_GlobalWindowCoder_5"
}
}
coders {
key: "ref_Coder_WindowedValueCoder_9_bytes"
value {
spec {
spec {
urn: "beam:coder:windowed_value:v1"
}
}
component_coder_ids: "ref_Coder_TupleCoder_10_bytes"
component_coder_ids: "ref_Coder_GlobalWindowCoder_5"
}
}
coders {
key: "ref_Coder_WindowedValueCoder_9_len_prefix"
value {
spec {
spec {
urn: "beam:coder:windowed_value:v1"
}
}
component_coder_ids: "ref_Coder_TupleCoder_10_len_prefix"
component_coder_ids: "ref_Coder_GlobalWindowCoder_5"
}
}
}
}
root: DEBUG: CONTROL RESPONSE instruction_id: "control_4"
register {
}
root: DEBUG: CONTROL REQUEST instruction_id: "bundle_1211"
process_bundle {
process_bundle_descriptor_reference: "3"
}
root: INFO: start <DoOperation assert_that/Match output_tags=['out']>
root: INFO: start <DoOperation assert_that/Unkey output_tags=['out']>
root: INFO: start <DoOperation assert_that/Group/Map(_merge_tagged_vals_under_key) output_tags=['out']>
root: INFO: start <DataInputOperation assert_that/Group/GroupByKey/Read receivers=[ConsumerSet[assert_that/Group/GroupByKey/Read.out0, coder=WindowedValueCoder[TupleCoder[LengthPrefixCoder[FastPrimitivesCoder], IterableCoder[LengthPrefixCoder[FastPrimitivesCoder]]]], len(consumers)=1]]>
root: INFO: finish <DataInputOperation assert_that/Group/GroupByKey/Read receivers=[ConsumerSet[assert_that/Group/GroupByKey/Read.out0, coder=WindowedValueCoder[TupleCoder[LengthPrefixCoder[FastPrimitivesCoder], IterableCoder[LengthPrefixCoder[FastPrimitivesCoder]]]], len(consumers)=1]]>
root: INFO: finish <DoOperation assert_that/Group/Map(_merge_tagged_vals_under_key) output_tags=['out'], receivers=[ConsumerSet[assert_that/Group/Map(_merge_tagged_vals_under_key).out0, coder=WindowedValueCoder[FastPrimitivesCoder], len(consumers)=1]]>
root: INFO: finish <DoOperation assert_that/Unkey output_tags=['out'], receivers=[ConsumerSet[assert_that/Unkey.out0, coder=WindowedValueCoder[FastPrimitivesCoder], len(consumers)=1]]>
root: INFO: finish <DoOperation assert_that/Match output_tags=['out'], receivers=[ConsumerSet[assert_that/Match.out0, coder=WindowedValueCoder[FastPrimitivesCoder], len(consumers)=0]]>
root: DEBUG: CONTROL RESPONSE instruction_id: "bundle_1211"
process_bundle {
metrics {
ptransforms {
key: "assert_that/Group/GroupByKey/Read"
value {
processed_elements {
measured {
output_element_counts {
key: "None"
value: 1
}
}
}
}
}
ptransforms {
key: "assert_that/Group/Map(_merge_tagged_vals_under_key)"
value {
processed_elements {
measured {
output_element_counts {
key: "None"
value: 1
}
}
}
}
}
ptransforms {
key: "assert_that/Match"
value {
processed_elements {
measured {
output_element_counts {
key: "None"
value: 1
}
}
}
}
}
ptransforms {
key: "assert_that/Unkey"
value {
processed_elements {
measured {
output_element_counts {
key: "None"
value: 1
}
}
}
}
}
}
}
root: DEBUG: Gather all output data from [].
root: DEBUG: Wait for the bundle to finish.
--------------------- >> end captured logging << ---------------------
======================================================================
FAIL: test_using_slow_impl (apache_beam.coders.slow_coders_test.SlowCoders)
----------------------------------------------------------------------
Traceback (most recent call last):
File "<https://builds.apache.org/job/beam_PostCommit_Python_Verify/ws/src/sdks/python/apache_beam/coders/slow_coders_test.py",> line 41, in test_using_slow_impl
import apache_beam.coders.stream
AssertionError: ImportError not raised
----------------------------------------------------------------------
Ran 1551 tests in 663.292s
FAILED (failures=1, errors=1, skipped=42)
Test failed: <unittest.runner.TextTestResult run=1551 errors=1 failures=1>
error: Test failed: <unittest.runner.TextTestResult run=1551 errors=1 failures=1>
ERROR: InvocationError: '<https://builds.apache.org/job/beam_PostCommit_Python_Verify/ws/src/sdks/python/target/.tox/py27gcp/bin/python> setup.py test'
___________________________________ summary ____________________________________
ERROR: cover: commands failed
docs: commands succeeded
lint: commands succeeded
ERROR: py27: commands failed
ERROR: py27cython: commands failed
ERROR: py27gcp: commands failed
Build step 'Execute shell' marked build as failure
Not sending mail to unregistered user cclauss@bluewin.ch
Not sending mail to unregistered user github@alasdairhodge.co.uk
Not sending mail to unregistered user apilloud@google.com
Not sending mail to unregistered user ccy@google.com
Not sending mail to unregistered user dcavazos@google.com
Build failed in Jenkins: beam_PostCommit_Python_Verify #4265
Posted by Apache Jenkins Server <je...@builds.apache.org>.
See <https://builds.apache.org/job/beam_PostCommit_Python_Verify/4265/display/redirect>
------------------------------------------
[...truncated 1.40 MB...]
spec {
spec {
urn: "beam:coder:varint:v1"
}
}
}
}
coders {
key: "ref_Coder_WindowedValueCoder_1"
value {
spec {
spec {
urn: "beam:coder:windowed_value:v1"
}
}
component_coder_ids: "ref_Coder_TupleCoder_2"
component_coder_ids: "ref_Coder_GlobalWindowCoder_5"
}
}
coders {
key: "ref_Coder_WindowedValueCoder_11"
value {
spec {
spec {
urn: "beam:coder:windowed_value:v1"
}
}
component_coder_ids: "ref_Coder_TupleCoder_12"
component_coder_ids: "ref_Coder_GlobalWindowCoder_5"
}
}
coders {
key: "ref_Coder_WindowedValueCoder_13"
value {
spec {
spec {
urn: "beam:coder:windowed_value:v1"
}
}
component_coder_ids: "ref_Coder_TupleCoder_14"
component_coder_ids: "ref_Coder_GlobalWindowCoder_5"
}
}
coders {
key: "ref_Coder_WindowedValueCoder_15"
value {
spec {
spec {
urn: "beam:coder:windowed_value:v1"
}
}
component_coder_ids: "ref_Coder_TupleCoder_16"
component_coder_ids: "ref_Coder_GlobalWindowCoder_5"
}
}
coders {
key: "ref_Coder_WindowedValueCoder_1_bytes"
value {
spec {
spec {
urn: "beam:coder:windowed_value:v1"
}
}
component_coder_ids: "ref_Coder_TupleCoder_2_bytes"
component_coder_ids: "ref_Coder_GlobalWindowCoder_5"
}
}
coders {
key: "ref_Coder_WindowedValueCoder_1_len_prefix"
value {
spec {
spec {
urn: "beam:coder:windowed_value:v1"
}
}
component_coder_ids: "ref_Coder_TupleCoder_2_len_prefix"
component_coder_ids: "ref_Coder_GlobalWindowCoder_5"
}
}
coders {
key: "ref_Coder_WindowedValueCoder_6"
value {
spec {
spec {
urn: "beam:coder:windowed_value:v1"
}
}
component_coder_ids: "ref_Coder_FastPrimitivesCoder_3"
component_coder_ids: "ref_Coder_GlobalWindowCoder_5"
}
}
coders {
key: "ref_Coder_WindowedValueCoder_7"
value {
spec {
spec {
urn: "beam:coder:windowed_value:v1"
}
}
component_coder_ids: "ref_Coder_VarIntCoder_8"
component_coder_ids: "ref_Coder_GlobalWindowCoder_5"
}
}
coders {
key: "ref_Coder_WindowedValueCoder_9"
value {
spec {
spec {
urn: "beam:coder:windowed_value:v1"
}
}
component_coder_ids: "ref_Coder_TupleCoder_10"
component_coder_ids: "ref_Coder_GlobalWindowCoder_5"
}
}
coders {
key: "ref_Coder_WindowedValueCoder_9_bytes"
value {
spec {
spec {
urn: "beam:coder:windowed_value:v1"
}
}
component_coder_ids: "ref_Coder_TupleCoder_10_bytes"
component_coder_ids: "ref_Coder_GlobalWindowCoder_5"
}
}
coders {
key: "ref_Coder_WindowedValueCoder_9_len_prefix"
value {
spec {
spec {
urn: "beam:coder:windowed_value:v1"
}
}
component_coder_ids: "ref_Coder_TupleCoder_10_len_prefix"
component_coder_ids: "ref_Coder_GlobalWindowCoder_5"
}
}
}
}
root: DEBUG: CONTROL RESPONSE instruction_id: "control_4"
register {
}
root: DEBUG: CONTROL REQUEST instruction_id: "bundle_1211"
process_bundle {
process_bundle_descriptor_reference: "3"
}
root: INFO: start <DoOperation assert_that/Match output_tags=['out']>
root: INFO: start <DoOperation assert_that/Unkey output_tags=['out']>
root: INFO: start <DoOperation assert_that/Group/Map(_merge_tagged_vals_under_key) output_tags=['out']>
root: INFO: start <DataInputOperation assert_that/Group/GroupByKey/Read receivers=[ConsumerSet[assert_that/Group/GroupByKey/Read.out0, coder=WindowedValueCoder[TupleCoder[LengthPrefixCoder[FastPrimitivesCoder], IterableCoder[LengthPrefixCoder[FastPrimitivesCoder]]]], len(consumers)=1]]>
root: INFO: finish <DataInputOperation assert_that/Group/GroupByKey/Read receivers=[ConsumerSet[assert_that/Group/GroupByKey/Read.out0, coder=WindowedValueCoder[TupleCoder[LengthPrefixCoder[FastPrimitivesCoder], IterableCoder[LengthPrefixCoder[FastPrimitivesCoder]]]], len(consumers)=1]]>
root: INFO: finish <DoOperation assert_that/Group/Map(_merge_tagged_vals_under_key) output_tags=['out'], receivers=[ConsumerSet[assert_that/Group/Map(_merge_tagged_vals_under_key).out0, coder=WindowedValueCoder[FastPrimitivesCoder], len(consumers)=1]]>
root: INFO: finish <DoOperation assert_that/Unkey output_tags=['out'], receivers=[ConsumerSet[assert_that/Unkey.out0, coder=WindowedValueCoder[FastPrimitivesCoder], len(consumers)=1]]>
root: INFO: finish <DoOperation assert_that/Match output_tags=['out'], receivers=[ConsumerSet[assert_that/Match.out0, coder=WindowedValueCoder[FastPrimitivesCoder], len(consumers)=0]]>
root: DEBUG: CONTROL RESPONSE instruction_id: "bundle_1211"
process_bundle {
metrics {
ptransforms {
key: "assert_that/Group/GroupByKey/Read"
value {
processed_elements {
measured {
output_element_counts {
key: "None"
value: 1
}
}
}
}
}
ptransforms {
key: "assert_that/Group/Map(_merge_tagged_vals_under_key)"
value {
processed_elements {
measured {
output_element_counts {
key: "None"
value: 1
}
}
}
}
}
ptransforms {
key: "assert_that/Match"
value {
processed_elements {
measured {
output_element_counts {
key: "None"
value: 1
}
}
}
}
}
ptransforms {
key: "assert_that/Unkey"
value {
processed_elements {
measured {
output_element_counts {
key: "None"
value: 1
}
}
}
}
}
}
}
root: DEBUG: Gather all output data from [].
root: DEBUG: Wait for the bundle to finish.
--------------------- >> end captured logging << ---------------------
======================================================================
FAIL: test_using_slow_impl (apache_beam.coders.slow_coders_test.SlowCoders)
----------------------------------------------------------------------
Traceback (most recent call last):
File "<https://builds.apache.org/job/beam_PostCommit_Python_Verify/ws/src/sdks/python/apache_beam/coders/slow_coders_test.py",> line 41, in test_using_slow_impl
import apache_beam.coders.stream
AssertionError: ImportError not raised
----------------------------------------------------------------------
Ran 1551 tests in 1016.472s
FAILED (failures=1, errors=1, skipped=42)
Test failed: <unittest.runner.TextTestResult run=1551 errors=1 failures=1>
error: Test failed: <unittest.runner.TextTestResult run=1551 errors=1 failures=1>
ERROR: InvocationError: '<https://builds.apache.org/job/beam_PostCommit_Python_Verify/ws/src/sdks/python/target/.tox/py27gcp/bin/python> setup.py test'
___________________________________ summary ____________________________________
ERROR: cover: commands failed
docs: commands succeeded
lint: commands succeeded
ERROR: py27: commands failed
ERROR: py27cython: commands failed
ERROR: py27gcp: commands failed
Build step 'Execute shell' marked build as failure
Not sending mail to unregistered user cclauss@bluewin.ch
Not sending mail to unregistered user github@alasdairhodge.co.uk
Not sending mail to unregistered user apilloud@google.com
Not sending mail to unregistered user ccy@google.com
Not sending mail to unregistered user dcavazos@google.com
Build failed in Jenkins: beam_PostCommit_Python_Verify #4264
Posted by Apache Jenkins Server <je...@builds.apache.org>.
See <https://builds.apache.org/job/beam_PostCommit_Python_Verify/4264/display/redirect>
------------------------------------------
[...truncated 1.40 MB...]
spec {
spec {
urn: "beam:coder:varint:v1"
}
}
}
}
coders {
key: "ref_Coder_WindowedValueCoder_1"
value {
spec {
spec {
urn: "beam:coder:windowed_value:v1"
}
}
component_coder_ids: "ref_Coder_TupleCoder_2"
component_coder_ids: "ref_Coder_GlobalWindowCoder_5"
}
}
coders {
key: "ref_Coder_WindowedValueCoder_10"
value {
spec {
spec {
urn: "beam:coder:windowed_value:v1"
}
}
component_coder_ids: "ref_Coder_TupleCoder_4"
component_coder_ids: "ref_Coder_GlobalWindowCoder_5"
}
}
coders {
key: "ref_Coder_WindowedValueCoder_10_bytes"
value {
spec {
spec {
urn: "beam:coder:windowed_value:v1"
}
}
component_coder_ids: "ref_Coder_TupleCoder_4_bytes"
component_coder_ids: "ref_Coder_GlobalWindowCoder_5"
}
}
coders {
key: "ref_Coder_WindowedValueCoder_10_len_prefix"
value {
spec {
spec {
urn: "beam:coder:windowed_value:v1"
}
}
component_coder_ids: "ref_Coder_TupleCoder_4_len_prefix"
component_coder_ids: "ref_Coder_GlobalWindowCoder_5"
}
}
coders {
key: "ref_Coder_WindowedValueCoder_11"
value {
spec {
spec {
urn: "beam:coder:windowed_value:v1"
}
}
component_coder_ids: "ref_Coder_TupleCoder_12"
component_coder_ids: "ref_Coder_GlobalWindowCoder_5"
}
}
coders {
key: "ref_Coder_WindowedValueCoder_11_bytes"
value {
spec {
spec {
urn: "beam:coder:windowed_value:v1"
}
}
component_coder_ids: "ref_Coder_TupleCoder_12_bytes"
component_coder_ids: "ref_Coder_GlobalWindowCoder_5"
}
}
coders {
key: "ref_Coder_WindowedValueCoder_11_len_prefix"
value {
spec {
spec {
urn: "beam:coder:windowed_value:v1"
}
}
component_coder_ids: "ref_Coder_TupleCoder_12_len_prefix"
component_coder_ids: "ref_Coder_GlobalWindowCoder_5"
}
}
coders {
key: "ref_Coder_WindowedValueCoder_14"
value {
spec {
spec {
urn: "beam:coder:windowed_value:v1"
}
}
component_coder_ids: "ref_Coder_FastPrimitivesCoder_3"
component_coder_ids: "ref_Coder_GlobalWindowCoder_5"
}
}
coders {
key: "ref_Coder_WindowedValueCoder_15"
value {
spec {
spec {
urn: "beam:coder:windowed_value:v1"
}
}
component_coder_ids: "ref_Coder_VarIntCoder_9"
component_coder_ids: "ref_Coder_GlobalWindowCoder_5"
}
}
coders {
key: "ref_Coder_WindowedValueCoder_16"
value {
spec {
spec {
urn: "beam:coder:windowed_value:v1"
}
}
component_coder_ids: "ref_Coder_TupleCoder_8"
component_coder_ids: "ref_Coder_GlobalWindowCoder_5"
}
}
coders {
key: "ref_Coder_WindowedValueCoder_6"
value {
spec {
spec {
urn: "beam:coder:windowed_value:v1"
}
}
component_coder_ids: "ref_Coder_TupleCoder_7"
component_coder_ids: "ref_Coder_GlobalWindowCoder_5"
}
}
}
}
root: DEBUG: CONTROL RESPONSE instruction_id: "control_4"
register {
}
root: DEBUG: CONTROL REQUEST instruction_id: "bundle_1210"
process_bundle {
process_bundle_descriptor_reference: "3"
}
root: INFO: start <DoOperation assert_that/Match output_tags=['out']>
root: INFO: start <DoOperation assert_that/Unkey output_tags=['out']>
root: INFO: start <DoOperation assert_that/Group/Map(_merge_tagged_vals_under_key) output_tags=['out']>
root: INFO: start <DataInputOperation assert_that/Group/GroupByKey/Read receivers=[ConsumerSet[assert_that/Group/GroupByKey/Read.out0, coder=WindowedValueCoder[TupleCoder[LengthPrefixCoder[FastPrimitivesCoder], IterableCoder[LengthPrefixCoder[FastPrimitivesCoder]]]], len(consumers)=1]]>
root: INFO: finish <DataInputOperation assert_that/Group/GroupByKey/Read receivers=[ConsumerSet[assert_that/Group/GroupByKey/Read.out0, coder=WindowedValueCoder[TupleCoder[LengthPrefixCoder[FastPrimitivesCoder], IterableCoder[LengthPrefixCoder[FastPrimitivesCoder]]]], len(consumers)=1]]>
root: INFO: finish <DoOperation assert_that/Group/Map(_merge_tagged_vals_under_key) output_tags=['out'], receivers=[ConsumerSet[assert_that/Group/Map(_merge_tagged_vals_under_key).out0, coder=WindowedValueCoder[FastPrimitivesCoder], len(consumers)=1]]>
root: INFO: finish <DoOperation assert_that/Unkey output_tags=['out'], receivers=[ConsumerSet[assert_that/Unkey.out0, coder=WindowedValueCoder[FastPrimitivesCoder], len(consumers)=1]]>
root: INFO: finish <DoOperation assert_that/Match output_tags=['out'], receivers=[ConsumerSet[assert_that/Match.out0, coder=WindowedValueCoder[FastPrimitivesCoder], len(consumers)=0]]>
root: DEBUG: CONTROL RESPONSE instruction_id: "bundle_1210"
process_bundle {
metrics {
ptransforms {
key: "assert_that/Group/GroupByKey/Read"
value {
processed_elements {
measured {
output_element_counts {
key: "None"
value: 1
}
}
}
}
}
ptransforms {
key: "assert_that/Group/Map(_merge_tagged_vals_under_key)"
value {
processed_elements {
measured {
output_element_counts {
key: "None"
value: 1
}
}
}
}
}
ptransforms {
key: "assert_that/Match"
value {
processed_elements {
measured {
output_element_counts {
key: "None"
value: 1
}
}
}
}
}
ptransforms {
key: "assert_that/Unkey"
value {
processed_elements {
measured {
output_element_counts {
key: "None"
value: 1
}
}
}
}
}
}
}
root: DEBUG: Gather all output data from [].
root: DEBUG: Wait for the bundle to finish.
--------------------- >> end captured logging << ---------------------
======================================================================
FAIL: test_using_slow_impl (apache_beam.coders.slow_coders_test.SlowCoders)
----------------------------------------------------------------------
Traceback (most recent call last):
File "<https://builds.apache.org/job/beam_PostCommit_Python_Verify/ws/src/sdks/python/apache_beam/coders/slow_coders_test.py",> line 41, in test_using_slow_impl
import apache_beam.coders.stream
AssertionError: ImportError not raised
----------------------------------------------------------------------
Ran 1551 tests in 870.663s
FAILED (failures=1, errors=1, skipped=42)
Test failed: <unittest.runner.TextTestResult run=1551 errors=1 failures=1>
error: Test failed: <unittest.runner.TextTestResult run=1551 errors=1 failures=1>
ERROR: InvocationError: '<https://builds.apache.org/job/beam_PostCommit_Python_Verify/ws/src/sdks/python/target/.tox/py27gcp/bin/python> setup.py test'
___________________________________ summary ____________________________________
ERROR: cover: commands failed
docs: commands succeeded
lint: commands succeeded
ERROR: py27: commands failed
ERROR: py27cython: commands failed
ERROR: py27gcp: commands failed
Build step 'Execute shell' marked build as failure
Not sending mail to unregistered user cclauss@bluewin.ch
Not sending mail to unregistered user github@alasdairhodge.co.uk
Not sending mail to unregistered user apilloud@google.com
Not sending mail to unregistered user ccy@google.com
Not sending mail to unregistered user dcavazos@google.com
Build failed in Jenkins: beam_PostCommit_Python_Verify #4263
Posted by Apache Jenkins Server <je...@builds.apache.org>.
See <https://builds.apache.org/job/beam_PostCommit_Python_Verify/4263/display/redirect?page=changes>
Changes:
[github] Updates javadocs of Setup and Teardown
------------------------------------------
[...truncated 1.40 MB...]
spec {
spec {
urn: "beam:coder:varint:v1"
}
}
}
}
coders {
key: "ref_Coder_WindowedValueCoder_1"
value {
spec {
spec {
urn: "beam:coder:windowed_value:v1"
}
}
component_coder_ids: "ref_Coder_TupleCoder_2"
component_coder_ids: "ref_Coder_GlobalWindowCoder_5"
}
}
coders {
key: "ref_Coder_WindowedValueCoder_11"
value {
spec {
spec {
urn: "beam:coder:windowed_value:v1"
}
}
component_coder_ids: "ref_Coder_TupleCoder_12"
component_coder_ids: "ref_Coder_GlobalWindowCoder_5"
}
}
coders {
key: "ref_Coder_WindowedValueCoder_13"
value {
spec {
spec {
urn: "beam:coder:windowed_value:v1"
}
}
component_coder_ids: "ref_Coder_TupleCoder_14"
component_coder_ids: "ref_Coder_GlobalWindowCoder_5"
}
}
coders {
key: "ref_Coder_WindowedValueCoder_15"
value {
spec {
spec {
urn: "beam:coder:windowed_value:v1"
}
}
component_coder_ids: "ref_Coder_TupleCoder_16"
component_coder_ids: "ref_Coder_GlobalWindowCoder_5"
}
}
coders {
key: "ref_Coder_WindowedValueCoder_1_bytes"
value {
spec {
spec {
urn: "beam:coder:windowed_value:v1"
}
}
component_coder_ids: "ref_Coder_TupleCoder_2_bytes"
component_coder_ids: "ref_Coder_GlobalWindowCoder_5"
}
}
coders {
key: "ref_Coder_WindowedValueCoder_1_len_prefix"
value {
spec {
spec {
urn: "beam:coder:windowed_value:v1"
}
}
component_coder_ids: "ref_Coder_TupleCoder_2_len_prefix"
component_coder_ids: "ref_Coder_GlobalWindowCoder_5"
}
}
coders {
key: "ref_Coder_WindowedValueCoder_6"
value {
spec {
spec {
urn: "beam:coder:windowed_value:v1"
}
}
component_coder_ids: "ref_Coder_FastPrimitivesCoder_3"
component_coder_ids: "ref_Coder_GlobalWindowCoder_5"
}
}
coders {
key: "ref_Coder_WindowedValueCoder_7"
value {
spec {
spec {
urn: "beam:coder:windowed_value:v1"
}
}
component_coder_ids: "ref_Coder_VarIntCoder_8"
component_coder_ids: "ref_Coder_GlobalWindowCoder_5"
}
}
coders {
key: "ref_Coder_WindowedValueCoder_9"
value {
spec {
spec {
urn: "beam:coder:windowed_value:v1"
}
}
component_coder_ids: "ref_Coder_TupleCoder_10"
component_coder_ids: "ref_Coder_GlobalWindowCoder_5"
}
}
coders {
key: "ref_Coder_WindowedValueCoder_9_bytes"
value {
spec {
spec {
urn: "beam:coder:windowed_value:v1"
}
}
component_coder_ids: "ref_Coder_TupleCoder_10_bytes"
component_coder_ids: "ref_Coder_GlobalWindowCoder_5"
}
}
coders {
key: "ref_Coder_WindowedValueCoder_9_len_prefix"
value {
spec {
spec {
urn: "beam:coder:windowed_value:v1"
}
}
component_coder_ids: "ref_Coder_TupleCoder_10_len_prefix"
component_coder_ids: "ref_Coder_GlobalWindowCoder_5"
}
}
}
}
root: DEBUG: CONTROL RESPONSE instruction_id: "control_4"
register {
}
root: DEBUG: CONTROL REQUEST instruction_id: "bundle_1210"
process_bundle {
process_bundle_descriptor_reference: "3"
}
root: INFO: start <DoOperation assert_that/Match output_tags=['out']>
root: INFO: start <DoOperation assert_that/Unkey output_tags=['out']>
root: INFO: start <DoOperation assert_that/Group/Map(_merge_tagged_vals_under_key) output_tags=['out']>
root: INFO: start <DataInputOperation assert_that/Group/GroupByKey/Read receivers=[ConsumerSet[assert_that/Group/GroupByKey/Read.out0, coder=WindowedValueCoder[TupleCoder[LengthPrefixCoder[FastPrimitivesCoder], IterableCoder[LengthPrefixCoder[FastPrimitivesCoder]]]], len(consumers)=1]]>
root: INFO: finish <DataInputOperation assert_that/Group/GroupByKey/Read receivers=[ConsumerSet[assert_that/Group/GroupByKey/Read.out0, coder=WindowedValueCoder[TupleCoder[LengthPrefixCoder[FastPrimitivesCoder], IterableCoder[LengthPrefixCoder[FastPrimitivesCoder]]]], len(consumers)=1]]>
root: INFO: finish <DoOperation assert_that/Group/Map(_merge_tagged_vals_under_key) output_tags=['out'], receivers=[ConsumerSet[assert_that/Group/Map(_merge_tagged_vals_under_key).out0, coder=WindowedValueCoder[FastPrimitivesCoder], len(consumers)=1]]>
root: INFO: finish <DoOperation assert_that/Unkey output_tags=['out'], receivers=[ConsumerSet[assert_that/Unkey.out0, coder=WindowedValueCoder[FastPrimitivesCoder], len(consumers)=1]]>
root: INFO: finish <DoOperation assert_that/Match output_tags=['out'], receivers=[ConsumerSet[assert_that/Match.out0, coder=WindowedValueCoder[FastPrimitivesCoder], len(consumers)=0]]>
root: DEBUG: CONTROL RESPONSE instruction_id: "bundle_1210"
process_bundle {
metrics {
ptransforms {
key: "assert_that/Group/GroupByKey/Read"
value {
processed_elements {
measured {
output_element_counts {
key: "None"
value: 1
}
}
}
}
}
ptransforms {
key: "assert_that/Group/Map(_merge_tagged_vals_under_key)"
value {
processed_elements {
measured {
output_element_counts {
key: "None"
value: 1
}
}
}
}
}
ptransforms {
key: "assert_that/Match"
value {
processed_elements {
measured {
output_element_counts {
key: "None"
value: 1
}
}
}
}
}
ptransforms {
key: "assert_that/Unkey"
value {
processed_elements {
measured {
output_element_counts {
key: "None"
value: 1
}
}
}
}
}
}
}
root: DEBUG: Gather all output data from [].
root: DEBUG: Wait for the bundle to finish.
--------------------- >> end captured logging << ---------------------
======================================================================
FAIL: test_using_slow_impl (apache_beam.coders.slow_coders_test.SlowCoders)
----------------------------------------------------------------------
Traceback (most recent call last):
File "<https://builds.apache.org/job/beam_PostCommit_Python_Verify/ws/src/sdks/python/apache_beam/coders/slow_coders_test.py",> line 41, in test_using_slow_impl
import apache_beam.coders.stream
AssertionError: ImportError not raised
----------------------------------------------------------------------
Ran 1551 tests in 900.010s
FAILED (failures=1, errors=1, skipped=42)
Test failed: <unittest.runner.TextTestResult run=1551 errors=1 failures=1>
error: Test failed: <unittest.runner.TextTestResult run=1551 errors=1 failures=1>
ERROR: InvocationError: '<https://builds.apache.org/job/beam_PostCommit_Python_Verify/ws/src/sdks/python/target/.tox/py27gcp/bin/python> setup.py test'
___________________________________ summary ____________________________________
ERROR: cover: commands failed
docs: commands succeeded
lint: commands succeeded
ERROR: py27: commands failed
ERROR: py27cython: commands failed
ERROR: py27gcp: commands failed
Build step 'Execute shell' marked build as failure
Not sending mail to unregistered user cclauss@bluewin.ch
Not sending mail to unregistered user github@alasdairhodge.co.uk
Not sending mail to unregistered user apilloud@google.com
Not sending mail to unregistered user ccy@google.com
Not sending mail to unregistered user dcavazos@google.com
Build failed in Jenkins: beam_PostCommit_Python_Verify #4262
Posted by Apache Jenkins Server <je...@builds.apache.org>.
See <https://builds.apache.org/job/beam_PostCommit_Python_Verify/4262/display/redirect>
------------------------------------------
[...truncated 1.40 MB...]
value {
spec {
spec {
urn: "beam:coder:varint:v1"
}
}
}
}
coders {
key: "ref_Coder_WindowedValueCoder_1"
value {
spec {
spec {
urn: "beam:coder:windowed_value:v1"
}
}
component_coder_ids: "ref_Coder_TupleCoder_2"
component_coder_ids: "ref_Coder_GlobalWindowCoder_5"
}
}
coders {
key: "ref_Coder_WindowedValueCoder_11"
value {
spec {
spec {
urn: "beam:coder:windowed_value:v1"
}
}
component_coder_ids: "ref_Coder_TupleCoder_12"
component_coder_ids: "ref_Coder_GlobalWindowCoder_5"
}
}
coders {
key: "ref_Coder_WindowedValueCoder_13"
value {
spec {
spec {
urn: "beam:coder:windowed_value:v1"
}
}
component_coder_ids: "ref_Coder_TupleCoder_14"
component_coder_ids: "ref_Coder_GlobalWindowCoder_5"
}
}
coders {
key: "ref_Coder_WindowedValueCoder_15"
value {
spec {
spec {
urn: "beam:coder:windowed_value:v1"
}
}
component_coder_ids: "ref_Coder_TupleCoder_16"
component_coder_ids: "ref_Coder_GlobalWindowCoder_5"
}
}
coders {
key: "ref_Coder_WindowedValueCoder_1_bytes"
value {
spec {
spec {
urn: "beam:coder:windowed_value:v1"
}
}
component_coder_ids: "ref_Coder_TupleCoder_2_bytes"
component_coder_ids: "ref_Coder_GlobalWindowCoder_5"
}
}
coders {
key: "ref_Coder_WindowedValueCoder_1_len_prefix"
value {
spec {
spec {
urn: "beam:coder:windowed_value:v1"
}
}
component_coder_ids: "ref_Coder_TupleCoder_2_len_prefix"
component_coder_ids: "ref_Coder_GlobalWindowCoder_5"
}
}
coders {
key: "ref_Coder_WindowedValueCoder_6"
value {
spec {
spec {
urn: "beam:coder:windowed_value:v1"
}
}
component_coder_ids: "ref_Coder_FastPrimitivesCoder_3"
component_coder_ids: "ref_Coder_GlobalWindowCoder_5"
}
}
coders {
key: "ref_Coder_WindowedValueCoder_7"
value {
spec {
spec {
urn: "beam:coder:windowed_value:v1"
}
}
component_coder_ids: "ref_Coder_VarIntCoder_8"
component_coder_ids: "ref_Coder_GlobalWindowCoder_5"
}
}
coders {
key: "ref_Coder_WindowedValueCoder_9"
value {
spec {
spec {
urn: "beam:coder:windowed_value:v1"
}
}
component_coder_ids: "ref_Coder_TupleCoder_10"
component_coder_ids: "ref_Coder_GlobalWindowCoder_5"
}
}
coders {
key: "ref_Coder_WindowedValueCoder_9_bytes"
value {
spec {
spec {
urn: "beam:coder:windowed_value:v1"
}
}
component_coder_ids: "ref_Coder_TupleCoder_10_bytes"
component_coder_ids: "ref_Coder_GlobalWindowCoder_5"
}
}
coders {
key: "ref_Coder_WindowedValueCoder_9_len_prefix"
value {
spec {
spec {
urn: "beam:coder:windowed_value:v1"
}
}
component_coder_ids: "ref_Coder_TupleCoder_10_len_prefix"
component_coder_ids: "ref_Coder_GlobalWindowCoder_5"
}
}
}
}
root: DEBUG: CONTROL RESPONSE instruction_id: "control_4"
register {
}
root: DEBUG: CONTROL REQUEST instruction_id: "bundle_1212"
process_bundle {
process_bundle_descriptor_reference: "3"
}
root: INFO: start <DoOperation assert_that/Match output_tags=['out']>
root: INFO: start <DoOperation assert_that/Unkey output_tags=['out']>
root: INFO: start <DoOperation assert_that/Group/Map(_merge_tagged_vals_under_key) output_tags=['out']>
root: INFO: start <DataInputOperation assert_that/Group/GroupByKey/Read receivers=[ConsumerSet[assert_that/Group/GroupByKey/Read.out0, coder=WindowedValueCoder[TupleCoder[LengthPrefixCoder[FastPrimitivesCoder], IterableCoder[LengthPrefixCoder[FastPrimitivesCoder]]]], len(consumers)=1]]>
root: INFO: finish <DataInputOperation assert_that/Group/GroupByKey/Read receivers=[ConsumerSet[assert_that/Group/GroupByKey/Read.out0, coder=WindowedValueCoder[TupleCoder[LengthPrefixCoder[FastPrimitivesCoder], IterableCoder[LengthPrefixCoder[FastPrimitivesCoder]]]], len(consumers)=1]]>
root: INFO: finish <DoOperation assert_that/Group/Map(_merge_tagged_vals_under_key) output_tags=['out'], receivers=[ConsumerSet[assert_that/Group/Map(_merge_tagged_vals_under_key).out0, coder=WindowedValueCoder[FastPrimitivesCoder], len(consumers)=1]]>
root: INFO: finish <DoOperation assert_that/Unkey output_tags=['out'], receivers=[ConsumerSet[assert_that/Unkey.out0, coder=WindowedValueCoder[FastPrimitivesCoder], len(consumers)=1]]>
root: INFO: finish <DoOperation assert_that/Match output_tags=['out'], receivers=[ConsumerSet[assert_that/Match.out0, coder=WindowedValueCoder[FastPrimitivesCoder], len(consumers)=0]]>
root: DEBUG: CONTROL RESPONSE instruction_id: "bundle_1212"
process_bundle {
metrics {
ptransforms {
key: "assert_that/Group/GroupByKey/Read"
value {
processed_elements {
measured {
output_element_counts {
key: "None"
value: 1
}
}
}
}
}
ptransforms {
key: "assert_that/Group/Map(_merge_tagged_vals_under_key)"
value {
processed_elements {
measured {
output_element_counts {
key: "None"
value: 1
}
}
}
}
}
ptransforms {
key: "assert_that/Match"
value {
processed_elements {
measured {
output_element_counts {
key: "None"
value: 1
}
}
}
}
}
ptransforms {
key: "assert_that/Unkey"
value {
processed_elements {
measured {
output_element_counts {
key: "None"
value: 1
}
}
}
}
}
}
}
root: DEBUG: Gather all output data from [].
root: DEBUG: Wait for the bundle to finish.
--------------------- >> end captured logging << ---------------------
======================================================================
FAIL: test_using_slow_impl (apache_beam.coders.slow_coders_test.SlowCoders)
----------------------------------------------------------------------
Traceback (most recent call last):
File "<https://builds.apache.org/job/beam_PostCommit_Python_Verify/ws/src/sdks/python/apache_beam/coders/slow_coders_test.py",> line 41, in test_using_slow_impl
import apache_beam.coders.stream
AssertionError: ImportError not raised
----------------------------------------------------------------------
Ran 1551 tests in 886.964s
FAILED (failures=1, errors=1, skipped=42)
Test failed: <unittest.runner.TextTestResult run=1551 errors=1 failures=1>
error: Test failed: <unittest.runner.TextTestResult run=1551 errors=1 failures=1>
ERROR: InvocationError: '<https://builds.apache.org/job/beam_PostCommit_Python_Verify/ws/src/sdks/python/target/.tox/py27gcp/bin/python> setup.py test'
___________________________________ summary ____________________________________
ERROR: cover: commands failed
docs: commands succeeded
lint: commands succeeded
ERROR: py27: commands failed
ERROR: py27cython: commands failed
ERROR: py27gcp: commands failed
Build step 'Execute shell' marked build as failure
Not sending mail to unregistered user cclauss@bluewin.ch
Not sending mail to unregistered user apilloud@google.com
Not sending mail to unregistered user ccy@google.com
Not sending mail to unregistered user dcavazos@google.com
Build failed in Jenkins: beam_PostCommit_Python_Verify #4261
Posted by Apache Jenkins Server <je...@builds.apache.org>.
See <https://builds.apache.org/job/beam_PostCommit_Python_Verify/4261/display/redirect?page=changes>
Changes:
[lcwik] [BEAM-3690] swapping to use mockito-core, hamcrest-core and
------------------------------------------
[...truncated 1.40 MB...]
value {
spec {
spec {
urn: "beam:coder:varint:v1"
}
}
}
}
coders {
key: "ref_Coder_WindowedValueCoder_1"
value {
spec {
spec {
urn: "beam:coder:windowed_value:v1"
}
}
component_coder_ids: "ref_Coder_TupleCoder_2"
component_coder_ids: "ref_Coder_GlobalWindowCoder_5"
}
}
coders {
key: "ref_Coder_WindowedValueCoder_11"
value {
spec {
spec {
urn: "beam:coder:windowed_value:v1"
}
}
component_coder_ids: "ref_Coder_TupleCoder_12"
component_coder_ids: "ref_Coder_GlobalWindowCoder_5"
}
}
coders {
key: "ref_Coder_WindowedValueCoder_13"
value {
spec {
spec {
urn: "beam:coder:windowed_value:v1"
}
}
component_coder_ids: "ref_Coder_TupleCoder_14"
component_coder_ids: "ref_Coder_GlobalWindowCoder_5"
}
}
coders {
key: "ref_Coder_WindowedValueCoder_15"
value {
spec {
spec {
urn: "beam:coder:windowed_value:v1"
}
}
component_coder_ids: "ref_Coder_TupleCoder_16"
component_coder_ids: "ref_Coder_GlobalWindowCoder_5"
}
}
coders {
key: "ref_Coder_WindowedValueCoder_1_bytes"
value {
spec {
spec {
urn: "beam:coder:windowed_value:v1"
}
}
component_coder_ids: "ref_Coder_TupleCoder_2_bytes"
component_coder_ids: "ref_Coder_GlobalWindowCoder_5"
}
}
coders {
key: "ref_Coder_WindowedValueCoder_1_len_prefix"
value {
spec {
spec {
urn: "beam:coder:windowed_value:v1"
}
}
component_coder_ids: "ref_Coder_TupleCoder_2_len_prefix"
component_coder_ids: "ref_Coder_GlobalWindowCoder_5"
}
}
coders {
key: "ref_Coder_WindowedValueCoder_6"
value {
spec {
spec {
urn: "beam:coder:windowed_value:v1"
}
}
component_coder_ids: "ref_Coder_FastPrimitivesCoder_3"
component_coder_ids: "ref_Coder_GlobalWindowCoder_5"
}
}
coders {
key: "ref_Coder_WindowedValueCoder_7"
value {
spec {
spec {
urn: "beam:coder:windowed_value:v1"
}
}
component_coder_ids: "ref_Coder_VarIntCoder_8"
component_coder_ids: "ref_Coder_GlobalWindowCoder_5"
}
}
coders {
key: "ref_Coder_WindowedValueCoder_9"
value {
spec {
spec {
urn: "beam:coder:windowed_value:v1"
}
}
component_coder_ids: "ref_Coder_TupleCoder_10"
component_coder_ids: "ref_Coder_GlobalWindowCoder_5"
}
}
coders {
key: "ref_Coder_WindowedValueCoder_9_bytes"
value {
spec {
spec {
urn: "beam:coder:windowed_value:v1"
}
}
component_coder_ids: "ref_Coder_TupleCoder_10_bytes"
component_coder_ids: "ref_Coder_GlobalWindowCoder_5"
}
}
coders {
key: "ref_Coder_WindowedValueCoder_9_len_prefix"
value {
spec {
spec {
urn: "beam:coder:windowed_value:v1"
}
}
component_coder_ids: "ref_Coder_TupleCoder_10_len_prefix"
component_coder_ids: "ref_Coder_GlobalWindowCoder_5"
}
}
}
}
root: DEBUG: CONTROL RESPONSE instruction_id: "control_4"
register {
}
root: DEBUG: CONTROL REQUEST instruction_id: "bundle_1211"
process_bundle {
process_bundle_descriptor_reference: "3"
}
root: INFO: start <DoOperation assert_that/Match output_tags=['out']>
root: INFO: start <DoOperation assert_that/Unkey output_tags=['out']>
root: INFO: start <DoOperation assert_that/Group/Map(_merge_tagged_vals_under_key) output_tags=['out']>
root: INFO: start <DataInputOperation assert_that/Group/GroupByKey/Read receivers=[ConsumerSet[assert_that/Group/GroupByKey/Read.out0, coder=WindowedValueCoder[TupleCoder[LengthPrefixCoder[FastPrimitivesCoder], IterableCoder[LengthPrefixCoder[FastPrimitivesCoder]]]], len(consumers)=1]]>
root: INFO: finish <DataInputOperation assert_that/Group/GroupByKey/Read receivers=[ConsumerSet[assert_that/Group/GroupByKey/Read.out0, coder=WindowedValueCoder[TupleCoder[LengthPrefixCoder[FastPrimitivesCoder], IterableCoder[LengthPrefixCoder[FastPrimitivesCoder]]]], len(consumers)=1]]>
root: INFO: finish <DoOperation assert_that/Group/Map(_merge_tagged_vals_under_key) output_tags=['out'], receivers=[ConsumerSet[assert_that/Group/Map(_merge_tagged_vals_under_key).out0, coder=WindowedValueCoder[FastPrimitivesCoder], len(consumers)=1]]>
root: INFO: finish <DoOperation assert_that/Unkey output_tags=['out'], receivers=[ConsumerSet[assert_that/Unkey.out0, coder=WindowedValueCoder[FastPrimitivesCoder], len(consumers)=1]]>
root: INFO: finish <DoOperation assert_that/Match output_tags=['out'], receivers=[ConsumerSet[assert_that/Match.out0, coder=WindowedValueCoder[FastPrimitivesCoder], len(consumers)=0]]>
root: DEBUG: CONTROL RESPONSE instruction_id: "bundle_1211"
process_bundle {
metrics {
ptransforms {
key: "assert_that/Group/GroupByKey/Read"
value {
processed_elements {
measured {
output_element_counts {
key: "None"
value: 1
}
}
}
}
}
ptransforms {
key: "assert_that/Group/Map(_merge_tagged_vals_under_key)"
value {
processed_elements {
measured {
output_element_counts {
key: "None"
value: 1
}
}
}
}
}
ptransforms {
key: "assert_that/Match"
value {
processed_elements {
measured {
output_element_counts {
key: "None"
value: 1
}
}
}
}
}
ptransforms {
key: "assert_that/Unkey"
value {
processed_elements {
measured {
output_element_counts {
key: "None"
value: 1
}
}
}
}
}
}
}
root: DEBUG: Gather all output data from [].
root: DEBUG: Wait for the bundle to finish.
--------------------- >> end captured logging << ---------------------
======================================================================
FAIL: test_using_slow_impl (apache_beam.coders.slow_coders_test.SlowCoders)
----------------------------------------------------------------------
Traceback (most recent call last):
File "<https://builds.apache.org/job/beam_PostCommit_Python_Verify/ws/src/sdks/python/apache_beam/coders/slow_coders_test.py",> line 41, in test_using_slow_impl
import apache_beam.coders.stream
AssertionError: ImportError not raised
----------------------------------------------------------------------
Ran 1551 tests in 915.355s
FAILED (failures=1, errors=1, skipped=42)
Test failed: <unittest.runner.TextTestResult run=1551 errors=1 failures=1>
error: Test failed: <unittest.runner.TextTestResult run=1551 errors=1 failures=1>
ERROR: InvocationError: '<https://builds.apache.org/job/beam_PostCommit_Python_Verify/ws/src/sdks/python/target/.tox/py27gcp/bin/python> setup.py test'
___________________________________ summary ____________________________________
ERROR: cover: commands failed
docs: commands succeeded
lint: commands succeeded
ERROR: py27: commands failed
ERROR: py27cython: commands failed
ERROR: py27gcp: commands failed
Build step 'Execute shell' marked build as failure
Not sending mail to unregistered user cclauss@bluewin.ch
Not sending mail to unregistered user apilloud@google.com
Not sending mail to unregistered user ccy@google.com
Not sending mail to unregistered user dcavazos@google.com
Build failed in Jenkins: beam_PostCommit_Python_Verify #4260
Posted by Apache Jenkins Server <je...@builds.apache.org>.
See <https://builds.apache.org/job/beam_PostCommit_Python_Verify/4260/display/redirect>
------------------------------------------
[...truncated 1.40 MB...]
value {
spec {
spec {
urn: "beam:coder:varint:v1"
}
}
}
}
coders {
key: "ref_Coder_WindowedValueCoder_1"
value {
spec {
spec {
urn: "beam:coder:windowed_value:v1"
}
}
component_coder_ids: "ref_Coder_TupleCoder_2"
component_coder_ids: "ref_Coder_GlobalWindowCoder_4"
}
}
coders {
key: "ref_Coder_WindowedValueCoder_11"
value {
spec {
spec {
urn: "beam:coder:windowed_value:v1"
}
}
component_coder_ids: "ref_Coder_TupleCoder_12"
component_coder_ids: "ref_Coder_GlobalWindowCoder_4"
}
}
coders {
key: "ref_Coder_WindowedValueCoder_13"
value {
spec {
spec {
urn: "beam:coder:windowed_value:v1"
}
}
component_coder_ids: "ref_Coder_TupleCoder_14"
component_coder_ids: "ref_Coder_GlobalWindowCoder_4"
}
}
coders {
key: "ref_Coder_WindowedValueCoder_15"
value {
spec {
spec {
urn: "beam:coder:windowed_value:v1"
}
}
component_coder_ids: "ref_Coder_TupleCoder_16"
component_coder_ids: "ref_Coder_GlobalWindowCoder_4"
}
}
coders {
key: "ref_Coder_WindowedValueCoder_1_bytes"
value {
spec {
spec {
urn: "beam:coder:windowed_value:v1"
}
}
component_coder_ids: "ref_Coder_TupleCoder_2_bytes"
component_coder_ids: "ref_Coder_GlobalWindowCoder_4"
}
}
coders {
key: "ref_Coder_WindowedValueCoder_1_len_prefix"
value {
spec {
spec {
urn: "beam:coder:windowed_value:v1"
}
}
component_coder_ids: "ref_Coder_TupleCoder_2_len_prefix"
component_coder_ids: "ref_Coder_GlobalWindowCoder_4"
}
}
coders {
key: "ref_Coder_WindowedValueCoder_5"
value {
spec {
spec {
urn: "beam:coder:windowed_value:v1"
}
}
component_coder_ids: "ref_Coder_TupleCoder_6"
component_coder_ids: "ref_Coder_GlobalWindowCoder_4"
}
}
coders {
key: "ref_Coder_WindowedValueCoder_5_bytes"
value {
spec {
spec {
urn: "beam:coder:windowed_value:v1"
}
}
component_coder_ids: "ref_Coder_TupleCoder_6_bytes"
component_coder_ids: "ref_Coder_GlobalWindowCoder_4"
}
}
coders {
key: "ref_Coder_WindowedValueCoder_5_len_prefix"
value {
spec {
spec {
urn: "beam:coder:windowed_value:v1"
}
}
component_coder_ids: "ref_Coder_TupleCoder_6_len_prefix"
component_coder_ids: "ref_Coder_GlobalWindowCoder_4"
}
}
coders {
key: "ref_Coder_WindowedValueCoder_8"
value {
spec {
spec {
urn: "beam:coder:windowed_value:v1"
}
}
component_coder_ids: "ref_Coder_FastPrimitivesCoder_3"
component_coder_ids: "ref_Coder_GlobalWindowCoder_4"
}
}
coders {
key: "ref_Coder_WindowedValueCoder_9"
value {
spec {
spec {
urn: "beam:coder:windowed_value:v1"
}
}
component_coder_ids: "ref_Coder_VarIntCoder_10"
component_coder_ids: "ref_Coder_GlobalWindowCoder_4"
}
}
}
}
root: DEBUG: CONTROL RESPONSE instruction_id: "control_4"
register {
}
root: DEBUG: CONTROL REQUEST instruction_id: "bundle_1210"
process_bundle {
process_bundle_descriptor_reference: "3"
}
root: INFO: start <DoOperation assert_that/Match output_tags=['out']>
root: INFO: start <DoOperation assert_that/Unkey output_tags=['out']>
root: INFO: start <DoOperation assert_that/Group/Map(_merge_tagged_vals_under_key) output_tags=['out']>
root: INFO: start <DataInputOperation assert_that/Group/GroupByKey/Read receivers=[ConsumerSet[assert_that/Group/GroupByKey/Read.out0, coder=WindowedValueCoder[TupleCoder[LengthPrefixCoder[FastPrimitivesCoder], IterableCoder[LengthPrefixCoder[FastPrimitivesCoder]]]], len(consumers)=1]]>
root: INFO: finish <DataInputOperation assert_that/Group/GroupByKey/Read receivers=[ConsumerSet[assert_that/Group/GroupByKey/Read.out0, coder=WindowedValueCoder[TupleCoder[LengthPrefixCoder[FastPrimitivesCoder], IterableCoder[LengthPrefixCoder[FastPrimitivesCoder]]]], len(consumers)=1]]>
root: INFO: finish <DoOperation assert_that/Group/Map(_merge_tagged_vals_under_key) output_tags=['out'], receivers=[ConsumerSet[assert_that/Group/Map(_merge_tagged_vals_under_key).out0, coder=WindowedValueCoder[FastPrimitivesCoder], len(consumers)=1]]>
root: INFO: finish <DoOperation assert_that/Unkey output_tags=['out'], receivers=[ConsumerSet[assert_that/Unkey.out0, coder=WindowedValueCoder[FastPrimitivesCoder], len(consumers)=1]]>
root: INFO: finish <DoOperation assert_that/Match output_tags=['out'], receivers=[ConsumerSet[assert_that/Match.out0, coder=WindowedValueCoder[FastPrimitivesCoder], len(consumers)=0]]>
root: DEBUG: CONTROL RESPONSE instruction_id: "bundle_1210"
process_bundle {
metrics {
ptransforms {
key: "assert_that/Group/GroupByKey/Read"
value {
processed_elements {
measured {
output_element_counts {
key: "None"
value: 1
}
}
}
}
}
ptransforms {
key: "assert_that/Group/Map(_merge_tagged_vals_under_key)"
value {
processed_elements {
measured {
output_element_counts {
key: "None"
value: 1
}
}
}
}
}
ptransforms {
key: "assert_that/Match"
value {
processed_elements {
measured {
output_element_counts {
key: "None"
value: 1
}
}
}
}
}
ptransforms {
key: "assert_that/Unkey"
value {
processed_elements {
measured {
output_element_counts {
key: "None"
value: 1
}
}
}
}
}
}
}
root: DEBUG: Gather all output data from [].
root: DEBUG: Wait for the bundle to finish.
--------------------- >> end captured logging << ---------------------
======================================================================
FAIL: test_using_slow_impl (apache_beam.coders.slow_coders_test.SlowCoders)
----------------------------------------------------------------------
Traceback (most recent call last):
File "<https://builds.apache.org/job/beam_PostCommit_Python_Verify/ws/src/sdks/python/apache_beam/coders/slow_coders_test.py",> line 41, in test_using_slow_impl
import apache_beam.coders.stream
AssertionError: ImportError not raised
----------------------------------------------------------------------
Ran 1551 tests in 858.581s
FAILED (failures=1, errors=1, skipped=42)
Test failed: <unittest.runner.TextTestResult run=1551 errors=1 failures=1>
error: Test failed: <unittest.runner.TextTestResult run=1551 errors=1 failures=1>
ERROR: InvocationError: '<https://builds.apache.org/job/beam_PostCommit_Python_Verify/ws/src/sdks/python/target/.tox/py27gcp/bin/python> setup.py test'
___________________________________ summary ____________________________________
ERROR: cover: commands failed
docs: commands succeeded
lint: commands succeeded
ERROR: py27: commands failed
ERROR: py27cython: commands failed
ERROR: py27gcp: commands failed
Build step 'Execute shell' marked build as failure
Not sending mail to unregistered user cclauss@bluewin.ch
Not sending mail to unregistered user apilloud@google.com
Not sending mail to unregistered user ccy@google.com
Not sending mail to unregistered user dcavazos@google.com
Build failed in Jenkins: beam_PostCommit_Python_Verify #4259
Posted by Apache Jenkins Server <je...@builds.apache.org>.
See <https://builds.apache.org/job/beam_PostCommit_Python_Verify/4259/display/redirect>
------------------------------------------
[...truncated 1.40 MB...]
value {
spec {
spec {
urn: "beam:coder:varint:v1"
}
}
}
}
coders {
key: "ref_Coder_WindowedValueCoder_1"
value {
spec {
spec {
urn: "beam:coder:windowed_value:v1"
}
}
component_coder_ids: "ref_Coder_TupleCoder_2"
component_coder_ids: "ref_Coder_GlobalWindowCoder_5"
}
}
coders {
key: "ref_Coder_WindowedValueCoder_11"
value {
spec {
spec {
urn: "beam:coder:windowed_value:v1"
}
}
component_coder_ids: "ref_Coder_TupleCoder_12"
component_coder_ids: "ref_Coder_GlobalWindowCoder_5"
}
}
coders {
key: "ref_Coder_WindowedValueCoder_13"
value {
spec {
spec {
urn: "beam:coder:windowed_value:v1"
}
}
component_coder_ids: "ref_Coder_TupleCoder_14"
component_coder_ids: "ref_Coder_GlobalWindowCoder_5"
}
}
coders {
key: "ref_Coder_WindowedValueCoder_15"
value {
spec {
spec {
urn: "beam:coder:windowed_value:v1"
}
}
component_coder_ids: "ref_Coder_TupleCoder_16"
component_coder_ids: "ref_Coder_GlobalWindowCoder_5"
}
}
coders {
key: "ref_Coder_WindowedValueCoder_1_bytes"
value {
spec {
spec {
urn: "beam:coder:windowed_value:v1"
}
}
component_coder_ids: "ref_Coder_TupleCoder_2_bytes"
component_coder_ids: "ref_Coder_GlobalWindowCoder_5"
}
}
coders {
key: "ref_Coder_WindowedValueCoder_1_len_prefix"
value {
spec {
spec {
urn: "beam:coder:windowed_value:v1"
}
}
component_coder_ids: "ref_Coder_TupleCoder_2_len_prefix"
component_coder_ids: "ref_Coder_GlobalWindowCoder_5"
}
}
coders {
key: "ref_Coder_WindowedValueCoder_6"
value {
spec {
spec {
urn: "beam:coder:windowed_value:v1"
}
}
component_coder_ids: "ref_Coder_FastPrimitivesCoder_3"
component_coder_ids: "ref_Coder_GlobalWindowCoder_5"
}
}
coders {
key: "ref_Coder_WindowedValueCoder_7"
value {
spec {
spec {
urn: "beam:coder:windowed_value:v1"
}
}
component_coder_ids: "ref_Coder_VarIntCoder_8"
component_coder_ids: "ref_Coder_GlobalWindowCoder_5"
}
}
coders {
key: "ref_Coder_WindowedValueCoder_9"
value {
spec {
spec {
urn: "beam:coder:windowed_value:v1"
}
}
component_coder_ids: "ref_Coder_TupleCoder_10"
component_coder_ids: "ref_Coder_GlobalWindowCoder_5"
}
}
coders {
key: "ref_Coder_WindowedValueCoder_9_bytes"
value {
spec {
spec {
urn: "beam:coder:windowed_value:v1"
}
}
component_coder_ids: "ref_Coder_TupleCoder_10_bytes"
component_coder_ids: "ref_Coder_GlobalWindowCoder_5"
}
}
coders {
key: "ref_Coder_WindowedValueCoder_9_len_prefix"
value {
spec {
spec {
urn: "beam:coder:windowed_value:v1"
}
}
component_coder_ids: "ref_Coder_TupleCoder_10_len_prefix"
component_coder_ids: "ref_Coder_GlobalWindowCoder_5"
}
}
}
}
root: DEBUG: CONTROL RESPONSE instruction_id: "control_4"
register {
}
root: DEBUG: CONTROL REQUEST instruction_id: "bundle_1211"
process_bundle {
process_bundle_descriptor_reference: "3"
}
root: INFO: start <DoOperation assert_that/Match output_tags=['out']>
root: INFO: start <DoOperation assert_that/Unkey output_tags=['out']>
root: INFO: start <DoOperation assert_that/Group/Map(_merge_tagged_vals_under_key) output_tags=['out']>
root: INFO: start <DataInputOperation assert_that/Group/GroupByKey/Read receivers=[ConsumerSet[assert_that/Group/GroupByKey/Read.out0, coder=WindowedValueCoder[TupleCoder[LengthPrefixCoder[FastPrimitivesCoder], IterableCoder[LengthPrefixCoder[FastPrimitivesCoder]]]], len(consumers)=1]]>
root: INFO: finish <DataInputOperation assert_that/Group/GroupByKey/Read receivers=[ConsumerSet[assert_that/Group/GroupByKey/Read.out0, coder=WindowedValueCoder[TupleCoder[LengthPrefixCoder[FastPrimitivesCoder], IterableCoder[LengthPrefixCoder[FastPrimitivesCoder]]]], len(consumers)=1]]>
root: INFO: finish <DoOperation assert_that/Group/Map(_merge_tagged_vals_under_key) output_tags=['out'], receivers=[ConsumerSet[assert_that/Group/Map(_merge_tagged_vals_under_key).out0, coder=WindowedValueCoder[FastPrimitivesCoder], len(consumers)=1]]>
root: INFO: finish <DoOperation assert_that/Unkey output_tags=['out'], receivers=[ConsumerSet[assert_that/Unkey.out0, coder=WindowedValueCoder[FastPrimitivesCoder], len(consumers)=1]]>
root: INFO: finish <DoOperation assert_that/Match output_tags=['out'], receivers=[ConsumerSet[assert_that/Match.out0, coder=WindowedValueCoder[FastPrimitivesCoder], len(consumers)=0]]>
root: DEBUG: CONTROL RESPONSE instruction_id: "bundle_1211"
process_bundle {
metrics {
ptransforms {
key: "assert_that/Group/GroupByKey/Read"
value {
processed_elements {
measured {
output_element_counts {
key: "None"
value: 1
}
}
}
}
}
ptransforms {
key: "assert_that/Group/Map(_merge_tagged_vals_under_key)"
value {
processed_elements {
measured {
output_element_counts {
key: "None"
value: 1
}
}
}
}
}
ptransforms {
key: "assert_that/Match"
value {
processed_elements {
measured {
output_element_counts {
key: "None"
value: 1
}
}
}
}
}
ptransforms {
key: "assert_that/Unkey"
value {
processed_elements {
measured {
output_element_counts {
key: "None"
value: 1
}
}
}
}
}
}
}
root: DEBUG: Gather all output data from [].
root: DEBUG: Wait for the bundle to finish.
--------------------- >> end captured logging << ---------------------
======================================================================
FAIL: test_using_slow_impl (apache_beam.coders.slow_coders_test.SlowCoders)
----------------------------------------------------------------------
Traceback (most recent call last):
File "<https://builds.apache.org/job/beam_PostCommit_Python_Verify/ws/src/sdks/python/apache_beam/coders/slow_coders_test.py",> line 41, in test_using_slow_impl
import apache_beam.coders.stream
AssertionError: ImportError not raised
----------------------------------------------------------------------
Ran 1551 tests in 614.563s
FAILED (failures=1, errors=1, skipped=42)
Test failed: <unittest.runner.TextTestResult run=1551 errors=1 failures=1>
error: Test failed: <unittest.runner.TextTestResult run=1551 errors=1 failures=1>
ERROR: InvocationError: '<https://builds.apache.org/job/beam_PostCommit_Python_Verify/ws/src/sdks/python/target/.tox/py27gcp/bin/python> setup.py test'
___________________________________ summary ____________________________________
ERROR: cover: commands failed
docs: commands succeeded
lint: commands succeeded
ERROR: py27: commands failed
ERROR: py27cython: commands failed
ERROR: py27gcp: commands failed
Build step 'Execute shell' marked build as failure
Not sending mail to unregistered user cclauss@bluewin.ch
Not sending mail to unregistered user apilloud@google.com
Not sending mail to unregistered user ccy@google.com
Not sending mail to unregistered user dcavazos@google.com
Build failed in Jenkins: beam_PostCommit_Python_Verify #4258
Posted by Apache Jenkins Server <je...@builds.apache.org>.
See <https://builds.apache.org/job/beam_PostCommit_Python_Verify/4258/display/redirect>
------------------------------------------
[...truncated 1.40 MB...]
value {
spec {
spec {
urn: "beam:coder:varint:v1"
}
}
}
}
coders {
key: "ref_Coder_WindowedValueCoder_1"
value {
spec {
spec {
urn: "beam:coder:windowed_value:v1"
}
}
component_coder_ids: "ref_Coder_FastPrimitivesCoder_2"
component_coder_ids: "ref_Coder_GlobalWindowCoder_3"
}
}
coders {
key: "ref_Coder_WindowedValueCoder_10"
value {
spec {
spec {
urn: "beam:coder:windowed_value:v1"
}
}
component_coder_ids: "ref_Coder_TupleCoder_11"
component_coder_ids: "ref_Coder_GlobalWindowCoder_3"
}
}
coders {
key: "ref_Coder_WindowedValueCoder_12"
value {
spec {
spec {
urn: "beam:coder:windowed_value:v1"
}
}
component_coder_ids: "ref_Coder_TupleCoder_13"
component_coder_ids: "ref_Coder_GlobalWindowCoder_3"
}
}
coders {
key: "ref_Coder_WindowedValueCoder_14"
value {
spec {
spec {
urn: "beam:coder:windowed_value:v1"
}
}
component_coder_ids: "ref_Coder_TupleCoder_15"
component_coder_ids: "ref_Coder_GlobalWindowCoder_3"
}
}
coders {
key: "ref_Coder_WindowedValueCoder_14_bytes"
value {
spec {
spec {
urn: "beam:coder:windowed_value:v1"
}
}
component_coder_ids: "ref_Coder_TupleCoder_15_bytes"
component_coder_ids: "ref_Coder_GlobalWindowCoder_3"
}
}
coders {
key: "ref_Coder_WindowedValueCoder_14_len_prefix"
value {
spec {
spec {
urn: "beam:coder:windowed_value:v1"
}
}
component_coder_ids: "ref_Coder_TupleCoder_15_len_prefix"
component_coder_ids: "ref_Coder_GlobalWindowCoder_3"
}
}
coders {
key: "ref_Coder_WindowedValueCoder_4"
value {
spec {
spec {
urn: "beam:coder:windowed_value:v1"
}
}
component_coder_ids: "ref_Coder_VarIntCoder_5"
component_coder_ids: "ref_Coder_GlobalWindowCoder_3"
}
}
coders {
key: "ref_Coder_WindowedValueCoder_6"
value {
spec {
spec {
urn: "beam:coder:windowed_value:v1"
}
}
component_coder_ids: "ref_Coder_TupleCoder_7"
component_coder_ids: "ref_Coder_GlobalWindowCoder_3"
}
}
coders {
key: "ref_Coder_WindowedValueCoder_6_bytes"
value {
spec {
spec {
urn: "beam:coder:windowed_value:v1"
}
}
component_coder_ids: "ref_Coder_TupleCoder_7_bytes"
component_coder_ids: "ref_Coder_GlobalWindowCoder_3"
}
}
coders {
key: "ref_Coder_WindowedValueCoder_6_len_prefix"
value {
spec {
spec {
urn: "beam:coder:windowed_value:v1"
}
}
component_coder_ids: "ref_Coder_TupleCoder_7_len_prefix"
component_coder_ids: "ref_Coder_GlobalWindowCoder_3"
}
}
coders {
key: "ref_Coder_WindowedValueCoder_8"
value {
spec {
spec {
urn: "beam:coder:windowed_value:v1"
}
}
component_coder_ids: "ref_Coder_TupleCoder_9"
component_coder_ids: "ref_Coder_GlobalWindowCoder_3"
}
}
}
}
root: DEBUG: CONTROL RESPONSE instruction_id: "control_4"
register {
}
root: DEBUG: CONTROL REQUEST instruction_id: "bundle_1211"
process_bundle {
process_bundle_descriptor_reference: "3"
}
root: INFO: start <DoOperation assert_that/Match output_tags=['out']>
root: INFO: start <DoOperation assert_that/Unkey output_tags=['out']>
root: INFO: start <DoOperation assert_that/Group/Map(_merge_tagged_vals_under_key) output_tags=['out']>
root: INFO: start <DataInputOperation assert_that/Group/GroupByKey/Read receivers=[ConsumerSet[assert_that/Group/GroupByKey/Read.out0, coder=WindowedValueCoder[TupleCoder[LengthPrefixCoder[FastPrimitivesCoder], IterableCoder[LengthPrefixCoder[FastPrimitivesCoder]]]], len(consumers)=1]]>
root: INFO: finish <DataInputOperation assert_that/Group/GroupByKey/Read receivers=[ConsumerSet[assert_that/Group/GroupByKey/Read.out0, coder=WindowedValueCoder[TupleCoder[LengthPrefixCoder[FastPrimitivesCoder], IterableCoder[LengthPrefixCoder[FastPrimitivesCoder]]]], len(consumers)=1]]>
root: INFO: finish <DoOperation assert_that/Group/Map(_merge_tagged_vals_under_key) output_tags=['out'], receivers=[ConsumerSet[assert_that/Group/Map(_merge_tagged_vals_under_key).out0, coder=WindowedValueCoder[FastPrimitivesCoder], len(consumers)=1]]>
root: INFO: finish <DoOperation assert_that/Unkey output_tags=['out'], receivers=[ConsumerSet[assert_that/Unkey.out0, coder=WindowedValueCoder[FastPrimitivesCoder], len(consumers)=1]]>
root: INFO: finish <DoOperation assert_that/Match output_tags=['out'], receivers=[ConsumerSet[assert_that/Match.out0, coder=WindowedValueCoder[FastPrimitivesCoder], len(consumers)=0]]>
root: DEBUG: CONTROL RESPONSE instruction_id: "bundle_1211"
process_bundle {
metrics {
ptransforms {
key: "assert_that/Group/GroupByKey/Read"
value {
processed_elements {
measured {
output_element_counts {
key: "None"
value: 1
}
}
}
}
}
ptransforms {
key: "assert_that/Group/Map(_merge_tagged_vals_under_key)"
value {
processed_elements {
measured {
output_element_counts {
key: "None"
value: 1
}
}
}
}
}
ptransforms {
key: "assert_that/Match"
value {
processed_elements {
measured {
output_element_counts {
key: "None"
value: 1
}
}
}
}
}
ptransforms {
key: "assert_that/Unkey"
value {
processed_elements {
measured {
output_element_counts {
key: "None"
value: 1
}
}
}
}
}
}
}
root: DEBUG: Gather all output data from [].
root: DEBUG: Wait for the bundle to finish.
--------------------- >> end captured logging << ---------------------
======================================================================
FAIL: test_using_slow_impl (apache_beam.coders.slow_coders_test.SlowCoders)
----------------------------------------------------------------------
Traceback (most recent call last):
File "<https://builds.apache.org/job/beam_PostCommit_Python_Verify/ws/src/sdks/python/apache_beam/coders/slow_coders_test.py",> line 41, in test_using_slow_impl
import apache_beam.coders.stream
AssertionError: ImportError not raised
----------------------------------------------------------------------
Ran 1551 tests in 621.221s
FAILED (failures=1, errors=1, skipped=42)
Test failed: <unittest.runner.TextTestResult run=1551 errors=1 failures=1>
error: Test failed: <unittest.runner.TextTestResult run=1551 errors=1 failures=1>
ERROR: InvocationError: '<https://builds.apache.org/job/beam_PostCommit_Python_Verify/ws/src/sdks/python/target/.tox/py27gcp/bin/python> setup.py test'
___________________________________ summary ____________________________________
ERROR: cover: commands failed
docs: commands succeeded
lint: commands succeeded
ERROR: py27: commands failed
ERROR: py27cython: commands failed
ERROR: py27gcp: commands failed
Build step 'Execute shell' marked build as failure
Not sending mail to unregistered user cclauss@bluewin.ch
Not sending mail to unregistered user apilloud@google.com
Not sending mail to unregistered user ccy@google.com
Not sending mail to unregistered user dcavazos@google.com
Build failed in Jenkins: beam_PostCommit_Python_Verify #4257
Posted by Apache Jenkins Server <je...@builds.apache.org>.
See <https://builds.apache.org/job/beam_PostCommit_Python_Verify/4257/display/redirect>
------------------------------------------
[...truncated 1.40 MB...]
value {
spec {
spec {
urn: "beam:coder:varint:v1"
}
}
}
}
coders {
key: "ref_Coder_WindowedValueCoder_1"
value {
spec {
spec {
urn: "beam:coder:windowed_value:v1"
}
}
component_coder_ids: "ref_Coder_VarIntCoder_2"
component_coder_ids: "ref_Coder_GlobalWindowCoder_3"
}
}
coders {
key: "ref_Coder_WindowedValueCoder_11"
value {
spec {
spec {
urn: "beam:coder:windowed_value:v1"
}
}
component_coder_ids: "ref_Coder_TupleCoder_12"
component_coder_ids: "ref_Coder_GlobalWindowCoder_3"
}
}
coders {
key: "ref_Coder_WindowedValueCoder_13"
value {
spec {
spec {
urn: "beam:coder:windowed_value:v1"
}
}
component_coder_ids: "ref_Coder_TupleCoder_14"
component_coder_ids: "ref_Coder_GlobalWindowCoder_3"
}
}
coders {
key: "ref_Coder_WindowedValueCoder_13_bytes"
value {
spec {
spec {
urn: "beam:coder:windowed_value:v1"
}
}
component_coder_ids: "ref_Coder_TupleCoder_14_bytes"
component_coder_ids: "ref_Coder_GlobalWindowCoder_3"
}
}
coders {
key: "ref_Coder_WindowedValueCoder_13_len_prefix"
value {
spec {
spec {
urn: "beam:coder:windowed_value:v1"
}
}
component_coder_ids: "ref_Coder_TupleCoder_14_len_prefix"
component_coder_ids: "ref_Coder_GlobalWindowCoder_3"
}
}
coders {
key: "ref_Coder_WindowedValueCoder_16"
value {
spec {
spec {
urn: "beam:coder:windowed_value:v1"
}
}
component_coder_ids: "ref_Coder_FastPrimitivesCoder_6"
component_coder_ids: "ref_Coder_GlobalWindowCoder_3"
}
}
coders {
key: "ref_Coder_WindowedValueCoder_4"
value {
spec {
spec {
urn: "beam:coder:windowed_value:v1"
}
}
component_coder_ids: "ref_Coder_TupleCoder_5"
component_coder_ids: "ref_Coder_GlobalWindowCoder_3"
}
}
coders {
key: "ref_Coder_WindowedValueCoder_4_bytes"
value {
spec {
spec {
urn: "beam:coder:windowed_value:v1"
}
}
component_coder_ids: "ref_Coder_TupleCoder_5_bytes"
component_coder_ids: "ref_Coder_GlobalWindowCoder_3"
}
}
coders {
key: "ref_Coder_WindowedValueCoder_4_len_prefix"
value {
spec {
spec {
urn: "beam:coder:windowed_value:v1"
}
}
component_coder_ids: "ref_Coder_TupleCoder_5_len_prefix"
component_coder_ids: "ref_Coder_GlobalWindowCoder_3"
}
}
coders {
key: "ref_Coder_WindowedValueCoder_7"
value {
spec {
spec {
urn: "beam:coder:windowed_value:v1"
}
}
component_coder_ids: "ref_Coder_TupleCoder_8"
component_coder_ids: "ref_Coder_GlobalWindowCoder_3"
}
}
coders {
key: "ref_Coder_WindowedValueCoder_9"
value {
spec {
spec {
urn: "beam:coder:windowed_value:v1"
}
}
component_coder_ids: "ref_Coder_TupleCoder_10"
component_coder_ids: "ref_Coder_GlobalWindowCoder_3"
}
}
}
}
root: DEBUG: CONTROL RESPONSE instruction_id: "control_4"
register {
}
root: DEBUG: CONTROL REQUEST instruction_id: "bundle_1212"
process_bundle {
process_bundle_descriptor_reference: "3"
}
root: INFO: start <DoOperation assert_that/Match output_tags=['out']>
root: INFO: start <DoOperation assert_that/Unkey output_tags=['out']>
root: INFO: start <DoOperation assert_that/Group/Map(_merge_tagged_vals_under_key) output_tags=['out']>
root: INFO: start <DataInputOperation assert_that/Group/GroupByKey/Read receivers=[ConsumerSet[assert_that/Group/GroupByKey/Read.out0, coder=WindowedValueCoder[TupleCoder[LengthPrefixCoder[FastPrimitivesCoder], IterableCoder[LengthPrefixCoder[FastPrimitivesCoder]]]], len(consumers)=1]]>
root: INFO: finish <DataInputOperation assert_that/Group/GroupByKey/Read receivers=[ConsumerSet[assert_that/Group/GroupByKey/Read.out0, coder=WindowedValueCoder[TupleCoder[LengthPrefixCoder[FastPrimitivesCoder], IterableCoder[LengthPrefixCoder[FastPrimitivesCoder]]]], len(consumers)=1]]>
root: INFO: finish <DoOperation assert_that/Group/Map(_merge_tagged_vals_under_key) output_tags=['out'], receivers=[ConsumerSet[assert_that/Group/Map(_merge_tagged_vals_under_key).out0, coder=WindowedValueCoder[FastPrimitivesCoder], len(consumers)=1]]>
root: INFO: finish <DoOperation assert_that/Unkey output_tags=['out'], receivers=[ConsumerSet[assert_that/Unkey.out0, coder=WindowedValueCoder[FastPrimitivesCoder], len(consumers)=1]]>
root: INFO: finish <DoOperation assert_that/Match output_tags=['out'], receivers=[ConsumerSet[assert_that/Match.out0, coder=WindowedValueCoder[FastPrimitivesCoder], len(consumers)=0]]>
root: DEBUG: CONTROL RESPONSE instruction_id: "bundle_1212"
process_bundle {
metrics {
ptransforms {
key: "assert_that/Group/GroupByKey/Read"
value {
processed_elements {
measured {
output_element_counts {
key: "None"
value: 1
}
}
}
}
}
ptransforms {
key: "assert_that/Group/Map(_merge_tagged_vals_under_key)"
value {
processed_elements {
measured {
output_element_counts {
key: "None"
value: 1
}
}
}
}
}
ptransforms {
key: "assert_that/Match"
value {
processed_elements {
measured {
output_element_counts {
key: "None"
value: 1
}
}
}
}
}
ptransforms {
key: "assert_that/Unkey"
value {
processed_elements {
measured {
output_element_counts {
key: "None"
value: 1
}
}
}
}
}
}
}
root: DEBUG: Gather all output data from [].
root: DEBUG: Wait for the bundle to finish.
--------------------- >> end captured logging << ---------------------
======================================================================
FAIL: test_using_slow_impl (apache_beam.coders.slow_coders_test.SlowCoders)
----------------------------------------------------------------------
Traceback (most recent call last):
File "<https://builds.apache.org/job/beam_PostCommit_Python_Verify/ws/src/sdks/python/apache_beam/coders/slow_coders_test.py",> line 41, in test_using_slow_impl
import apache_beam.coders.stream
AssertionError: ImportError not raised
----------------------------------------------------------------------
Ran 1551 tests in 620.856s
FAILED (failures=1, errors=1, skipped=42)
Test failed: <unittest.runner.TextTestResult run=1551 errors=1 failures=1>
error: Test failed: <unittest.runner.TextTestResult run=1551 errors=1 failures=1>
ERROR: InvocationError: '<https://builds.apache.org/job/beam_PostCommit_Python_Verify/ws/src/sdks/python/target/.tox/py27gcp/bin/python> setup.py test'
___________________________________ summary ____________________________________
ERROR: cover: commands failed
docs: commands succeeded
lint: commands succeeded
ERROR: py27: commands failed
ERROR: py27cython: commands failed
ERROR: py27gcp: commands failed
Build step 'Execute shell' marked build as failure
Not sending mail to unregistered user cclauss@bluewin.ch
Not sending mail to unregistered user apilloud@google.com
Not sending mail to unregistered user ccy@google.com
Not sending mail to unregistered user dcavazos@google.com
Build failed in Jenkins: beam_PostCommit_Python_Verify #4256
Posted by Apache Jenkins Server <je...@builds.apache.org>.
See <https://builds.apache.org/job/beam_PostCommit_Python_Verify/4256/display/redirect>
------------------------------------------
[...truncated 1.40 MB...]
value {
spec {
spec {
urn: "beam:coder:varint:v1"
}
}
}
}
coders {
key: "ref_Coder_WindowedValueCoder_1"
value {
spec {
spec {
urn: "beam:coder:windowed_value:v1"
}
}
component_coder_ids: "ref_Coder_FastPrimitivesCoder_2"
component_coder_ids: "ref_Coder_GlobalWindowCoder_3"
}
}
coders {
key: "ref_Coder_WindowedValueCoder_10"
value {
spec {
spec {
urn: "beam:coder:windowed_value:v1"
}
}
component_coder_ids: "ref_Coder_TupleCoder_11"
component_coder_ids: "ref_Coder_GlobalWindowCoder_3"
}
}
coders {
key: "ref_Coder_WindowedValueCoder_12"
value {
spec {
spec {
urn: "beam:coder:windowed_value:v1"
}
}
component_coder_ids: "ref_Coder_TupleCoder_13"
component_coder_ids: "ref_Coder_GlobalWindowCoder_3"
}
}
coders {
key: "ref_Coder_WindowedValueCoder_14"
value {
spec {
spec {
urn: "beam:coder:windowed_value:v1"
}
}
component_coder_ids: "ref_Coder_TupleCoder_15"
component_coder_ids: "ref_Coder_GlobalWindowCoder_3"
}
}
coders {
key: "ref_Coder_WindowedValueCoder_14_bytes"
value {
spec {
spec {
urn: "beam:coder:windowed_value:v1"
}
}
component_coder_ids: "ref_Coder_TupleCoder_15_bytes"
component_coder_ids: "ref_Coder_GlobalWindowCoder_3"
}
}
coders {
key: "ref_Coder_WindowedValueCoder_14_len_prefix"
value {
spec {
spec {
urn: "beam:coder:windowed_value:v1"
}
}
component_coder_ids: "ref_Coder_TupleCoder_15_len_prefix"
component_coder_ids: "ref_Coder_GlobalWindowCoder_3"
}
}
coders {
key: "ref_Coder_WindowedValueCoder_4"
value {
spec {
spec {
urn: "beam:coder:windowed_value:v1"
}
}
component_coder_ids: "ref_Coder_VarIntCoder_5"
component_coder_ids: "ref_Coder_GlobalWindowCoder_3"
}
}
coders {
key: "ref_Coder_WindowedValueCoder_6"
value {
spec {
spec {
urn: "beam:coder:windowed_value:v1"
}
}
component_coder_ids: "ref_Coder_TupleCoder_7"
component_coder_ids: "ref_Coder_GlobalWindowCoder_3"
}
}
coders {
key: "ref_Coder_WindowedValueCoder_6_bytes"
value {
spec {
spec {
urn: "beam:coder:windowed_value:v1"
}
}
component_coder_ids: "ref_Coder_TupleCoder_7_bytes"
component_coder_ids: "ref_Coder_GlobalWindowCoder_3"
}
}
coders {
key: "ref_Coder_WindowedValueCoder_6_len_prefix"
value {
spec {
spec {
urn: "beam:coder:windowed_value:v1"
}
}
component_coder_ids: "ref_Coder_TupleCoder_7_len_prefix"
component_coder_ids: "ref_Coder_GlobalWindowCoder_3"
}
}
coders {
key: "ref_Coder_WindowedValueCoder_8"
value {
spec {
spec {
urn: "beam:coder:windowed_value:v1"
}
}
component_coder_ids: "ref_Coder_TupleCoder_9"
component_coder_ids: "ref_Coder_GlobalWindowCoder_3"
}
}
}
}
root: DEBUG: CONTROL RESPONSE instruction_id: "control_4"
register {
}
root: DEBUG: CONTROL REQUEST instruction_id: "bundle_1211"
process_bundle {
process_bundle_descriptor_reference: "3"
}
root: INFO: start <DoOperation assert_that/Match output_tags=['out']>
root: INFO: start <DoOperation assert_that/Unkey output_tags=['out']>
root: INFO: start <DoOperation assert_that/Group/Map(_merge_tagged_vals_under_key) output_tags=['out']>
root: INFO: start <DataInputOperation assert_that/Group/GroupByKey/Read receivers=[ConsumerSet[assert_that/Group/GroupByKey/Read.out0, coder=WindowedValueCoder[TupleCoder[LengthPrefixCoder[FastPrimitivesCoder], IterableCoder[LengthPrefixCoder[FastPrimitivesCoder]]]], len(consumers)=1]]>
root: INFO: finish <DataInputOperation assert_that/Group/GroupByKey/Read receivers=[ConsumerSet[assert_that/Group/GroupByKey/Read.out0, coder=WindowedValueCoder[TupleCoder[LengthPrefixCoder[FastPrimitivesCoder], IterableCoder[LengthPrefixCoder[FastPrimitivesCoder]]]], len(consumers)=1]]>
root: INFO: finish <DoOperation assert_that/Group/Map(_merge_tagged_vals_under_key) output_tags=['out'], receivers=[ConsumerSet[assert_that/Group/Map(_merge_tagged_vals_under_key).out0, coder=WindowedValueCoder[FastPrimitivesCoder], len(consumers)=1]]>
root: INFO: finish <DoOperation assert_that/Unkey output_tags=['out'], receivers=[ConsumerSet[assert_that/Unkey.out0, coder=WindowedValueCoder[FastPrimitivesCoder], len(consumers)=1]]>
root: INFO: finish <DoOperation assert_that/Match output_tags=['out'], receivers=[ConsumerSet[assert_that/Match.out0, coder=WindowedValueCoder[FastPrimitivesCoder], len(consumers)=0]]>
root: DEBUG: CONTROL RESPONSE instruction_id: "bundle_1211"
process_bundle {
metrics {
ptransforms {
key: "assert_that/Group/GroupByKey/Read"
value {
processed_elements {
measured {
output_element_counts {
key: "None"
value: 1
}
}
}
}
}
ptransforms {
key: "assert_that/Group/Map(_merge_tagged_vals_under_key)"
value {
processed_elements {
measured {
output_element_counts {
key: "None"
value: 1
}
}
}
}
}
ptransforms {
key: "assert_that/Match"
value {
processed_elements {
measured {
output_element_counts {
key: "None"
value: 1
}
}
}
}
}
ptransforms {
key: "assert_that/Unkey"
value {
processed_elements {
measured {
output_element_counts {
key: "None"
value: 1
}
}
}
}
}
}
}
root: DEBUG: Gather all output data from [].
root: DEBUG: Wait for the bundle to finish.
--------------------- >> end captured logging << ---------------------
======================================================================
FAIL: test_using_slow_impl (apache_beam.coders.slow_coders_test.SlowCoders)
----------------------------------------------------------------------
Traceback (most recent call last):
File "<https://builds.apache.org/job/beam_PostCommit_Python_Verify/ws/src/sdks/python/apache_beam/coders/slow_coders_test.py",> line 41, in test_using_slow_impl
import apache_beam.coders.stream
AssertionError: ImportError not raised
----------------------------------------------------------------------
Ran 1551 tests in 895.936s
FAILED (failures=1, errors=1, skipped=42)
Test failed: <unittest.runner.TextTestResult run=1551 errors=1 failures=1>
error: Test failed: <unittest.runner.TextTestResult run=1551 errors=1 failures=1>
ERROR: InvocationError: '<https://builds.apache.org/job/beam_PostCommit_Python_Verify/ws/src/sdks/python/target/.tox/py27gcp/bin/python> setup.py test'
___________________________________ summary ____________________________________
ERROR: cover: commands failed
docs: commands succeeded
lint: commands succeeded
ERROR: py27: commands failed
ERROR: py27cython: commands failed
ERROR: py27gcp: commands failed
Build step 'Execute shell' marked build as failure
Not sending mail to unregistered user cclauss@bluewin.ch
Not sending mail to unregistered user apilloud@google.com
Not sending mail to unregistered user ccy@google.com
Not sending mail to unregistered user dcavazos@google.com
Build failed in Jenkins: beam_PostCommit_Python_Verify #4255
Posted by Apache Jenkins Server <je...@builds.apache.org>.
See <https://builds.apache.org/job/beam_PostCommit_Python_Verify/4255/display/redirect>
------------------------------------------
[...truncated 1.40 MB...]
value {
spec {
spec {
urn: "beam:coder:varint:v1"
}
}
}
}
coders {
key: "ref_Coder_WindowedValueCoder_1"
value {
spec {
spec {
urn: "beam:coder:windowed_value:v1"
}
}
component_coder_ids: "ref_Coder_TupleCoder_2"
component_coder_ids: "ref_Coder_GlobalWindowCoder_5"
}
}
coders {
key: "ref_Coder_WindowedValueCoder_11"
value {
spec {
spec {
urn: "beam:coder:windowed_value:v1"
}
}
component_coder_ids: "ref_Coder_TupleCoder_12"
component_coder_ids: "ref_Coder_GlobalWindowCoder_5"
}
}
coders {
key: "ref_Coder_WindowedValueCoder_13"
value {
spec {
spec {
urn: "beam:coder:windowed_value:v1"
}
}
component_coder_ids: "ref_Coder_TupleCoder_14"
component_coder_ids: "ref_Coder_GlobalWindowCoder_5"
}
}
coders {
key: "ref_Coder_WindowedValueCoder_15"
value {
spec {
spec {
urn: "beam:coder:windowed_value:v1"
}
}
component_coder_ids: "ref_Coder_TupleCoder_16"
component_coder_ids: "ref_Coder_GlobalWindowCoder_5"
}
}
coders {
key: "ref_Coder_WindowedValueCoder_1_bytes"
value {
spec {
spec {
urn: "beam:coder:windowed_value:v1"
}
}
component_coder_ids: "ref_Coder_TupleCoder_2_bytes"
component_coder_ids: "ref_Coder_GlobalWindowCoder_5"
}
}
coders {
key: "ref_Coder_WindowedValueCoder_1_len_prefix"
value {
spec {
spec {
urn: "beam:coder:windowed_value:v1"
}
}
component_coder_ids: "ref_Coder_TupleCoder_2_len_prefix"
component_coder_ids: "ref_Coder_GlobalWindowCoder_5"
}
}
coders {
key: "ref_Coder_WindowedValueCoder_6"
value {
spec {
spec {
urn: "beam:coder:windowed_value:v1"
}
}
component_coder_ids: "ref_Coder_FastPrimitivesCoder_3"
component_coder_ids: "ref_Coder_GlobalWindowCoder_5"
}
}
coders {
key: "ref_Coder_WindowedValueCoder_7"
value {
spec {
spec {
urn: "beam:coder:windowed_value:v1"
}
}
component_coder_ids: "ref_Coder_VarIntCoder_8"
component_coder_ids: "ref_Coder_GlobalWindowCoder_5"
}
}
coders {
key: "ref_Coder_WindowedValueCoder_9"
value {
spec {
spec {
urn: "beam:coder:windowed_value:v1"
}
}
component_coder_ids: "ref_Coder_TupleCoder_10"
component_coder_ids: "ref_Coder_GlobalWindowCoder_5"
}
}
coders {
key: "ref_Coder_WindowedValueCoder_9_bytes"
value {
spec {
spec {
urn: "beam:coder:windowed_value:v1"
}
}
component_coder_ids: "ref_Coder_TupleCoder_10_bytes"
component_coder_ids: "ref_Coder_GlobalWindowCoder_5"
}
}
coders {
key: "ref_Coder_WindowedValueCoder_9_len_prefix"
value {
spec {
spec {
urn: "beam:coder:windowed_value:v1"
}
}
component_coder_ids: "ref_Coder_TupleCoder_10_len_prefix"
component_coder_ids: "ref_Coder_GlobalWindowCoder_5"
}
}
}
}
root: DEBUG: CONTROL RESPONSE instruction_id: "control_4"
register {
}
root: DEBUG: CONTROL REQUEST instruction_id: "bundle_1211"
process_bundle {
process_bundle_descriptor_reference: "3"
}
root: INFO: start <DoOperation assert_that/Match output_tags=['out']>
root: INFO: start <DoOperation assert_that/Unkey output_tags=['out']>
root: INFO: start <DoOperation assert_that/Group/Map(_merge_tagged_vals_under_key) output_tags=['out']>
root: INFO: start <DataInputOperation assert_that/Group/GroupByKey/Read receivers=[ConsumerSet[assert_that/Group/GroupByKey/Read.out0, coder=WindowedValueCoder[TupleCoder[LengthPrefixCoder[FastPrimitivesCoder], IterableCoder[LengthPrefixCoder[FastPrimitivesCoder]]]], len(consumers)=1]]>
root: INFO: finish <DataInputOperation assert_that/Group/GroupByKey/Read receivers=[ConsumerSet[assert_that/Group/GroupByKey/Read.out0, coder=WindowedValueCoder[TupleCoder[LengthPrefixCoder[FastPrimitivesCoder], IterableCoder[LengthPrefixCoder[FastPrimitivesCoder]]]], len(consumers)=1]]>
root: INFO: finish <DoOperation assert_that/Group/Map(_merge_tagged_vals_under_key) output_tags=['out'], receivers=[ConsumerSet[assert_that/Group/Map(_merge_tagged_vals_under_key).out0, coder=WindowedValueCoder[FastPrimitivesCoder], len(consumers)=1]]>
root: INFO: finish <DoOperation assert_that/Unkey output_tags=['out'], receivers=[ConsumerSet[assert_that/Unkey.out0, coder=WindowedValueCoder[FastPrimitivesCoder], len(consumers)=1]]>
root: INFO: finish <DoOperation assert_that/Match output_tags=['out'], receivers=[ConsumerSet[assert_that/Match.out0, coder=WindowedValueCoder[FastPrimitivesCoder], len(consumers)=0]]>
root: DEBUG: CONTROL RESPONSE instruction_id: "bundle_1211"
process_bundle {
metrics {
ptransforms {
key: "assert_that/Group/GroupByKey/Read"
value {
processed_elements {
measured {
output_element_counts {
key: "None"
value: 1
}
}
}
}
}
ptransforms {
key: "assert_that/Group/Map(_merge_tagged_vals_under_key)"
value {
processed_elements {
measured {
output_element_counts {
key: "None"
value: 1
}
}
}
}
}
ptransforms {
key: "assert_that/Match"
value {
processed_elements {
measured {
output_element_counts {
key: "None"
value: 1
}
}
}
}
}
ptransforms {
key: "assert_that/Unkey"
value {
processed_elements {
measured {
output_element_counts {
key: "None"
value: 1
}
}
}
}
}
}
}
root: DEBUG: Gather all output data from [].
root: DEBUG: Wait for the bundle to finish.
--------------------- >> end captured logging << ---------------------
======================================================================
FAIL: test_using_slow_impl (apache_beam.coders.slow_coders_test.SlowCoders)
----------------------------------------------------------------------
Traceback (most recent call last):
File "<https://builds.apache.org/job/beam_PostCommit_Python_Verify/ws/src/sdks/python/apache_beam/coders/slow_coders_test.py",> line 41, in test_using_slow_impl
import apache_beam.coders.stream
AssertionError: ImportError not raised
----------------------------------------------------------------------
Ran 1551 tests in 613.584s
FAILED (failures=1, errors=1, skipped=42)
Test failed: <unittest.runner.TextTestResult run=1551 errors=1 failures=1>
error: Test failed: <unittest.runner.TextTestResult run=1551 errors=1 failures=1>
ERROR: InvocationError: '<https://builds.apache.org/job/beam_PostCommit_Python_Verify/ws/src/sdks/python/target/.tox/py27gcp/bin/python> setup.py test'
___________________________________ summary ____________________________________
ERROR: cover: commands failed
docs: commands succeeded
lint: commands succeeded
ERROR: py27: commands failed
ERROR: py27cython: commands failed
ERROR: py27gcp: commands failed
Build step 'Execute shell' marked build as failure
Not sending mail to unregistered user cclauss@bluewin.ch
Not sending mail to unregistered user apilloud@google.com
Not sending mail to unregistered user ccy@google.com
Not sending mail to unregistered user dcavazos@google.com
Build failed in Jenkins: beam_PostCommit_Python_Verify #4254
Posted by Apache Jenkins Server <je...@builds.apache.org>.
See <https://builds.apache.org/job/beam_PostCommit_Python_Verify/4254/display/redirect>
------------------------------------------
[...truncated 1.40 MB...]
value {
spec {
spec {
urn: "beam:coder:varint:v1"
}
}
}
}
coders {
key: "ref_Coder_WindowedValueCoder_1"
value {
spec {
spec {
urn: "beam:coder:windowed_value:v1"
}
}
component_coder_ids: "ref_Coder_TupleCoder_2"
component_coder_ids: "ref_Coder_GlobalWindowCoder_5"
}
}
coders {
key: "ref_Coder_WindowedValueCoder_11"
value {
spec {
spec {
urn: "beam:coder:windowed_value:v1"
}
}
component_coder_ids: "ref_Coder_TupleCoder_12"
component_coder_ids: "ref_Coder_GlobalWindowCoder_5"
}
}
coders {
key: "ref_Coder_WindowedValueCoder_13"
value {
spec {
spec {
urn: "beam:coder:windowed_value:v1"
}
}
component_coder_ids: "ref_Coder_TupleCoder_14"
component_coder_ids: "ref_Coder_GlobalWindowCoder_5"
}
}
coders {
key: "ref_Coder_WindowedValueCoder_15"
value {
spec {
spec {
urn: "beam:coder:windowed_value:v1"
}
}
component_coder_ids: "ref_Coder_TupleCoder_16"
component_coder_ids: "ref_Coder_GlobalWindowCoder_5"
}
}
coders {
key: "ref_Coder_WindowedValueCoder_1_bytes"
value {
spec {
spec {
urn: "beam:coder:windowed_value:v1"
}
}
component_coder_ids: "ref_Coder_TupleCoder_2_bytes"
component_coder_ids: "ref_Coder_GlobalWindowCoder_5"
}
}
coders {
key: "ref_Coder_WindowedValueCoder_1_len_prefix"
value {
spec {
spec {
urn: "beam:coder:windowed_value:v1"
}
}
component_coder_ids: "ref_Coder_TupleCoder_2_len_prefix"
component_coder_ids: "ref_Coder_GlobalWindowCoder_5"
}
}
coders {
key: "ref_Coder_WindowedValueCoder_6"
value {
spec {
spec {
urn: "beam:coder:windowed_value:v1"
}
}
component_coder_ids: "ref_Coder_FastPrimitivesCoder_3"
component_coder_ids: "ref_Coder_GlobalWindowCoder_5"
}
}
coders {
key: "ref_Coder_WindowedValueCoder_7"
value {
spec {
spec {
urn: "beam:coder:windowed_value:v1"
}
}
component_coder_ids: "ref_Coder_VarIntCoder_8"
component_coder_ids: "ref_Coder_GlobalWindowCoder_5"
}
}
coders {
key: "ref_Coder_WindowedValueCoder_9"
value {
spec {
spec {
urn: "beam:coder:windowed_value:v1"
}
}
component_coder_ids: "ref_Coder_TupleCoder_10"
component_coder_ids: "ref_Coder_GlobalWindowCoder_5"
}
}
coders {
key: "ref_Coder_WindowedValueCoder_9_bytes"
value {
spec {
spec {
urn: "beam:coder:windowed_value:v1"
}
}
component_coder_ids: "ref_Coder_TupleCoder_10_bytes"
component_coder_ids: "ref_Coder_GlobalWindowCoder_5"
}
}
coders {
key: "ref_Coder_WindowedValueCoder_9_len_prefix"
value {
spec {
spec {
urn: "beam:coder:windowed_value:v1"
}
}
component_coder_ids: "ref_Coder_TupleCoder_10_len_prefix"
component_coder_ids: "ref_Coder_GlobalWindowCoder_5"
}
}
}
}
root: DEBUG: CONTROL RESPONSE instruction_id: "control_4"
register {
}
root: DEBUG: CONTROL REQUEST instruction_id: "bundle_1210"
process_bundle {
process_bundle_descriptor_reference: "3"
}
root: INFO: start <DoOperation assert_that/Match output_tags=['out']>
root: INFO: start <DoOperation assert_that/Unkey output_tags=['out']>
root: INFO: start <DoOperation assert_that/Group/Map(_merge_tagged_vals_under_key) output_tags=['out']>
root: INFO: start <DataInputOperation assert_that/Group/GroupByKey/Read receivers=[ConsumerSet[assert_that/Group/GroupByKey/Read.out0, coder=WindowedValueCoder[TupleCoder[LengthPrefixCoder[FastPrimitivesCoder], IterableCoder[LengthPrefixCoder[FastPrimitivesCoder]]]], len(consumers)=1]]>
root: INFO: finish <DataInputOperation assert_that/Group/GroupByKey/Read receivers=[ConsumerSet[assert_that/Group/GroupByKey/Read.out0, coder=WindowedValueCoder[TupleCoder[LengthPrefixCoder[FastPrimitivesCoder], IterableCoder[LengthPrefixCoder[FastPrimitivesCoder]]]], len(consumers)=1]]>
root: INFO: finish <DoOperation assert_that/Group/Map(_merge_tagged_vals_under_key) output_tags=['out'], receivers=[ConsumerSet[assert_that/Group/Map(_merge_tagged_vals_under_key).out0, coder=WindowedValueCoder[FastPrimitivesCoder], len(consumers)=1]]>
root: INFO: finish <DoOperation assert_that/Unkey output_tags=['out'], receivers=[ConsumerSet[assert_that/Unkey.out0, coder=WindowedValueCoder[FastPrimitivesCoder], len(consumers)=1]]>
root: INFO: finish <DoOperation assert_that/Match output_tags=['out'], receivers=[ConsumerSet[assert_that/Match.out0, coder=WindowedValueCoder[FastPrimitivesCoder], len(consumers)=0]]>
root: DEBUG: CONTROL RESPONSE instruction_id: "bundle_1210"
process_bundle {
metrics {
ptransforms {
key: "assert_that/Group/GroupByKey/Read"
value {
processed_elements {
measured {
output_element_counts {
key: "None"
value: 1
}
}
}
}
}
ptransforms {
key: "assert_that/Group/Map(_merge_tagged_vals_under_key)"
value {
processed_elements {
measured {
output_element_counts {
key: "None"
value: 1
}
}
}
}
}
ptransforms {
key: "assert_that/Match"
value {
processed_elements {
measured {
output_element_counts {
key: "None"
value: 1
}
}
}
}
}
ptransforms {
key: "assert_that/Unkey"
value {
processed_elements {
measured {
output_element_counts {
key: "None"
value: 1
}
}
}
}
}
}
}
root: DEBUG: Gather all output data from [].
root: DEBUG: Wait for the bundle to finish.
--------------------- >> end captured logging << ---------------------
======================================================================
FAIL: test_using_slow_impl (apache_beam.coders.slow_coders_test.SlowCoders)
----------------------------------------------------------------------
Traceback (most recent call last):
File "<https://builds.apache.org/job/beam_PostCommit_Python_Verify/ws/src/sdks/python/apache_beam/coders/slow_coders_test.py",> line 41, in test_using_slow_impl
import apache_beam.coders.stream
AssertionError: ImportError not raised
----------------------------------------------------------------------
Ran 1551 tests in 620.624s
FAILED (failures=1, errors=1, skipped=42)
Test failed: <unittest.runner.TextTestResult run=1551 errors=1 failures=1>
error: Test failed: <unittest.runner.TextTestResult run=1551 errors=1 failures=1>
ERROR: InvocationError: '<https://builds.apache.org/job/beam_PostCommit_Python_Verify/ws/src/sdks/python/target/.tox/py27gcp/bin/python> setup.py test'
___________________________________ summary ____________________________________
ERROR: cover: commands failed
docs: commands succeeded
lint: commands succeeded
ERROR: py27: commands failed
ERROR: py27cython: commands failed
ERROR: py27gcp: commands failed
Build step 'Execute shell' marked build as failure
Not sending mail to unregistered user cclauss@bluewin.ch
Not sending mail to unregistered user apilloud@google.com
Not sending mail to unregistered user ccy@google.com
Not sending mail to unregistered user dcavazos@google.com
Build failed in Jenkins: beam_PostCommit_Python_Verify #4253
Posted by Apache Jenkins Server <je...@builds.apache.org>.
See <https://builds.apache.org/job/beam_PostCommit_Python_Verify/4253/display/redirect>
------------------------------------------
[...truncated 1.40 MB...]
value {
spec {
spec {
urn: "beam:coder:varint:v1"
}
}
}
}
coders {
key: "ref_Coder_WindowedValueCoder_1"
value {
spec {
spec {
urn: "beam:coder:windowed_value:v1"
}
}
component_coder_ids: "ref_Coder_VarIntCoder_2"
component_coder_ids: "ref_Coder_GlobalWindowCoder_3"
}
}
coders {
key: "ref_Coder_WindowedValueCoder_10"
value {
spec {
spec {
urn: "beam:coder:windowed_value:v1"
}
}
component_coder_ids: "ref_Coder_TupleCoder_11"
component_coder_ids: "ref_Coder_GlobalWindowCoder_3"
}
}
coders {
key: "ref_Coder_WindowedValueCoder_12"
value {
spec {
spec {
urn: "beam:coder:windowed_value:v1"
}
}
component_coder_ids: "ref_Coder_TupleCoder_13"
component_coder_ids: "ref_Coder_GlobalWindowCoder_3"
}
}
coders {
key: "ref_Coder_WindowedValueCoder_14"
value {
spec {
spec {
urn: "beam:coder:windowed_value:v1"
}
}
component_coder_ids: "ref_Coder_TupleCoder_15"
component_coder_ids: "ref_Coder_GlobalWindowCoder_3"
}
}
coders {
key: "ref_Coder_WindowedValueCoder_14_bytes"
value {
spec {
spec {
urn: "beam:coder:windowed_value:v1"
}
}
component_coder_ids: "ref_Coder_TupleCoder_15_bytes"
component_coder_ids: "ref_Coder_GlobalWindowCoder_3"
}
}
coders {
key: "ref_Coder_WindowedValueCoder_14_len_prefix"
value {
spec {
spec {
urn: "beam:coder:windowed_value:v1"
}
}
component_coder_ids: "ref_Coder_TupleCoder_15_len_prefix"
component_coder_ids: "ref_Coder_GlobalWindowCoder_3"
}
}
coders {
key: "ref_Coder_WindowedValueCoder_4"
value {
spec {
spec {
urn: "beam:coder:windowed_value:v1"
}
}
component_coder_ids: "ref_Coder_FastPrimitivesCoder_5"
component_coder_ids: "ref_Coder_GlobalWindowCoder_3"
}
}
coders {
key: "ref_Coder_WindowedValueCoder_6"
value {
spec {
spec {
urn: "beam:coder:windowed_value:v1"
}
}
component_coder_ids: "ref_Coder_TupleCoder_7"
component_coder_ids: "ref_Coder_GlobalWindowCoder_3"
}
}
coders {
key: "ref_Coder_WindowedValueCoder_6_bytes"
value {
spec {
spec {
urn: "beam:coder:windowed_value:v1"
}
}
component_coder_ids: "ref_Coder_TupleCoder_7_bytes"
component_coder_ids: "ref_Coder_GlobalWindowCoder_3"
}
}
coders {
key: "ref_Coder_WindowedValueCoder_6_len_prefix"
value {
spec {
spec {
urn: "beam:coder:windowed_value:v1"
}
}
component_coder_ids: "ref_Coder_TupleCoder_7_len_prefix"
component_coder_ids: "ref_Coder_GlobalWindowCoder_3"
}
}
coders {
key: "ref_Coder_WindowedValueCoder_8"
value {
spec {
spec {
urn: "beam:coder:windowed_value:v1"
}
}
component_coder_ids: "ref_Coder_TupleCoder_9"
component_coder_ids: "ref_Coder_GlobalWindowCoder_3"
}
}
}
}
root: DEBUG: CONTROL RESPONSE instruction_id: "control_4"
register {
}
root: DEBUG: CONTROL REQUEST instruction_id: "bundle_1211"
process_bundle {
process_bundle_descriptor_reference: "3"
}
root: INFO: start <DoOperation assert_that/Match output_tags=['out']>
root: INFO: start <DoOperation assert_that/Unkey output_tags=['out']>
root: INFO: start <DoOperation assert_that/Group/Map(_merge_tagged_vals_under_key) output_tags=['out']>
root: INFO: start <DataInputOperation assert_that/Group/GroupByKey/Read receivers=[ConsumerSet[assert_that/Group/GroupByKey/Read.out0, coder=WindowedValueCoder[TupleCoder[LengthPrefixCoder[FastPrimitivesCoder], IterableCoder[LengthPrefixCoder[FastPrimitivesCoder]]]], len(consumers)=1]]>
root: INFO: finish <DataInputOperation assert_that/Group/GroupByKey/Read receivers=[ConsumerSet[assert_that/Group/GroupByKey/Read.out0, coder=WindowedValueCoder[TupleCoder[LengthPrefixCoder[FastPrimitivesCoder], IterableCoder[LengthPrefixCoder[FastPrimitivesCoder]]]], len(consumers)=1]]>
root: INFO: finish <DoOperation assert_that/Group/Map(_merge_tagged_vals_under_key) output_tags=['out'], receivers=[ConsumerSet[assert_that/Group/Map(_merge_tagged_vals_under_key).out0, coder=WindowedValueCoder[FastPrimitivesCoder], len(consumers)=1]]>
root: INFO: finish <DoOperation assert_that/Unkey output_tags=['out'], receivers=[ConsumerSet[assert_that/Unkey.out0, coder=WindowedValueCoder[FastPrimitivesCoder], len(consumers)=1]]>
root: INFO: finish <DoOperation assert_that/Match output_tags=['out'], receivers=[ConsumerSet[assert_that/Match.out0, coder=WindowedValueCoder[FastPrimitivesCoder], len(consumers)=0]]>
root: DEBUG: CONTROL RESPONSE instruction_id: "bundle_1211"
process_bundle {
metrics {
ptransforms {
key: "assert_that/Group/GroupByKey/Read"
value {
processed_elements {
measured {
output_element_counts {
key: "None"
value: 1
}
}
}
}
}
ptransforms {
key: "assert_that/Group/Map(_merge_tagged_vals_under_key)"
value {
processed_elements {
measured {
output_element_counts {
key: "None"
value: 1
}
}
}
}
}
ptransforms {
key: "assert_that/Match"
value {
processed_elements {
measured {
output_element_counts {
key: "None"
value: 1
}
}
}
}
}
ptransforms {
key: "assert_that/Unkey"
value {
processed_elements {
measured {
output_element_counts {
key: "None"
value: 1
}
}
}
}
}
}
}
root: DEBUG: Gather all output data from [].
root: DEBUG: Wait for the bundle to finish.
--------------------- >> end captured logging << ---------------------
======================================================================
FAIL: test_using_slow_impl (apache_beam.coders.slow_coders_test.SlowCoders)
----------------------------------------------------------------------
Traceback (most recent call last):
File "<https://builds.apache.org/job/beam_PostCommit_Python_Verify/ws/src/sdks/python/apache_beam/coders/slow_coders_test.py",> line 41, in test_using_slow_impl
import apache_beam.coders.stream
AssertionError: ImportError not raised
----------------------------------------------------------------------
Ran 1551 tests in 856.596s
FAILED (failures=1, errors=1, skipped=42)
Test failed: <unittest.runner.TextTestResult run=1551 errors=1 failures=1>
error: Test failed: <unittest.runner.TextTestResult run=1551 errors=1 failures=1>
ERROR: InvocationError: '<https://builds.apache.org/job/beam_PostCommit_Python_Verify/ws/src/sdks/python/target/.tox/py27gcp/bin/python> setup.py test'
___________________________________ summary ____________________________________
ERROR: cover: commands failed
docs: commands succeeded
lint: commands succeeded
ERROR: py27: commands failed
ERROR: py27cython: commands failed
ERROR: py27gcp: commands failed
Build step 'Execute shell' marked build as failure
Not sending mail to unregistered user ccy@google.com
Not sending mail to unregistered user apilloud@google.com
Not sending mail to unregistered user dcavazos@google.com
Not sending mail to unregistered user cclauss@bluewin.ch