You are viewing a plain text version of this content. The canonical link for it is here.
Posted to builds@cassandra.apache.org by Apache Jenkins Server <je...@builds.apache.org> on 2026/03/06 14:38:55 UTC
Build complete: Cassandra-4.0 #823 [UNSTABLE] 547187a2295581e085c69b90ca7ef428295e9a51
-------------------------------------------------------------------------------
Build Cassandra-4.0 #823 Still Unstable
URL: https://ci-cassandra.apache.org/job/Cassandra-4.0/823/
-------------------------------------------------------------------------------
Changes:
[Stefan Miklosovic] Obsolete expired SSTables before compaction starts
-------------------------------------------------------------------------------
Failed Tests:
8 tests failed.
FAILED: dtest-offheap.pushed_notifications_test.TestPushedNotifications.test_schema_changes
FAILED: org.apache.cassandra.distributed.upgrade.DropCompactStorageTest.testDropCompactStorage
FAILED: org.apache.cassandra.cql3.ViewFilteringSimplePKTest.testPartitionKeyFilteringUnrestrictedPart[3]
FAILED: org.apache.cassandra.cql3.ViewFilteringSimplePKTest.testPartitionKeyFilteringWithSlice[3]
FAILED: org.apache.cassandra.cql3.validation.entities.SecondaryIndexTest.testIndexesOnNonStaticColumnsWhereSchemaIncludesStaticColumns
FAILED: org.apache.cassandra.cql3.validation.entities.SecondaryIndexTest.droppingIndexInvalidatesPreparedStatements
FAILED: org.apache.cassandra.db.compaction.CompactionTaskTest.testFullyExpiredSSTablesAreNotReleasedPrematurely-cdc
FAILED: dtest-offheap.secondary_indexes_test.TestSecondaryIndexes.test_6924_dropping_ks
-------------------------------------------------------------------------------
For complete test report and logs see https://nightlies.apache.org/cassandra/Cassandra-4.0/823/