You are viewing a plain text version of this content. The canonical link for it is here.
Posted to yarn-dev@hadoop.apache.org by Apache Jenkins Server <je...@builds.apache.org> on 2015/08/04 06:28:26 UTC
Failed: YARN-3697 PreCommit Build #8761
Jira: https://issues.apache.org/jira/browse/YARN-3697
Build: https://builds.apache.org/job/PreCommit-YARN-Build/8761/
###################################################################################
########################## LAST 60 LINES OF THE CONSOLE ###########################
[...truncated 283 lines...]
| | | | issues.
| +1 | whitespace | 0m 0s | The patch has no lines that end in
| | | | whitespace.
| +1 | install | 1m 23s | mvn install still works.
| +1 | eclipse:eclipse | 0m 33s | The patch built with
| | | | eclipse:eclipse.
| +1 | findbugs | 1m 30s | The patch does not introduce any
| | | | new Findbugs (version 3.0.0)
| | | | warnings.
| -1 | yarn tests | 53m 4s | Tests failed in
| | | | hadoop-yarn-server-resourcemanager.
| | | 91m 56s |
Reason | Tests
Failed unit tests | hadoop.yarn.server.resourcemanager.security.TestRMDelegationTokens
|| Subsystem || Report/Notes ||
============================================================================
| Patch URL | http://issues.apache.org/jira/secure/attachment/12748585/YARN-3697.000.patch |
| Optional Tests | javadoc javac unit findbugs checkstyle |
| git revision | trunk / c3364ca |
| hadoop-yarn-server-resourcemanager test log | /home/jenkins/jenkins-slave/workspace/PreCommit-YARN-Build/patchprocess/testrun_hadoop-yarn-server-resourcemanager.txt |
| Test Results | https://builds.apache.org/job/PreCommit-YARN-Build/8761/testReport/ |
| Java | 1.7.0_55 |
| uname | Linux asf903.gq1.ygridcore.net 3.13.0-36-lowlatency #63-Ubuntu SMP PREEMPT Wed Sep 3 21:56:12 UTC 2014 x86_64 x86_64 x86_64 GNU/Linux |
============================================================================
============================================================================
Adding comment to JIRA
============================================================================
============================================================================
Comment added.
461e4f8728fe8eba28148f092f8a08a84fdce77d logged out
============================================================================
============================================================================
Finished build.
============================================================================
============================================================================
Build step 'Execute shell' marked build as failure
Archiving artifacts
Sending artifact delta relative to PreCommit-YARN-Build #8752
Archived 29 artifacts
Archive block size is 32768
Received 80 blocks and 10375684 bytes
Compression is 20.2%
Took 2.3 sec
[description-setter] Could not determine description.
Recording test results
Email was triggered for: Failure
Sending email for trigger: Failure
###################################################################################
############################## FAILED TESTS (if any) ##############################
1 tests failed.
FAILED: org.apache.hadoop.yarn.server.resourcemanager.security.TestRMDelegationTokens.testRMDTMasterKeyStateOnRollingMasterKey
Error Message:
null
Stack Trace:
java.lang.AssertionError: null
at org.junit.Assert.fail(Assert.java:86)
at org.junit.Assert.assertTrue(Assert.java:41)
at org.junit.Assert.assertTrue(Assert.java:52)
at org.apache.hadoop.yarn.server.resourcemanager.security.TestRMDelegationTokens$TestRMDelegationTokenSecretManager.checkCurrentKeyInStateStore(TestRMDelegationTokens.java:208)
at org.apache.hadoop.yarn.server.resourcemanager.security.TestRMDelegationTokens.testRMDTMasterKeyStateOnRollingMasterKey(TestRMDelegationTokens.java:112)
Success: YARN-4018 PreCommit Build #8763
Posted by Apache Jenkins Server <je...@builds.apache.org>.
Jira: https://issues.apache.org/jira/browse/YARN-4018
Build: https://builds.apache.org/job/PreCommit-YARN-Build/8763/
###################################################################################
########################## LAST 60 LINES OF THE CONSOLE ###########################
[...truncated 278 lines...]
| | | | messages.
| +1 | release audit | 0m 26s | The applied patch does not increase
| | | | the total number of release audit
| | | | warnings.
| +1 | checkstyle | 0m 52s | There were no new checkstyle
| | | | issues.
| +1 | whitespace | 0m 0s | The patch has no lines that end in
| | | | whitespace.
| +1 | install | 1m 24s | mvn install still works.
| +1 | eclipse:eclipse | 0m 32s | The patch built with
| | | | eclipse:eclipse.
| +1 | findbugs | 1m 13s | The patch does not introduce any
| | | | new Findbugs (version 3.0.0)
| | | | warnings.
| +1 | yarn tests | 6m 18s | Tests passed in
| | | | hadoop-yarn-server-nodemanager.
| | | 56m 27s |
|| Subsystem || Report/Notes ||
============================================================================
| Patch URL | http://issues.apache.org/jira/secure/attachment/12748678/YARN-4018.patch |
| Optional Tests | javadoc javac unit findbugs checkstyle |
| git revision | trunk / 9a08999 |
| hadoop-yarn-server-nodemanager test log | /home/jenkins/jenkins-slave/workspace/PreCommit-YARN-Build/patchprocess/testrun_hadoop-yarn-server-nodemanager.txt |
| Test Results | https://builds.apache.org/job/PreCommit-YARN-Build/8763/testReport/ |
| Java | 1.7.0_55 |
| uname | Linux asf904.gq1.ygridcore.net 3.13.0-36-lowlatency #63-Ubuntu SMP PREEMPT Wed Sep 3 21:56:12 UTC 2014 x86_64 x86_64 x86_64 GNU/Linux |
============================================================================
============================================================================
Adding comment to JIRA
============================================================================
============================================================================
Comment added.
2079a39c749d5a310ec67cdb7261eddac00689a2 logged out
============================================================================
============================================================================
Finished build.
============================================================================
============================================================================
Archiving artifacts
Sending artifact delta relative to PreCommit-YARN-Build #8752
Archived 29 artifacts
Archive block size is 32768
Received 38 blocks and 10521273 bytes
Compression is 10.6%
Took 2.4 sec
Description set: YARN-4018
Recording test results
Email was triggered for: Success
Sending email for trigger: Success
###################################################################################
############################## FAILED TESTS (if any) ##############################
All tests passed
Failed: YARN-2884 PreCommit Build #8762
Posted by Apache Jenkins Server <je...@builds.apache.org>.
Jira: https://issues.apache.org/jira/browse/YARN-2884
Build: https://builds.apache.org/job/PreCommit-YARN-Build/8762/
###################################################################################
########################## LAST 60 LINES OF THE CONSOLE ###########################
[...truncated 441 lines...]
| | | | hadoop-yarn-server-common.
| -1 | yarn tests | 6m 7s | Tests failed in
| | | | hadoop-yarn-server-nodemanager.
| +1 | yarn tests | 53m 22s | Tests passed in
| | | | hadoop-yarn-server-resourcemanager.
| | | 115m 43s |
Reason | Tests
Failed unit tests | hadoop.yarn.server.nodemanager.containermanager.logaggregation.TestLogAggregationService
|| Subsystem || Report/Notes ||
============================================================================
| Patch URL | http://issues.apache.org/jira/secure/attachment/12748587/YARN-2884-V8.patch |
| Optional Tests | javadoc javac unit findbugs checkstyle |
| git revision | trunk / c3364ca |
| Pre-patch Findbugs warnings | /home/jenkins/jenkins-slave/workspace/PreCommit-YARN-Build/patchprocess/trunkFindbugsWarningshadoop-yarn-server-common.html |
| checkstyle | /home/jenkins/jenkins-slave/workspace/PreCommit-YARN-Build/patchprocess/diffcheckstylehadoop-yarn-api.txt |
| hadoop-yarn-api test log | /home/jenkins/jenkins-slave/workspace/PreCommit-YARN-Build/patchprocess/testrun_hadoop-yarn-api.txt |
| hadoop-yarn-common test log | /home/jenkins/jenkins-slave/workspace/PreCommit-YARN-Build/patchprocess/testrun_hadoop-yarn-common.txt |
| hadoop-yarn-server-common test log | /home/jenkins/jenkins-slave/workspace/PreCommit-YARN-Build/patchprocess/testrun_hadoop-yarn-server-common.txt |
| hadoop-yarn-server-nodemanager test log | /home/jenkins/jenkins-slave/workspace/PreCommit-YARN-Build/patchprocess/testrun_hadoop-yarn-server-nodemanager.txt |
| hadoop-yarn-server-resourcemanager test log | /home/jenkins/jenkins-slave/workspace/PreCommit-YARN-Build/patchprocess/testrun_hadoop-yarn-server-resourcemanager.txt |
| Test Results | https://builds.apache.org/job/PreCommit-YARN-Build/8762/testReport/ |
| Java | 1.7.0_55 |
| uname | Linux asf904.gq1.ygridcore.net 3.13.0-36-lowlatency #63-Ubuntu SMP PREEMPT Wed Sep 3 21:56:12 UTC 2014 x86_64 x86_64 x86_64 GNU/Linux |
============================================================================
============================================================================
Adding comment to JIRA
============================================================================
============================================================================
Comment added.
a29aab4f0dbc72a682ed87368ce5366876adb634 logged out
============================================================================
============================================================================
Finished build.
============================================================================
============================================================================
Build step 'Execute shell' marked build as failure
Archiving artifacts
Sending artifact delta relative to PreCommit-YARN-Build #8752
Archived 86 artifacts
Archive block size is 32768
Received 51 blocks and 36279128 bytes
Compression is 4.4%
Took 7.2 sec
[description-setter] Could not determine description.
Recording test results
Email was triggered for: Failure
Sending email for trigger: Failure
###################################################################################
############################## FAILED TESTS (if any) ##############################
1 tests failed.
FAILED: org.apache.hadoop.yarn.server.nodemanager.containermanager.logaggregation.TestLogAggregationService.testLogAggregationServiceWithInterval
Error Message:
expected:<-1> but was:<1>
Stack Trace:
java.lang.AssertionError: expected:<-1> but was:<1>
at org.junit.Assert.fail(Assert.java:88)
at org.junit.Assert.failNotEquals(Assert.java:743)
at org.junit.Assert.assertEquals(Assert.java:118)
at org.junit.Assert.assertEquals(Assert.java:555)
at org.junit.Assert.assertEquals(Assert.java:542)
at org.apache.hadoop.yarn.server.nodemanager.containermanager.logaggregation.TestLogAggregationService.testLogAggregationService(TestLogAggregationService.java:1461)
at org.apache.hadoop.yarn.server.nodemanager.containermanager.logaggregation.TestLogAggregationService.testLogAggregationServiceWithInterval(TestLogAggregationService.java:1351)