You are viewing a plain text version of this content. The canonical link for it is here.
Posted to hdfs-dev@hadoop.apache.org by Apache Jenkins Server <hu...@hudson.apache.org> on 2011/05/08 23:03:26 UTC
Hadoop-Hdfs-trunk-Commit - Build # 628 - Still Failing
See https://builds.apache.org/hudson/job/Hadoop-Hdfs-trunk-Commit/628/
###################################################################################
########################## LAST 60 LINES OF THE CONSOLE ###########################
[...truncated 2870 lines...]
[junit] Running org.apache.hadoop.hdfs.server.datanode.TestInterDatanodeProtocol
[junit] Tests run: 3, Failures: 0, Errors: 0, Time elapsed: 4.696 sec
[junit] Running org.apache.hadoop.hdfs.server.datanode.TestSimulatedFSDataset
[junit] Tests run: 8, Failures: 0, Errors: 0, Time elapsed: 0.706 sec
[junit] Running org.apache.hadoop.hdfs.server.namenode.TestBackupNode
[junit] Tests run: 2, Failures: 0, Errors: 0, Time elapsed: 17.472 sec
[junit] Running org.apache.hadoop.hdfs.server.namenode.TestCheckpoint
[junit] Tests run: 4, Failures: 0, Errors: 0, Time elapsed: 29.645 sec
[junit] Running org.apache.hadoop.hdfs.server.namenode.TestComputeInvalidateWork
[junit] Tests run: 1, Failures: 0, Errors: 0, Time elapsed: 4.713 sec
[junit] Running org.apache.hadoop.hdfs.server.namenode.TestDatanodeDescriptor
[junit] Tests run: 2, Failures: 0, Errors: 0, Time elapsed: 0.157 sec
[junit] Running org.apache.hadoop.hdfs.server.namenode.TestEditLog
[junit] Tests run: 4, Failures: 0, Errors: 0, Time elapsed: 12.017 sec
[junit] Running org.apache.hadoop.hdfs.server.namenode.TestFileLimit
[junit] Tests run: 2, Failures: 0, Errors: 0, Time elapsed: 4.601 sec
[junit] Running org.apache.hadoop.hdfs.server.namenode.TestHeartbeatHandling
[junit] Tests run: 1, Failures: 0, Errors: 0, Time elapsed: 2.954 sec
[junit] Running org.apache.hadoop.hdfs.server.namenode.TestHost2NodesMap
[junit] Tests run: 4, Failures: 0, Errors: 0, Time elapsed: 0.085 sec
[junit] Running org.apache.hadoop.hdfs.server.namenode.TestNamenodeCapacityReport
[junit] Tests run: 1, Failures: 0, Errors: 0, Time elapsed: 2.645 sec
[junit] Running org.apache.hadoop.hdfs.server.namenode.TestOverReplicatedBlocks
[junit] Tests run: 1, Failures: 0, Errors: 0, Time elapsed: 3.539 sec
[junit] Running org.apache.hadoop.hdfs.server.namenode.TestPendingReplication
[junit] Tests run: 1, Failures: 0, Errors: 0, Time elapsed: 7.308 sec
[junit] Running org.apache.hadoop.hdfs.server.namenode.TestReplicationPolicy
[junit] Tests run: 8, Failures: 0, Errors: 0, Time elapsed: 0.058 sec
[junit] Running org.apache.hadoop.hdfs.server.namenode.TestSafeMode
[junit] Tests run: 2, Failures: 0, Errors: 0, Time elapsed: 8.415 sec
[junit] Running org.apache.hadoop.hdfs.server.namenode.TestStartup
[junit] Tests run: 5, Failures: 0, Errors: 0, Time elapsed: 9.495 sec
[junit] Running org.apache.hadoop.hdfs.server.namenode.TestStorageRestore
[junit] Tests run: 2, Failures: 0, Errors: 0, Time elapsed: 7.863 sec
[junit] Running org.apache.hadoop.net.TestNetworkTopology
[junit] Tests run: 8, Failures: 0, Errors: 0, Time elapsed: 0.114 sec
[junit] Running org.apache.hadoop.security.TestPermission
[junit] Tests run: 3, Failures: 0, Errors: 0, Time elapsed: 4.819 sec
checkfailure:
[touch] Creating /grid/0/hudson/hudson-slave/workspace/Hadoop-Hdfs-trunk-Commit/trunk/build/test/testsfailed
BUILD FAILED
/grid/0/hudson/hudson-slave/workspace/Hadoop-Hdfs-trunk-Commit/trunk/build.xml:706: The following error occurred while executing this line:
/grid/0/hudson/hudson-slave/workspace/Hadoop-Hdfs-trunk-Commit/trunk/build.xml:663: The following error occurred while executing this line:
/grid/0/hudson/hudson-slave/workspace/Hadoop-Hdfs-trunk-Commit/trunk/build.xml:731: Tests failed!
Total time: 9 minutes 1 second
[FINDBUGS] Skipping publisher since build result is FAILURE
Recording fingerprints
Archiving artifacts
Recording test results
Publishing Javadoc
Error updating JIRA issues. Saving issues for next build.
JIRA is currently being reindexed. Depending on how large the database is, this may take a few minutes. Jira will automatically become available as soon as this task is complete.
Publishing Clover coverage report...
No Clover report will be published due to a Build Failure
Email was triggered for: Failure
Sending email for trigger: Failure
###################################################################################
############################## FAILED TESTS (if any) ##############################
2 tests failed.
REGRESSION: org.apache.hadoop.hdfs.TestDFSShell.testErrOutPut
Error Message:
-mkdir returned -1
Stack Trace:
junit.framework.AssertionFailedError: -mkdir returned -1
at org.apache.hadoop.hdfs.TestDFSShell.__CLR3_0_2yogg6zvg9(TestDFSShell.java:392)
at org.apache.hadoop.hdfs.TestDFSShell.testErrOutPut(TestDFSShell.java:308)
FAILED: org.apache.hadoop.cli.TestHDFSCLI.testAll
Error Message:
One of the tests failed. See the Detailed results to identify the command that failed
Stack Trace:
junit.framework.AssertionFailedError: One of the tests failed. See the Detailed results to identify the command that failed
at org.apache.hadoop.cli.CLITestHelper.displayResults(CLITestHelper.java:264)
at org.apache.hadoop.cli.CLITestHelper.tearDown(CLITestHelper.java:126)
at org.apache.hadoop.cli.TestHDFSCLI.tearDown(TestHDFSCLI.java:81)
Hadoop-Hdfs-trunk-Commit - Build # 636 - Still Failing
Posted by Apache Jenkins Server <hu...@hudson.apache.org>.
See https://builds.apache.org/hudson/job/Hadoop-Hdfs-trunk-Commit/636/
###################################################################################
########################## LAST 60 LINES OF THE CONSOLE ###########################
[...truncated 2879 lines...]
[junit] Running org.apache.hadoop.hdfs.server.datanode.TestDiskError
[junit] Tests run: 3, Failures: 0, Errors: 0, Time elapsed: 8.667 sec
[junit] Running org.apache.hadoop.hdfs.server.datanode.TestInterDatanodeProtocol
[junit] Tests run: 3, Failures: 0, Errors: 0, Time elapsed: 4.677 sec
[junit] Running org.apache.hadoop.hdfs.server.datanode.TestSimulatedFSDataset
[junit] Tests run: 8, Failures: 0, Errors: 0, Time elapsed: 0.726 sec
[junit] Running org.apache.hadoop.hdfs.server.namenode.TestBackupNode
[junit] Tests run: 2, Failures: 0, Errors: 0, Time elapsed: 17.174 sec
[junit] Running org.apache.hadoop.hdfs.server.namenode.TestCheckpoint
[junit] Tests run: 4, Failures: 0, Errors: 0, Time elapsed: 29.422 sec
[junit] Running org.apache.hadoop.hdfs.server.namenode.TestComputeInvalidateWork
[junit] Tests run: 1, Failures: 0, Errors: 0, Time elapsed: 4.652 sec
[junit] Running org.apache.hadoop.hdfs.server.namenode.TestDatanodeDescriptor
[junit] Tests run: 2, Failures: 0, Errors: 0, Time elapsed: 0.161 sec
[junit] Running org.apache.hadoop.hdfs.server.namenode.TestEditLog
[junit] Tests run: 4, Failures: 0, Errors: 0, Time elapsed: 11.809 sec
[junit] Running org.apache.hadoop.hdfs.server.namenode.TestFileLimit
[junit] Tests run: 2, Failures: 0, Errors: 0, Time elapsed: 4.176 sec
[junit] Running org.apache.hadoop.hdfs.server.namenode.TestHeartbeatHandling
[junit] Tests run: 1, Failures: 0, Errors: 0, Time elapsed: 2.994 sec
[junit] Running org.apache.hadoop.hdfs.server.namenode.TestHost2NodesMap
[junit] Tests run: 4, Failures: 0, Errors: 0, Time elapsed: 0.084 sec
[junit] Running org.apache.hadoop.hdfs.server.namenode.TestNamenodeCapacityReport
[junit] Tests run: 1, Failures: 0, Errors: 0, Time elapsed: 2.928 sec
[junit] Running org.apache.hadoop.hdfs.server.namenode.TestOverReplicatedBlocks
[junit] Tests run: 1, Failures: 0, Errors: 0, Time elapsed: 3.819 sec
[junit] Running org.apache.hadoop.hdfs.server.namenode.TestPendingReplication
[junit] Tests run: 1, Failures: 0, Errors: 0, Time elapsed: 7.314 sec
[junit] Running org.apache.hadoop.hdfs.server.namenode.TestReplicationPolicy
[junit] Tests run: 8, Failures: 0, Errors: 0, Time elapsed: 0.056 sec
[junit] Running org.apache.hadoop.hdfs.server.namenode.TestSafeMode
[junit] Tests run: 2, Failures: 0, Errors: 0, Time elapsed: 8.132 sec
[junit] Running org.apache.hadoop.hdfs.server.namenode.TestStartup
[junit] Tests run: 5, Failures: 0, Errors: 0, Time elapsed: 9.599 sec
[junit] Running org.apache.hadoop.hdfs.server.namenode.TestStorageRestore
[junit] Tests run: 2, Failures: 0, Errors: 0, Time elapsed: 7.779 sec
[junit] Running org.apache.hadoop.net.TestNetworkTopology
[junit] Tests run: 8, Failures: 0, Errors: 0, Time elapsed: 0.117 sec
[junit] Running org.apache.hadoop.security.TestPermission
[junit] Tests run: 3, Failures: 0, Errors: 0, Time elapsed: 4.853 sec
checkfailure:
[touch] Creating /grid/0/hudson/hudson-slave/workspace/Hadoop-Hdfs-trunk-Commit/trunk/build/test/testsfailed
BUILD FAILED
/grid/0/hudson/hudson-slave/workspace/Hadoop-Hdfs-trunk-Commit/trunk/build.xml:706: The following error occurred while executing this line:
/grid/0/hudson/hudson-slave/workspace/Hadoop-Hdfs-trunk-Commit/trunk/build.xml:663: The following error occurred while executing this line:
/grid/0/hudson/hudson-slave/workspace/Hadoop-Hdfs-trunk-Commit/trunk/build.xml:731: Tests failed!
Total time: 8 minutes 52 seconds
[FINDBUGS] Skipping publisher since build result is FAILURE
Recording fingerprints
Archiving artifacts
Recording test results
Publishing Javadoc
Publishing Clover coverage report...
No Clover report will be published due to a Build Failure
Email was triggered for: Failure
Sending email for trigger: Failure
###################################################################################
############################## FAILED TESTS (if any) ##############################
2 tests failed.
FAILED: org.apache.hadoop.cli.TestHDFSCLI.testAll
Error Message:
One of the tests failed. See the Detailed results to identify the command that failed
Stack Trace:
junit.framework.AssertionFailedError: One of the tests failed. See the Detailed results to identify the command that failed
at org.apache.hadoop.cli.CLITestHelper.displayResults(CLITestHelper.java:264)
at org.apache.hadoop.cli.CLITestHelper.tearDown(CLITestHelper.java:126)
at org.apache.hadoop.cli.TestHDFSCLI.tearDown(TestHDFSCLI.java:81)
FAILED: org.apache.hadoop.hdfs.TestDFSShell.testErrOutPut
Error Message:
-cat returned -1
Stack Trace:
junit.framework.AssertionFailedError: -cat returned -1
at org.apache.hadoop.hdfs.TestDFSShell.__CLR3_0_2yogg6zvyb(TestDFSShell.java:324)
at org.apache.hadoop.hdfs.TestDFSShell.testErrOutPut(TestDFSShell.java:308)
Hadoop-Hdfs-trunk-Commit - Build # 635 - Still Failing
Posted by Apache Jenkins Server <hu...@hudson.apache.org>.
See https://builds.apache.org/hudson/job/Hadoop-Hdfs-trunk-Commit/635/
###################################################################################
########################## LAST 60 LINES OF THE CONSOLE ###########################
[...truncated 2872 lines...]
[junit] Running org.apache.hadoop.hdfs.server.datanode.TestDiskError
[junit] Tests run: 3, Failures: 0, Errors: 0, Time elapsed: 8.075 sec
[junit] Running org.apache.hadoop.hdfs.server.datanode.TestInterDatanodeProtocol
[junit] Tests run: 3, Failures: 0, Errors: 0, Time elapsed: 4.339 sec
[junit] Running org.apache.hadoop.hdfs.server.datanode.TestSimulatedFSDataset
[junit] Tests run: 8, Failures: 0, Errors: 0, Time elapsed: 0.732 sec
[junit] Running org.apache.hadoop.hdfs.server.namenode.TestBackupNode
[junit] Tests run: 2, Failures: 0, Errors: 0, Time elapsed: 16.392 sec
[junit] Running org.apache.hadoop.hdfs.server.namenode.TestCheckpoint
[junit] Tests run: 4, Failures: 0, Errors: 0, Time elapsed: 28.458 sec
[junit] Running org.apache.hadoop.hdfs.server.namenode.TestComputeInvalidateWork
[junit] Tests run: 1, Failures: 0, Errors: 0, Time elapsed: 4.587 sec
[junit] Running org.apache.hadoop.hdfs.server.namenode.TestDatanodeDescriptor
[junit] Tests run: 2, Failures: 0, Errors: 0, Time elapsed: 0.165 sec
[junit] Running org.apache.hadoop.hdfs.server.namenode.TestEditLog
[junit] Tests run: 4, Failures: 0, Errors: 0, Time elapsed: 11.387 sec
[junit] Running org.apache.hadoop.hdfs.server.namenode.TestFileLimit
[junit] Tests run: 2, Failures: 0, Errors: 0, Time elapsed: 4.096 sec
[junit] Running org.apache.hadoop.hdfs.server.namenode.TestHeartbeatHandling
[junit] Tests run: 1, Failures: 0, Errors: 0, Time elapsed: 2.876 sec
[junit] Running org.apache.hadoop.hdfs.server.namenode.TestHost2NodesMap
[junit] Tests run: 4, Failures: 0, Errors: 0, Time elapsed: 0.083 sec
[junit] Running org.apache.hadoop.hdfs.server.namenode.TestNamenodeCapacityReport
[junit] Tests run: 1, Failures: 0, Errors: 0, Time elapsed: 2.759 sec
[junit] Running org.apache.hadoop.hdfs.server.namenode.TestOverReplicatedBlocks
[junit] Tests run: 1, Failures: 0, Errors: 0, Time elapsed: 3.574 sec
[junit] Running org.apache.hadoop.hdfs.server.namenode.TestPendingReplication
[junit] Tests run: 1, Failures: 0, Errors: 0, Time elapsed: 6.304 sec
[junit] Running org.apache.hadoop.hdfs.server.namenode.TestReplicationPolicy
[junit] Tests run: 8, Failures: 0, Errors: 0, Time elapsed: 0.061 sec
[junit] Running org.apache.hadoop.hdfs.server.namenode.TestSafeMode
[junit] Tests run: 2, Failures: 0, Errors: 0, Time elapsed: 8.05 sec
[junit] Running org.apache.hadoop.hdfs.server.namenode.TestStartup
[junit] Tests run: 5, Failures: 0, Errors: 0, Time elapsed: 9.234 sec
[junit] Running org.apache.hadoop.hdfs.server.namenode.TestStorageRestore
[junit] Tests run: 2, Failures: 0, Errors: 0, Time elapsed: 7.736 sec
[junit] Running org.apache.hadoop.net.TestNetworkTopology
[junit] Tests run: 8, Failures: 0, Errors: 0, Time elapsed: 0.112 sec
[junit] Running org.apache.hadoop.security.TestPermission
[junit] Tests run: 3, Failures: 0, Errors: 0, Time elapsed: 4.557 sec
checkfailure:
[touch] Creating /grid/0/hudson/hudson-slave/workspace/Hadoop-Hdfs-trunk-Commit/trunk/build/test/testsfailed
BUILD FAILED
/grid/0/hudson/hudson-slave/workspace/Hadoop-Hdfs-trunk-Commit/trunk/build.xml:706: The following error occurred while executing this line:
/grid/0/hudson/hudson-slave/workspace/Hadoop-Hdfs-trunk-Commit/trunk/build.xml:663: The following error occurred while executing this line:
/grid/0/hudson/hudson-slave/workspace/Hadoop-Hdfs-trunk-Commit/trunk/build.xml:731: Tests failed!
Total time: 8 minutes 20 seconds
[FINDBUGS] Skipping publisher since build result is FAILURE
Recording fingerprints
Archiving artifacts
Recording test results
Publishing Javadoc
Publishing Clover coverage report...
No Clover report will be published due to a Build Failure
Email was triggered for: Failure
Sending email for trigger: Failure
###################################################################################
############################## FAILED TESTS (if any) ##############################
2 tests failed.
FAILED: org.apache.hadoop.cli.TestHDFSCLI.testAll
Error Message:
One of the tests failed. See the Detailed results to identify the command that failed
Stack Trace:
junit.framework.AssertionFailedError: One of the tests failed. See the Detailed results to identify the command that failed
at org.apache.hadoop.cli.CLITestHelper.displayResults(CLITestHelper.java:264)
at org.apache.hadoop.cli.CLITestHelper.tearDown(CLITestHelper.java:126)
at org.apache.hadoop.cli.TestHDFSCLI.tearDown(TestHDFSCLI.java:81)
FAILED: org.apache.hadoop.hdfs.TestDFSShell.testErrOutPut
Error Message:
-cat returned -1
Stack Trace:
junit.framework.AssertionFailedError: -cat returned -1
at org.apache.hadoop.hdfs.TestDFSShell.__CLR3_0_2yogg6zvyb(TestDFSShell.java:324)
at org.apache.hadoop.hdfs.TestDFSShell.testErrOutPut(TestDFSShell.java:308)
Hadoop-Hdfs-trunk-Commit - Build # 634 - Still Failing
Posted by Apache Jenkins Server <hu...@hudson.apache.org>.
See https://builds.apache.org/hudson/job/Hadoop-Hdfs-trunk-Commit/634/
###################################################################################
########################## LAST 60 LINES OF THE CONSOLE ###########################
[...truncated 2874 lines...]
[junit] Running org.apache.hadoop.hdfs.server.datanode.TestDiskError
[junit] Tests run: 3, Failures: 0, Errors: 0, Time elapsed: 8.834 sec
[junit] Running org.apache.hadoop.hdfs.server.datanode.TestInterDatanodeProtocol
[junit] Tests run: 3, Failures: 0, Errors: 0, Time elapsed: 4.822 sec
[junit] Running org.apache.hadoop.hdfs.server.datanode.TestSimulatedFSDataset
[junit] Tests run: 8, Failures: 0, Errors: 0, Time elapsed: 0.711 sec
[junit] Running org.apache.hadoop.hdfs.server.namenode.TestBackupNode
[junit] Tests run: 2, Failures: 0, Errors: 0, Time elapsed: 17.269 sec
[junit] Running org.apache.hadoop.hdfs.server.namenode.TestCheckpoint
[junit] Tests run: 4, Failures: 0, Errors: 0, Time elapsed: 28.86 sec
[junit] Running org.apache.hadoop.hdfs.server.namenode.TestComputeInvalidateWork
[junit] Tests run: 1, Failures: 0, Errors: 0, Time elapsed: 4.622 sec
[junit] Running org.apache.hadoop.hdfs.server.namenode.TestDatanodeDescriptor
[junit] Tests run: 2, Failures: 0, Errors: 0, Time elapsed: 0.169 sec
[junit] Running org.apache.hadoop.hdfs.server.namenode.TestEditLog
[junit] Tests run: 4, Failures: 0, Errors: 0, Time elapsed: 12.034 sec
[junit] Running org.apache.hadoop.hdfs.server.namenode.TestFileLimit
[junit] Tests run: 2, Failures: 0, Errors: 0, Time elapsed: 4.24 sec
[junit] Running org.apache.hadoop.hdfs.server.namenode.TestHeartbeatHandling
[junit] Tests run: 1, Failures: 0, Errors: 0, Time elapsed: 2.884 sec
[junit] Running org.apache.hadoop.hdfs.server.namenode.TestHost2NodesMap
[junit] Tests run: 4, Failures: 0, Errors: 0, Time elapsed: 0.086 sec
[junit] Running org.apache.hadoop.hdfs.server.namenode.TestNamenodeCapacityReport
[junit] Tests run: 1, Failures: 0, Errors: 0, Time elapsed: 2.518 sec
[junit] Running org.apache.hadoop.hdfs.server.namenode.TestOverReplicatedBlocks
[junit] Tests run: 1, Failures: 0, Errors: 0, Time elapsed: 3.681 sec
[junit] Running org.apache.hadoop.hdfs.server.namenode.TestPendingReplication
[junit] Tests run: 1, Failures: 0, Errors: 0, Time elapsed: 7.291 sec
[junit] Running org.apache.hadoop.hdfs.server.namenode.TestReplicationPolicy
[junit] Tests run: 8, Failures: 0, Errors: 0, Time elapsed: 0.056 sec
[junit] Running org.apache.hadoop.hdfs.server.namenode.TestSafeMode
[junit] Tests run: 2, Failures: 0, Errors: 0, Time elapsed: 8.297 sec
[junit] Running org.apache.hadoop.hdfs.server.namenode.TestStartup
[junit] Tests run: 5, Failures: 0, Errors: 0, Time elapsed: 9.408 sec
[junit] Running org.apache.hadoop.hdfs.server.namenode.TestStorageRestore
[junit] Tests run: 2, Failures: 0, Errors: 0, Time elapsed: 7.889 sec
[junit] Running org.apache.hadoop.net.TestNetworkTopology
[junit] Tests run: 8, Failures: 0, Errors: 0, Time elapsed: 0.111 sec
[junit] Running org.apache.hadoop.security.TestPermission
[junit] Tests run: 3, Failures: 0, Errors: 0, Time elapsed: 4.676 sec
checkfailure:
[touch] Creating /grid/0/hudson/hudson-slave/workspace/Hadoop-Hdfs-trunk-Commit/trunk/build/test/testsfailed
BUILD FAILED
/grid/0/hudson/hudson-slave/workspace/Hadoop-Hdfs-trunk-Commit/trunk/build.xml:706: The following error occurred while executing this line:
/grid/0/hudson/hudson-slave/workspace/Hadoop-Hdfs-trunk-Commit/trunk/build.xml:663: The following error occurred while executing this line:
/grid/0/hudson/hudson-slave/workspace/Hadoop-Hdfs-trunk-Commit/trunk/build.xml:731: Tests failed!
Total time: 8 minutes 40 seconds
[FINDBUGS] Skipping publisher since build result is FAILURE
Recording fingerprints
Archiving artifacts
Recording test results
Publishing Javadoc
Publishing Clover coverage report...
No Clover report will be published due to a Build Failure
Email was triggered for: Failure
Sending email for trigger: Failure
###################################################################################
############################## FAILED TESTS (if any) ##############################
2 tests failed.
REGRESSION: org.apache.hadoop.cli.TestHDFSCLI.testAll
Error Message:
One of the tests failed. See the Detailed results to identify the command that failed
Stack Trace:
junit.framework.AssertionFailedError: One of the tests failed. See the Detailed results to identify the command that failed
at org.apache.hadoop.cli.CLITestHelper.displayResults(CLITestHelper.java:264)
at org.apache.hadoop.cli.CLITestHelper.tearDown(CLITestHelper.java:126)
at org.apache.hadoop.cli.TestHDFSCLI.tearDown(TestHDFSCLI.java:81)
FAILED: org.apache.hadoop.hdfs.TestDFSShell.testErrOutPut
Error Message:
-cat returned -1
Stack Trace:
junit.framework.AssertionFailedError: -cat returned -1
at org.apache.hadoop.hdfs.TestDFSShell.__CLR3_0_2yogg6zvyb(TestDFSShell.java:324)
at org.apache.hadoop.hdfs.TestDFSShell.testErrOutPut(TestDFSShell.java:308)
Hadoop-Hdfs-trunk-Commit - Build # 633 - Still Failing
Posted by Apache Jenkins Server <hu...@hudson.apache.org>.
See https://builds.apache.org/hudson/job/Hadoop-Hdfs-trunk-Commit/633/
###################################################################################
########################## LAST 60 LINES OF THE CONSOLE ###########################
[...truncated 2873 lines...]
[junit] Running org.apache.hadoop.hdfs.server.datanode.TestDiskError
[junit] Tests run: 3, Failures: 0, Errors: 0, Time elapsed: 8.583 sec
[junit] Running org.apache.hadoop.hdfs.server.datanode.TestInterDatanodeProtocol
[junit] Tests run: 3, Failures: 0, Errors: 0, Time elapsed: 4.645 sec
[junit] Running org.apache.hadoop.hdfs.server.datanode.TestSimulatedFSDataset
[junit] Tests run: 8, Failures: 0, Errors: 0, Time elapsed: 0.719 sec
[junit] Running org.apache.hadoop.hdfs.server.namenode.TestBackupNode
[junit] Tests run: 2, Failures: 0, Errors: 0, Time elapsed: 17.179 sec
[junit] Running org.apache.hadoop.hdfs.server.namenode.TestCheckpoint
[junit] Tests run: 4, Failures: 0, Errors: 0, Time elapsed: 29.435 sec
[junit] Running org.apache.hadoop.hdfs.server.namenode.TestComputeInvalidateWork
[junit] Tests run: 1, Failures: 0, Errors: 0, Time elapsed: 4.6 sec
[junit] Running org.apache.hadoop.hdfs.server.namenode.TestDatanodeDescriptor
[junit] Tests run: 2, Failures: 0, Errors: 0, Time elapsed: 0.163 sec
[junit] Running org.apache.hadoop.hdfs.server.namenode.TestEditLog
[junit] Tests run: 4, Failures: 0, Errors: 0, Time elapsed: 11.95 sec
[junit] Running org.apache.hadoop.hdfs.server.namenode.TestFileLimit
[junit] Tests run: 2, Failures: 0, Errors: 0, Time elapsed: 4.267 sec
[junit] Running org.apache.hadoop.hdfs.server.namenode.TestHeartbeatHandling
[junit] Tests run: 1, Failures: 0, Errors: 0, Time elapsed: 2.941 sec
[junit] Running org.apache.hadoop.hdfs.server.namenode.TestHost2NodesMap
[junit] Tests run: 4, Failures: 0, Errors: 0, Time elapsed: 0.085 sec
[junit] Running org.apache.hadoop.hdfs.server.namenode.TestNamenodeCapacityReport
[junit] Tests run: 1, Failures: 0, Errors: 0, Time elapsed: 2.769 sec
[junit] Running org.apache.hadoop.hdfs.server.namenode.TestOverReplicatedBlocks
[junit] Tests run: 1, Failures: 0, Errors: 0, Time elapsed: 3.569 sec
[junit] Running org.apache.hadoop.hdfs.server.namenode.TestPendingReplication
[junit] Tests run: 1, Failures: 0, Errors: 0, Time elapsed: 7.313 sec
[junit] Running org.apache.hadoop.hdfs.server.namenode.TestReplicationPolicy
[junit] Tests run: 8, Failures: 0, Errors: 0, Time elapsed: 0.061 sec
[junit] Running org.apache.hadoop.hdfs.server.namenode.TestSafeMode
[junit] Tests run: 2, Failures: 0, Errors: 0, Time elapsed: 8.325 sec
[junit] Running org.apache.hadoop.hdfs.server.namenode.TestStartup
[junit] Tests run: 5, Failures: 0, Errors: 0, Time elapsed: 9.593 sec
[junit] Running org.apache.hadoop.hdfs.server.namenode.TestStorageRestore
[junit] Tests run: 2, Failures: 0, Errors: 0, Time elapsed: 7.888 sec
[junit] Running org.apache.hadoop.net.TestNetworkTopology
[junit] Tests run: 8, Failures: 0, Errors: 0, Time elapsed: 0.106 sec
[junit] Running org.apache.hadoop.security.TestPermission
[junit] Tests run: 3, Failures: 0, Errors: 0, Time elapsed: 4.675 sec
checkfailure:
[touch] Creating /grid/0/hudson/hudson-slave/workspace/Hadoop-Hdfs-trunk-Commit/trunk/build/test/testsfailed
BUILD FAILED
/grid/0/hudson/hudson-slave/workspace/Hadoop-Hdfs-trunk-Commit/trunk/build.xml:706: The following error occurred while executing this line:
/grid/0/hudson/hudson-slave/workspace/Hadoop-Hdfs-trunk-Commit/trunk/build.xml:663: The following error occurred while executing this line:
/grid/0/hudson/hudson-slave/workspace/Hadoop-Hdfs-trunk-Commit/trunk/build.xml:731: Tests failed!
Total time: 8 minutes 39 seconds
[FINDBUGS] Skipping publisher since build result is FAILURE
Recording fingerprints
Archiving artifacts
Recording test results
Publishing Javadoc
Publishing Clover coverage report...
No Clover report will be published due to a Build Failure
Email was triggered for: Failure
Sending email for trigger: Failure
###################################################################################
############################## FAILED TESTS (if any) ##############################
1 tests failed.
FAILED: org.apache.hadoop.hdfs.TestDFSShell.testErrOutPut
Error Message:
-cat returned -1
Stack Trace:
junit.framework.AssertionFailedError: -cat returned -1
at org.apache.hadoop.hdfs.TestDFSShell.__CLR3_0_2yogg6zvyb(TestDFSShell.java:324)
at org.apache.hadoop.hdfs.TestDFSShell.testErrOutPut(TestDFSShell.java:308)
Hadoop-Hdfs-trunk-Commit - Build # 632 - Still Failing
Posted by Apache Jenkins Server <hu...@hudson.apache.org>.
See https://builds.apache.org/hudson/job/Hadoop-Hdfs-trunk-Commit/632/
###################################################################################
########################## LAST 60 LINES OF THE CONSOLE ###########################
[...truncated 2873 lines...]
[junit] Running org.apache.hadoop.hdfs.server.datanode.TestDiskError
[junit] Tests run: 3, Failures: 0, Errors: 0, Time elapsed: 8.836 sec
[junit] Running org.apache.hadoop.hdfs.server.datanode.TestInterDatanodeProtocol
[junit] Tests run: 3, Failures: 0, Errors: 0, Time elapsed: 5.298 sec
[junit] Running org.apache.hadoop.hdfs.server.datanode.TestSimulatedFSDataset
[junit] Tests run: 8, Failures: 0, Errors: 0, Time elapsed: 0.773 sec
[junit] Running org.apache.hadoop.hdfs.server.namenode.TestBackupNode
[junit] Tests run: 2, Failures: 0, Errors: 0, Time elapsed: 17.195 sec
[junit] Running org.apache.hadoop.hdfs.server.namenode.TestCheckpoint
[junit] Tests run: 4, Failures: 0, Errors: 0, Time elapsed: 30.696 sec
[junit] Running org.apache.hadoop.hdfs.server.namenode.TestComputeInvalidateWork
[junit] Tests run: 1, Failures: 0, Errors: 0, Time elapsed: 4.729 sec
[junit] Running org.apache.hadoop.hdfs.server.namenode.TestDatanodeDescriptor
[junit] Tests run: 2, Failures: 0, Errors: 0, Time elapsed: 0.148 sec
[junit] Running org.apache.hadoop.hdfs.server.namenode.TestEditLog
[junit] Tests run: 4, Failures: 0, Errors: 0, Time elapsed: 11.683 sec
[junit] Running org.apache.hadoop.hdfs.server.namenode.TestFileLimit
[junit] Tests run: 2, Failures: 0, Errors: 0, Time elapsed: 4.24 sec
[junit] Running org.apache.hadoop.hdfs.server.namenode.TestHeartbeatHandling
[junit] Tests run: 1, Failures: 0, Errors: 0, Time elapsed: 2.895 sec
[junit] Running org.apache.hadoop.hdfs.server.namenode.TestHost2NodesMap
[junit] Tests run: 4, Failures: 0, Errors: 0, Time elapsed: 0.085 sec
[junit] Running org.apache.hadoop.hdfs.server.namenode.TestNamenodeCapacityReport
[junit] Tests run: 1, Failures: 0, Errors: 0, Time elapsed: 3.884 sec
[junit] Running org.apache.hadoop.hdfs.server.namenode.TestOverReplicatedBlocks
[junit] Tests run: 1, Failures: 0, Errors: 0, Time elapsed: 3.741 sec
[junit] Running org.apache.hadoop.hdfs.server.namenode.TestPendingReplication
[junit] Tests run: 1, Failures: 0, Errors: 0, Time elapsed: 7.283 sec
[junit] Running org.apache.hadoop.hdfs.server.namenode.TestReplicationPolicy
[junit] Tests run: 8, Failures: 0, Errors: 0, Time elapsed: 0.071 sec
[junit] Running org.apache.hadoop.hdfs.server.namenode.TestSafeMode
[junit] Tests run: 2, Failures: 0, Errors: 0, Time elapsed: 8.173 sec
[junit] Running org.apache.hadoop.hdfs.server.namenode.TestStartup
[junit] Tests run: 5, Failures: 0, Errors: 0, Time elapsed: 9.844 sec
[junit] Running org.apache.hadoop.hdfs.server.namenode.TestStorageRestore
[junit] Tests run: 2, Failures: 0, Errors: 0, Time elapsed: 7.808 sec
[junit] Running org.apache.hadoop.net.TestNetworkTopology
[junit] Tests run: 8, Failures: 0, Errors: 0, Time elapsed: 0.107 sec
[junit] Running org.apache.hadoop.security.TestPermission
[junit] Tests run: 3, Failures: 0, Errors: 0, Time elapsed: 4.757 sec
checkfailure:
[touch] Creating /grid/0/hudson/hudson-slave/workspace/Hadoop-Hdfs-trunk-Commit/trunk/build/test/testsfailed
BUILD FAILED
/grid/0/hudson/hudson-slave/workspace/Hadoop-Hdfs-trunk-Commit/trunk/build.xml:706: The following error occurred while executing this line:
/grid/0/hudson/hudson-slave/workspace/Hadoop-Hdfs-trunk-Commit/trunk/build.xml:663: The following error occurred while executing this line:
/grid/0/hudson/hudson-slave/workspace/Hadoop-Hdfs-trunk-Commit/trunk/build.xml:731: Tests failed!
Total time: 9 minutes 9 seconds
[FINDBUGS] Skipping publisher since build result is FAILURE
Recording fingerprints
Archiving artifacts
Recording test results
Publishing Javadoc
Publishing Clover coverage report...
No Clover report will be published due to a Build Failure
Email was triggered for: Failure
Sending email for trigger: Failure
###################################################################################
############################## FAILED TESTS (if any) ##############################
1 tests failed.
FAILED: org.apache.hadoop.hdfs.TestDFSShell.testErrOutPut
Error Message:
-cat returned -1
Stack Trace:
junit.framework.AssertionFailedError: -cat returned -1
at org.apache.hadoop.hdfs.TestDFSShell.__CLR3_0_2yogg6zvx8(TestDFSShell.java:324)
at org.apache.hadoop.hdfs.TestDFSShell.testErrOutPut(TestDFSShell.java:308)
Hadoop-Hdfs-trunk-Commit - Build # 631 - Still Failing
Posted by Apache Jenkins Server <hu...@hudson.apache.org>.
See https://builds.apache.org/hudson/job/Hadoop-Hdfs-trunk-Commit/631/
###################################################################################
########################## LAST 60 LINES OF THE CONSOLE ###########################
[...truncated 2867 lines...]
[junit] Running org.apache.hadoop.hdfs.server.datanode.TestDiskError
[junit] Tests run: 3, Failures: 0, Errors: 0, Time elapsed: 8.629 sec
[junit] Running org.apache.hadoop.hdfs.server.datanode.TestInterDatanodeProtocol
[junit] Tests run: 3, Failures: 0, Errors: 0, Time elapsed: 4.761 sec
[junit] Running org.apache.hadoop.hdfs.server.datanode.TestSimulatedFSDataset
[junit] Tests run: 8, Failures: 0, Errors: 0, Time elapsed: 0.721 sec
[junit] Running org.apache.hadoop.hdfs.server.namenode.TestBackupNode
[junit] Tests run: 2, Failures: 0, Errors: 0, Time elapsed: 17.315 sec
[junit] Running org.apache.hadoop.hdfs.server.namenode.TestCheckpoint
[junit] Tests run: 4, Failures: 0, Errors: 0, Time elapsed: 29.446 sec
[junit] Running org.apache.hadoop.hdfs.server.namenode.TestComputeInvalidateWork
[junit] Tests run: 1, Failures: 0, Errors: 0, Time elapsed: 4.535 sec
[junit] Running org.apache.hadoop.hdfs.server.namenode.TestDatanodeDescriptor
[junit] Tests run: 2, Failures: 0, Errors: 0, Time elapsed: 0.169 sec
[junit] Running org.apache.hadoop.hdfs.server.namenode.TestEditLog
[junit] Tests run: 4, Failures: 0, Errors: 0, Time elapsed: 11.848 sec
[junit] Running org.apache.hadoop.hdfs.server.namenode.TestFileLimit
[junit] Tests run: 2, Failures: 0, Errors: 0, Time elapsed: 4.207 sec
[junit] Running org.apache.hadoop.hdfs.server.namenode.TestHeartbeatHandling
[junit] Tests run: 1, Failures: 0, Errors: 0, Time elapsed: 2.886 sec
[junit] Running org.apache.hadoop.hdfs.server.namenode.TestHost2NodesMap
[junit] Tests run: 4, Failures: 0, Errors: 0, Time elapsed: 0.084 sec
[junit] Running org.apache.hadoop.hdfs.server.namenode.TestNamenodeCapacityReport
[junit] Tests run: 1, Failures: 0, Errors: 0, Time elapsed: 2.701 sec
[junit] Running org.apache.hadoop.hdfs.server.namenode.TestOverReplicatedBlocks
[junit] Tests run: 1, Failures: 0, Errors: 0, Time elapsed: 3.6 sec
[junit] Running org.apache.hadoop.hdfs.server.namenode.TestPendingReplication
[junit] Tests run: 1, Failures: 0, Errors: 0, Time elapsed: 7.306 sec
[junit] Running org.apache.hadoop.hdfs.server.namenode.TestReplicationPolicy
[junit] Tests run: 8, Failures: 0, Errors: 0, Time elapsed: 0.056 sec
[junit] Running org.apache.hadoop.hdfs.server.namenode.TestSafeMode
[junit] Tests run: 2, Failures: 0, Errors: 0, Time elapsed: 8.241 sec
[junit] Running org.apache.hadoop.hdfs.server.namenode.TestStartup
[junit] Tests run: 5, Failures: 0, Errors: 0, Time elapsed: 9.585 sec
[junit] Running org.apache.hadoop.hdfs.server.namenode.TestStorageRestore
[junit] Tests run: 2, Failures: 0, Errors: 0, Time elapsed: 7.648 sec
[junit] Running org.apache.hadoop.net.TestNetworkTopology
[junit] Tests run: 8, Failures: 0, Errors: 0, Time elapsed: 0.112 sec
[junit] Running org.apache.hadoop.security.TestPermission
[junit] Tests run: 3, Failures: 0, Errors: 0, Time elapsed: 4.944 sec
checkfailure:
[touch] Creating /grid/0/hudson/hudson-slave/workspace/Hadoop-Hdfs-trunk-Commit/trunk/build/test/testsfailed
BUILD FAILED
/grid/0/hudson/hudson-slave/workspace/Hadoop-Hdfs-trunk-Commit/trunk/build.xml:706: The following error occurred while executing this line:
/grid/0/hudson/hudson-slave/workspace/Hadoop-Hdfs-trunk-Commit/trunk/build.xml:663: The following error occurred while executing this line:
/grid/0/hudson/hudson-slave/workspace/Hadoop-Hdfs-trunk-Commit/trunk/build.xml:731: Tests failed!
Total time: 8 minutes 42 seconds
[FINDBUGS] Skipping publisher since build result is FAILURE
Recording fingerprints
Archiving artifacts
Recording test results
Publishing Javadoc
Publishing Clover coverage report...
No Clover report will be published due to a Build Failure
Email was triggered for: Failure
Sending email for trigger: Failure
###################################################################################
############################## FAILED TESTS (if any) ##############################
1 tests failed.
FAILED: org.apache.hadoop.hdfs.TestDFSShell.testErrOutPut
Error Message:
-cat returned -1
Stack Trace:
junit.framework.AssertionFailedError: -cat returned -1
at org.apache.hadoop.hdfs.TestDFSShell.__CLR3_0_2yogg6zvkb(TestDFSShell.java:324)
at org.apache.hadoop.hdfs.TestDFSShell.testErrOutPut(TestDFSShell.java:308)
Hadoop-Hdfs-trunk-Commit - Build # 630 - Still Failing
Posted by Apache Jenkins Server <hu...@hudson.apache.org>.
See https://builds.apache.org/hudson/job/Hadoop-Hdfs-trunk-Commit/630/
###################################################################################
########################## LAST 60 LINES OF THE CONSOLE ###########################
[...truncated 2866 lines...]
[junit] Running org.apache.hadoop.hdfs.server.datanode.TestDiskError
[junit] Tests run: 3, Failures: 0, Errors: 0, Time elapsed: 8.113 sec
[junit] Running org.apache.hadoop.hdfs.server.datanode.TestInterDatanodeProtocol
[junit] Tests run: 3, Failures: 0, Errors: 0, Time elapsed: 4.66 sec
[junit] Running org.apache.hadoop.hdfs.server.datanode.TestSimulatedFSDataset
[junit] Tests run: 8, Failures: 0, Errors: 0, Time elapsed: 0.728 sec
[junit] Running org.apache.hadoop.hdfs.server.namenode.TestBackupNode
[junit] Tests run: 2, Failures: 0, Errors: 0, Time elapsed: 16.483 sec
[junit] Running org.apache.hadoop.hdfs.server.namenode.TestCheckpoint
[junit] Tests run: 4, Failures: 0, Errors: 0, Time elapsed: 27.957 sec
[junit] Running org.apache.hadoop.hdfs.server.namenode.TestComputeInvalidateWork
[junit] Tests run: 1, Failures: 0, Errors: 0, Time elapsed: 4.563 sec
[junit] Running org.apache.hadoop.hdfs.server.namenode.TestDatanodeDescriptor
[junit] Tests run: 2, Failures: 0, Errors: 0, Time elapsed: 0.161 sec
[junit] Running org.apache.hadoop.hdfs.server.namenode.TestEditLog
[junit] Tests run: 4, Failures: 0, Errors: 0, Time elapsed: 11.322 sec
[junit] Running org.apache.hadoop.hdfs.server.namenode.TestFileLimit
[junit] Tests run: 2, Failures: 0, Errors: 0, Time elapsed: 3.951 sec
[junit] Running org.apache.hadoop.hdfs.server.namenode.TestHeartbeatHandling
[junit] Tests run: 1, Failures: 0, Errors: 0, Time elapsed: 2.789 sec
[junit] Running org.apache.hadoop.hdfs.server.namenode.TestHost2NodesMap
[junit] Tests run: 4, Failures: 0, Errors: 0, Time elapsed: 0.085 sec
[junit] Running org.apache.hadoop.hdfs.server.namenode.TestNamenodeCapacityReport
[junit] Tests run: 1, Failures: 0, Errors: 0, Time elapsed: 2.559 sec
[junit] Running org.apache.hadoop.hdfs.server.namenode.TestOverReplicatedBlocks
[junit] Tests run: 1, Failures: 0, Errors: 0, Time elapsed: 3.378 sec
[junit] Running org.apache.hadoop.hdfs.server.namenode.TestPendingReplication
[junit] Tests run: 1, Failures: 0, Errors: 0, Time elapsed: 7.273 sec
[junit] Running org.apache.hadoop.hdfs.server.namenode.TestReplicationPolicy
[junit] Tests run: 8, Failures: 0, Errors: 0, Time elapsed: 0.063 sec
[junit] Running org.apache.hadoop.hdfs.server.namenode.TestSafeMode
[junit] Tests run: 2, Failures: 0, Errors: 0, Time elapsed: 7.862 sec
[junit] Running org.apache.hadoop.hdfs.server.namenode.TestStartup
[junit] Tests run: 5, Failures: 0, Errors: 0, Time elapsed: 8.936 sec
[junit] Running org.apache.hadoop.hdfs.server.namenode.TestStorageRestore
[junit] Tests run: 2, Failures: 0, Errors: 0, Time elapsed: 7.661 sec
[junit] Running org.apache.hadoop.net.TestNetworkTopology
[junit] Tests run: 8, Failures: 0, Errors: 0, Time elapsed: 0.117 sec
[junit] Running org.apache.hadoop.security.TestPermission
[junit] Tests run: 3, Failures: 0, Errors: 0, Time elapsed: 4.374 sec
checkfailure:
[touch] Creating /grid/0/hudson/hudson-slave/workspace/Hadoop-Hdfs-trunk-Commit/trunk/build/test/testsfailed
BUILD FAILED
/grid/0/hudson/hudson-slave/workspace/Hadoop-Hdfs-trunk-Commit/trunk/build.xml:706: The following error occurred while executing this line:
/grid/0/hudson/hudson-slave/workspace/Hadoop-Hdfs-trunk-Commit/trunk/build.xml:663: The following error occurred while executing this line:
/grid/0/hudson/hudson-slave/workspace/Hadoop-Hdfs-trunk-Commit/trunk/build.xml:731: Tests failed!
Total time: 7 minutes 54 seconds
[FINDBUGS] Skipping publisher since build result is FAILURE
Recording fingerprints
Archiving artifacts
Recording test results
Publishing Javadoc
Publishing Clover coverage report...
No Clover report will be published due to a Build Failure
Email was triggered for: Failure
Sending email for trigger: Failure
###################################################################################
############################## FAILED TESTS (if any) ##############################
2 tests failed.
REGRESSION: org.apache.hadoop.cli.TestHDFSCLI.testAll
Error Message:
One of the tests failed. See the Detailed results to identify the command that failed
Stack Trace:
junit.framework.AssertionFailedError: One of the tests failed. See the Detailed results to identify the command that failed
at org.apache.hadoop.cli.CLITestHelper.displayResults(CLITestHelper.java:264)
at org.apache.hadoop.cli.CLITestHelper.tearDown(CLITestHelper.java:126)
at org.apache.hadoop.cli.TestHDFSCLI.tearDown(TestHDFSCLI.java:81)
FAILED: org.apache.hadoop.hdfs.TestDFSShell.testErrOutPut
Error Message:
-cat returned -1
Stack Trace:
junit.framework.AssertionFailedError: -cat returned -1
at org.apache.hadoop.hdfs.TestDFSShell.__CLR3_0_2yogg6zvkb(TestDFSShell.java:324)
at org.apache.hadoop.hdfs.TestDFSShell.testErrOutPut(TestDFSShell.java:308)
Hadoop-Hdfs-trunk-Commit - Build # 629 - Still Failing
Posted by Apache Jenkins Server <hu...@hudson.apache.org>.
See https://builds.apache.org/hudson/job/Hadoop-Hdfs-trunk-Commit/629/
###################################################################################
########################## LAST 60 LINES OF THE CONSOLE ###########################
[...truncated 2867 lines...]
[junit] Running org.apache.hadoop.hdfs.server.datanode.TestDiskError
[junit] Tests run: 3, Failures: 0, Errors: 0, Time elapsed: 8.651 sec
[junit] Running org.apache.hadoop.hdfs.server.datanode.TestInterDatanodeProtocol
[junit] Tests run: 3, Failures: 0, Errors: 0, Time elapsed: 4.848 sec
[junit] Running org.apache.hadoop.hdfs.server.datanode.TestSimulatedFSDataset
[junit] Tests run: 8, Failures: 0, Errors: 0, Time elapsed: 0.726 sec
[junit] Running org.apache.hadoop.hdfs.server.namenode.TestBackupNode
[junit] Tests run: 2, Failures: 0, Errors: 0, Time elapsed: 17.18 sec
[junit] Running org.apache.hadoop.hdfs.server.namenode.TestCheckpoint
[junit] Tests run: 4, Failures: 0, Errors: 0, Time elapsed: 29.282 sec
[junit] Running org.apache.hadoop.hdfs.server.namenode.TestComputeInvalidateWork
[junit] Tests run: 1, Failures: 0, Errors: 0, Time elapsed: 4.613 sec
[junit] Running org.apache.hadoop.hdfs.server.namenode.TestDatanodeDescriptor
[junit] Tests run: 2, Failures: 0, Errors: 0, Time elapsed: 0.141 sec
[junit] Running org.apache.hadoop.hdfs.server.namenode.TestEditLog
[junit] Tests run: 4, Failures: 0, Errors: 0, Time elapsed: 11.804 sec
[junit] Running org.apache.hadoop.hdfs.server.namenode.TestFileLimit
[junit] Tests run: 2, Failures: 0, Errors: 0, Time elapsed: 4.247 sec
[junit] Running org.apache.hadoop.hdfs.server.namenode.TestHeartbeatHandling
[junit] Tests run: 1, Failures: 0, Errors: 0, Time elapsed: 2.749 sec
[junit] Running org.apache.hadoop.hdfs.server.namenode.TestHost2NodesMap
[junit] Tests run: 4, Failures: 0, Errors: 0, Time elapsed: 0.085 sec
[junit] Running org.apache.hadoop.hdfs.server.namenode.TestNamenodeCapacityReport
[junit] Tests run: 1, Failures: 0, Errors: 0, Time elapsed: 2.741 sec
[junit] Running org.apache.hadoop.hdfs.server.namenode.TestOverReplicatedBlocks
[junit] Tests run: 1, Failures: 0, Errors: 0, Time elapsed: 3.386 sec
[junit] Running org.apache.hadoop.hdfs.server.namenode.TestPendingReplication
[junit] Tests run: 1, Failures: 0, Errors: 0, Time elapsed: 7.299 sec
[junit] Running org.apache.hadoop.hdfs.server.namenode.TestReplicationPolicy
[junit] Tests run: 8, Failures: 0, Errors: 0, Time elapsed: 0.055 sec
[junit] Running org.apache.hadoop.hdfs.server.namenode.TestSafeMode
[junit] Tests run: 2, Failures: 0, Errors: 0, Time elapsed: 8.232 sec
[junit] Running org.apache.hadoop.hdfs.server.namenode.TestStartup
[junit] Tests run: 5, Failures: 0, Errors: 0, Time elapsed: 9.552 sec
[junit] Running org.apache.hadoop.hdfs.server.namenode.TestStorageRestore
[junit] Tests run: 2, Failures: 0, Errors: 0, Time elapsed: 8.045 sec
[junit] Running org.apache.hadoop.net.TestNetworkTopology
[junit] Tests run: 8, Failures: 0, Errors: 0, Time elapsed: 0.116 sec
[junit] Running org.apache.hadoop.security.TestPermission
[junit] Tests run: 3, Failures: 0, Errors: 0, Time elapsed: 4.877 sec
checkfailure:
[touch] Creating /grid/0/hudson/hudson-slave/workspace/Hadoop-Hdfs-trunk-Commit/trunk/build/test/testsfailed
BUILD FAILED
/grid/0/hudson/hudson-slave/workspace/Hadoop-Hdfs-trunk-Commit/trunk/build.xml:706: The following error occurred while executing this line:
/grid/0/hudson/hudson-slave/workspace/Hadoop-Hdfs-trunk-Commit/trunk/build.xml:663: The following error occurred while executing this line:
/grid/0/hudson/hudson-slave/workspace/Hadoop-Hdfs-trunk-Commit/trunk/build.xml:731: Tests failed!
Total time: 8 minutes 52 seconds
[FINDBUGS] Skipping publisher since build result is FAILURE
Recording fingerprints
Archiving artifacts
Recording test results
Publishing Javadoc
Publishing Clover coverage report...
No Clover report will be published due to a Build Failure
Email was triggered for: Failure
Sending email for trigger: Failure
###################################################################################
############################## FAILED TESTS (if any) ##############################
1 tests failed.
FAILED: org.apache.hadoop.hdfs.TestDFSShell.testErrOutPut
Error Message:
-mkdir returned -1
Stack Trace:
junit.framework.AssertionFailedError: -mkdir returned -1
at org.apache.hadoop.hdfs.TestDFSShell.__CLR3_0_2yogg6zvg9(TestDFSShell.java:392)
at org.apache.hadoop.hdfs.TestDFSShell.testErrOutPut(TestDFSShell.java:308)