You are viewing a plain text version of this content. The canonical link for it is here.
Posted to builds@beam.apache.org by Apache Jenkins Server <je...@builds.apache.org> on 2022/09/07 08:55:45 UTC
Build failed in Jenkins: beam_PreCommit_Java_Cron #5893
See <https://ci-beam.apache.org/job/beam_PreCommit_Java_Cron/5893/display/redirect?page=changes>
Changes:
[Kenneth Knowles] Cosmetic checkstyle fix to TextRowCountEstimator
[Kenneth Knowles] Upgrade to Gradle 7.5.1
[chamikaramj] Fixes RunInference test failure
------------------------------------------
[...truncated 3.26 MB...]
> Task :sdks:java:io:azure:testClasses
> Task :sdks:java:io:azure:analyzeTestClassesDependencies SKIPPED
> Task :sdks:java:io:azure:analyzeDependencies
> Task :sdks:java:io:azure:checkstyleMain SKIPPED
> Task :sdks:java:io:azure:checkstyleTest SKIPPED
> Task :sdks:java:core:spotbugsMain
> Task :sdks:java:io:hadoop-common:compileTestJava
Note: <https://ci-beam.apache.org/job/beam_PreCommit_Java_Cron/ws/src/sdks/java/io/hadoop-common/src/test/java/org/apache/beam/sdk/io/hadoop/SerializableConfigurationTest.java> uses or overrides a deprecated API.
Note: Recompile with -Xlint:deprecation for details.
> Task :sdks:java:io:hadoop-common:testClasses
> Task :sdks:java:io:hadoop-common:analyzeTestClassesDependencies SKIPPED
> Task :sdks:java:io:hadoop-common:analyzeDependencies
> Task :sdks:java:io:hadoop-common:checkstyleMain SKIPPED
> Task :sdks:java:io:hadoop-common:checkstyleTest SKIPPED
> Task :sdks:java:core:jmh:check
> Task :sdks:java:core:jmh:build
> Task :sdks:java:core:jmh:buildDependents
> Task :sdks:java:core:test
> Task :sdks:java:extensions:sql:udf-test-provider:javadoc
> Task :sdks:java:io:common:test
> Task :sdks:java:io:hadoop-common:javadoc
> Task :sdks:java:io:azure:javadoc
> Task :sdks:java:io:azure:spotbugsTest SKIPPED
> Task :sdks:java:container:java8:copyDockerfileDependencies
> Task :sdks:java:io:common:check
> Task :sdks:java:io:common:build
> Task :sdks:java:io:hadoop-common:spotbugsTest SKIPPED
> Task :sdks:java:io:elasticsearch:spotbugsMain
> Task :sdks:java:io:elasticsearch:check
> Task :sdks:java:io:elasticsearch:build
> Task :sdks:java:javadoc:allJavadoc
> Task :sdks:java:io:elasticsearch-tests:elasticsearch-tests-8:check
> Task :sdks:java:io:elasticsearch-tests:elasticsearch-tests-8:build
> Task :sdks:java:io:elasticsearch-tests:elasticsearch-tests-8:buildDependents
> Task :sdks:java:io:elasticsearch-tests:elasticsearch-tests-common:buildDependents
> Task :sdks:java:io:elasticsearch:buildDependents
> Task :release:go-licenses:java:dockerRun
+ rm -rf '/output/*'
+ go get github.com/apache/beam/sdks/v2/java/container
go: downloading github.com/apache/beam/sdks/v2 v2.41.0
go: downloading github.com/apache/beam v2.41.0+incompatible
> Task :sdks:java:io:hadoop-common:test
> Task :sdks:java:container:pullLicenses
Copying already-fetched licenses from <https://ci-beam.apache.org/job/beam_PreCommit_Java_Cron/ws/src/sdks/java/container/build/reports/dependency-license> to <https://ci-beam.apache.org/job/beam_PreCommit_Java_Cron/ws/src/sdks/java/container/build/target/java_third_party_licenses>
> Task :sdks:java:io:hadoop-common:spotbugsMain
> Task :sdks:java:io:hadoop-common:check
> Task :sdks:java:io:hadoop-common:build
> Task :sdks:java:io:hadoop-common:buildDependents
> Task :sdks:java:io:azure:spotbugsMain
> Task :release:go-licenses:java:dockerRun
go: downloading google.golang.org/protobuf v1.28.0
go: downloading google.golang.org/grpc v1.48.0
go: downloading github.com/golang/protobuf v1.5.2
go: downloading golang.org/x/sys v0.0.0-20220624220833-87e55d714810
> Task :sdks:java:io:azure:test
> Task :sdks:java:io:azure:check
> Task :sdks:java:io:azure:build
> Task :sdks:java:io:azure:buildDependents
> Task :release:go-licenses:java:dockerRun
go: downloading golang.org/x/net v0.0.0-20220624214902-1bab6f366d9e
go: downloading google.golang.org/genproto v0.0.0-20220714211235-042d03aeabc9
go: downloading golang.org/x/text v0.3.7
go: added github.com/apache/beam/sdks/v2 v2.41.0
go: added github.com/golang/protobuf v1.5.2
go: added golang.org/x/net v0.0.0-20220624214902-1bab6f366d9e
go: added golang.org/x/sys v0.0.0-20220624220833-87e55d714810
go: added golang.org/x/text v0.3.7
go: added google.golang.org/genproto v0.0.0-20220714211235-042d03aeabc9
go: added google.golang.org/grpc v1.48.0
go: added google.golang.org/protobuf v1.28.0
+ go-licenses save github.com/apache/beam/sdks/v2/java/container --save_path=/output/licenses
> Task :sdks:java:container:pullLicenses
Collecting pip
Using cached pip-22.2.2-py3-none-any.whl (2.0 MB)
Collecting setuptools
Using cached setuptools-65.3.0-py3-none-any.whl (1.2 MB)
Collecting wheel
Using cached wheel-0.37.1-py2.py3-none-any.whl (35 kB)
Installing collected packages: pip, setuptools, wheel
Attempting uninstall: pip
Found existing installation: pip 20.0.2
Uninstalling pip-20.0.2:
Successfully uninstalled pip-20.0.2
Attempting uninstall: setuptools
Found existing installation: setuptools 44.0.0
Uninstalling setuptools-44.0.0:
Successfully uninstalled setuptools-44.0.0
Successfully installed pip-22.2.2 setuptools-65.3.0 wheel-0.37.1
Collecting beautifulsoup4<5.0,>=4.9.0
Using cached beautifulsoup4-4.11.1-py3-none-any.whl (128 kB)
Collecting pyyaml<6.0.0,>=3.12
Using cached PyYAML-5.4.1-cp38-cp38-manylinux1_x86_64.whl (662 kB)
Collecting tenacity<6.0,>=5.0.2
> Task :sdks:java:extensions:sql:jdbc:shadowJarTest
> Task :sdks:java:container:pullLicenses
Using cached tenacity-5.1.5-py2.py3-none-any.whl (34 kB)
Collecting soupsieve>1.2
Using cached soupsieve-2.3.2.post1-py3-none-any.whl (37 kB)
Collecting six>=1.9.0
Using cached six-1.16.0-py2.py3-none-any.whl (11 kB)
Installing collected packages: soupsieve, six, pyyaml, tenacity, beautifulsoup4
Successfully installed beautifulsoup4-4.11.1 pyyaml-5.4.1 six-1.16.0 soupsieve-2.3.2.post1 tenacity-5.1.5
Executing python <https://ci-beam.apache.org/job/beam_PreCommit_Java_Cron/ws/src/sdks/java/container/license_scripts/pull_licenses_java.py> --license_index=<https://ci-beam.apache.org/job/beam_PreCommit_Java_Cron/ws/src/sdks/java/container/build/reports/dependency-license/index.json> --output_dir=<https://ci-beam.apache.org/job/beam_PreCommit_Java_Cron/ws/src/sdks/java/container/build/target/java_third_party_licenses> --dep_url_yaml=<https://ci-beam.apache.org/job/beam_PreCommit_Java_Cron/ws/src/sdks/java/container/license_scripts/dep_urls_java.yaml> --manual_license_path=<https://ci-beam.apache.org/job/beam_PreCommit_Java_Cron/ws/src/sdks/java/container/license_scripts/manual_licenses>
INFO:root:Pulling license for 240 dependencies using 16 threads.
INFO:root:Replaced local file URL with file://<https://ci-beam.apache.org/job/beam_PreCommit_Java_Cron/ws/src/sdks/java/container/license_scripts/manual_licenses/xz/COPYING> for xz-1.5
INFO:root:pull_licenses_java.py succeed. It took 7.862982 seconds with 16 threads.
Copying licenses from <https://ci-beam.apache.org/job/beam_PreCommit_Java_Cron/ws/src/sdks/java/container/build/target/java_third_party_licenses> to <https://ci-beam.apache.org/job/beam_PreCommit_Java_Cron/ws/src/sdks/java/container/build/target/third_party_licenses.>
Finished license_scripts.sh
> Task :sdks:java:container:goPrepare UP-TO-DATE
> Task :release:go-licenses:java:dockerRun
W0907 08:54:19.403150 37 library.go:94] "golang.org/x/sys/unix" contains non-Go code that can't be inspected for further dependencies:
/go/pkg/mod/golang.org/x/sys@v0.0.0-20220624220833-87e55d714810/unix/asm_linux_amd64.s
+ go-licenses csv github.com/apache/beam/sdks/v2/java/container
+ tee /output/licenses/list.csv
W0907 08:54:30.925432 209 library.go:94] "golang.org/x/sys/unix" contains non-Go code that can't be inspected for further dependencies:
/go/pkg/mod/golang.org/x/sys@v0.0.0-20220624220833-87e55d714810/unix/asm_linux_amd64.s
> Task :sdks:java:container:java8:copyJavaThirdPartyLicenses
> Task :sdks:java:container:goBuild
/home/jenkins/go/bin/go1.18.1 build -o ./build/target/linux_amd64/boot boot.go boot_test.go
> Task :release:go-licenses:java:dockerRun
github.com/apache/beam/sdks/v2/go/pkg/beam,https://github.com/apache/beam/blob/sdks/v2.41.0/sdks/go/README.md,Apache-2.0
github.com/apache/beam/sdks/v2/java/container,https://github.com/apache/beam/blob/sdks/v2.41.0/sdks/LICENSE,Apache-2.0
github.com/golang/protobuf,https://github.com/golang/protobuf/blob/v1.5.2/LICENSE,BSD-3-Clause
golang.org/x/net,https://cs.opensource.google/go/x/net/+/1bab6f36:LICENSE,BSD-3-Clause
golang.org/x/sys,https://cs.opensource.google/go/x/sys/+/87e55d71:LICENSE,BSD-3-Clause
golang.org/x/text,https://cs.opensource.google/go/x/text/+/v0.3.7:LICENSE,BSD-3-Clause
google.golang.org/genproto/googleapis/rpc/status,https://github.com/googleapis/go-genproto/blob/042d03aeabc9/LICENSE,Apache-2.0
google.golang.org/grpc,https://github.com/grpc/grpc-go/blob/v1.48.0/LICENSE,Apache-2.0
google.golang.org/protobuf,https://github.com/protocolbuffers/protobuf-go/blob/v1.28.0/LICENSE,BSD-3-Clause
+ chmod -R a+w /output/licenses
> Task :release:go-licenses:java:createLicenses
> Task :sdks:java:container:java8:copyGolangLicenses
> Task :sdks:java:container:java8:copySdkHarnessLauncher
Execution optimizations have been disabled for task ':sdks:java:container:java8:copySdkHarnessLauncher' to ensure correctness due to the following reasons:
- Gradle detected a problem with the following location: '<https://ci-beam.apache.org/job/beam_PreCommit_Java_Cron/ws/src/sdks/java/container/build/target'.> Reason: Task ':sdks:java:container:java8:copySdkHarnessLauncher' uses this output of task ':sdks:java:container:downloadCloudProfilerAgent' without declaring an explicit or implicit dependency. This can lead to incorrect results being produced, depending on what order the tasks are executed. Please refer to https://docs.gradle.org/7.5.1/userguide/validation_problems.html#implicit_dependency for more details about this problem.
- Gradle detected a problem with the following location: '<https://ci-beam.apache.org/job/beam_PreCommit_Java_Cron/ws/src/sdks/java/container/build/target'.> Reason: Task ':sdks:java:container:java8:copySdkHarnessLauncher' uses this output of task ':sdks:java:container:pullLicenses' without declaring an explicit or implicit dependency. This can lead to incorrect results being produced, depending on what order the tasks are executed. Please refer to https://docs.gradle.org/7.5.1/userguide/validation_problems.html#implicit_dependency for more details about this problem.
> Task :sdks:java:container:java8:dockerPrepare
> Task :sdks:java:extensions:sql:jdbc:preCommit
> Task :sdks:java:container:java8:docker
---> Running in f2885eaa6f66
Removing intermediate container f2885eaa6f66
---> 803fa2b5ef19
Step 4/21 : ARG pull_licenses
---> Running in 71c750e3b117
Removing intermediate container 71c750e3b117
---> 665b47872a42
Step 5/21 : ADD target/slf4j-api.jar /opt/apache/beam/jars/
---> 91f0bf35f788
Step 6/21 : ADD target/slf4j-jdk14.jar /opt/apache/beam/jars/
---> efd14151b416
Step 7/21 : ADD target/beam-sdks-java-harness.jar /opt/apache/beam/jars/
---> 48e5c0a9bb50
Step 8/21 : ADD target/beam-sdks-java-io-kafka.jar /opt/apache/beam/jars/
---> fe6b2facd49a
Step 9/21 : ADD target/kafka-clients.jar /opt/apache/beam/jars/
---> 6a78e3bcf3ec
Step 10/21 : ADD target/jamm.jar /opt/apache/beam/jars/
---> 66f94a9eca1e
Step 11/21 : ADD target/linux_amd64/boot /opt/apache/beam/
---> 2f0e0b3a99c1
Step 12/21 : COPY target/LICENSE /opt/apache/beam/
---> 62152a43af2e
Step 13/21 : COPY target/NOTICE /opt/apache/beam/
> Task :sdks:java:core:validateShadedJarDoesntLeakNonProjectClasses
> Task :sdks:java:core:check
> Task :sdks:java:core:build
> Task :sdks:java:core:buildNeeded
> Task :sdks:java:container:java8:docker
---> a2579015b33e
Step 14/21 : ADD target/third_party_licenses /opt/apache/beam/third_party_licenses/
---> 5abb5de47d9e
Step 15/21 : COPY target/LICENSE target/options/* /opt/apache/beam/options/
---> 4190e2661240
Step 16/21 : RUN rm /opt/apache/beam/options/LICENSE
---> Running in 2b3b7a47e44a
Removing intermediate container 2b3b7a47e44a
---> 8cdca9d44977
Step 17/21 : COPY target/LICENSE target/go-licenses/* /opt/apache/beam/third_party_licenses/golang/
---> 46b3ae64801b
Step 18/21 : RUN rm /opt/apache/beam/third_party_licenses/golang/LICENSE
---> Running in a772f12d6078
Removing intermediate container a772f12d6078
---> 507293febc90
Step 19/21 : RUN if [ "${pull_licenses}" = "false" ] ; then rm -rf /opt/apache/beam/third_party_licenses ; fi
---> Running in a81583bfb428
Removing intermediate container a81583bfb428
---> 258acd44eb45
Step 20/21 : COPY target/profiler/* /opt/google_cloud_profiler/
---> c39620854c9a
Step 21/21 : ENTRYPOINT ["/opt/apache/beam/boot"]
---> Running in 3ad34b469de0
Removing intermediate container 3ad34b469de0
---> 82bdff028013
Successfully built 82bdff028013
Successfully tagged apache/beam_java8_sdk:2.42.0.dev
FAILURE: Build failed with an exception.
* What went wrong:
Execution failed for task ':sdks:java:io:google-cloud-platform:test'.
> There were failing tests. See the report at: file://<https://ci-beam.apache.org/job/beam_PreCommit_Java_Cron/ws/src/sdks/java/io/google-cloud-platform/build/reports/tests/test/index.html>
* Try:
> Run with --stacktrace option to get the stack trace.
> Run with --info or --debug option to get more log output.
* Get more help at https://help.gradle.org
Deprecated Gradle features were used in this build, making it incompatible with Gradle 8.0.
You can use '--warning-mode all' to show the individual deprecation warnings and determine if they come from your own scripts or plugins.
See https://docs.gradle.org/7.5.1/userguide/command_line_interface.html#sec:command_line_warnings
Execution optimizations have been disabled for 1 invalid unit(s) of work during this build to ensure correctness.
Please consult deprecation warnings for more details.
BUILD FAILED in 50m 13s
1157 actionable tasks: 1072 executed, 83 from cache, 2 up-to-date
Publishing build scan...
https://gradle.com/s/y4rhdlky27cgm
Build step 'Invoke Gradle script' changed build result to FAILURE
Build step 'Invoke Gradle script' marked build as failure
---------------------------------------------------------------------
To unsubscribe, e-mail: builds-unsubscribe@beam.apache.org
For additional commands, e-mail: builds-help@beam.apache.org
Jenkins build is back to normal : beam_PreCommit_Java_Cron #5894
Posted by Apache Jenkins Server <je...@builds.apache.org>.
See <https://ci-beam.apache.org/job/beam_PreCommit_Java_Cron/5894/display/redirect?page=changes>
---------------------------------------------------------------------
To unsubscribe, e-mail: builds-unsubscribe@beam.apache.org
For additional commands, e-mail: builds-help@beam.apache.org