You are viewing a plain text version of this content. The canonical link for it is here.
Posted to builds@hbase.apache.org by Apache Jenkins Server <je...@builds.apache.org> on 2015/10/16 05:34:13 UTC

Build failed in Jenkins: HBase-1.2 » latest1.7,Hadoop #260

See <https://builds.apache.org/job/HBase-1.2/jdk=latest1.7,label=Hadoop/260/>

------------------------------------------
[...truncated 44384 lines...]
Tests run: 21, Failures: 0, Errors: 0, Skipped: 3, Time elapsed: 157.18 sec - in org.apache.hadoop.hbase.client.TestHCM
Running org.apache.hadoop.hbase.client.TestClientOperationInterrupt
Running org.apache.hadoop.hbase.client.TestRpcControllerFactory
Tests run: 8, Failures: 0, Errors: 0, Skipped: 4, Time elapsed: 44.412 sec - in org.apache.hadoop.hbase.client.TestSnapshotCloneIndependence
Tests run: 1, Failures: 0, Errors: 0, Skipped: 0, Time elapsed: 3.257 sec - in org.apache.hadoop.hbase.client.TestRpcControllerFactory
Running org.apache.hadoop.hbase.client.TestScannersFromClientSide
Running org.apache.hadoop.hbase.client.TestCheckAndMutate
Tests run: 1, Failures: 0, Errors: 0, Skipped: 0, Time elapsed: 2.279 sec - in org.apache.hadoop.hbase.client.TestCheckAndMutate
Running org.apache.hadoop.hbase.client.TestFromClientSide
Tests run: 7, Failures: 0, Errors: 0, Skipped: 0, Time elapsed: 13.126 sec - in org.apache.hadoop.hbase.client.TestScannersFromClientSide
Running org.apache.hadoop.hbase.client.TestHTablePool$TestHTableThreadLocalPool
Running org.apache.hadoop.hbase.client.TestUpdateConfiguration
Tests run: 2, Failures: 0, Errors: 0, Skipped: 0, Time elapsed: 0.239 sec - in org.apache.hadoop.hbase.client.TestUpdateConfiguration
Tests run: 9, Failures: 0, Errors: 0, Skipped: 0, Time elapsed: 7.365 sec - in org.apache.hadoop.hbase.client.TestHTablePool$TestHTableThreadLocalPool
Running org.apache.hadoop.hbase.client.TestClientPushback
Tests run: 1, Failures: 0, Errors: 0, Skipped: 0, Time elapsed: 1.661 sec - in org.apache.hadoop.hbase.client.TestClientPushback
Running org.apache.hadoop.hbase.client.TestHTablePool$TestHTableReusablePool
Tests run: 9, Failures: 0, Errors: 0, Skipped: 0, Time elapsed: 6.17 sec - in org.apache.hadoop.hbase.client.TestHTablePool$TestHTableReusablePool
Running org.apache.hadoop.hbase.client.TestRestoreSnapshotFromClientWithRegionReplicas
Tests run: 1, Failures: 0, Errors: 0, Skipped: 0, Time elapsed: 54.179 sec - in org.apache.hadoop.hbase.client.TestClientOperationInterrupt
Running org.apache.hadoop.hbase.client.TestReplicaWithCluster
Running org.apache.hadoop.hbase.client.TestHTableMultiplexer
Tests run: 1, Failures: 0, Errors: 0, Skipped: 0, Time elapsed: 9.116 sec - in org.apache.hadoop.hbase.client.TestHTableMultiplexer
Running org.apache.hadoop.hbase.client.TestScannerTimeout
Tests run: 4, Failures: 0, Errors: 0, Skipped: 0, Time elapsed: 43.144 sec - in org.apache.hadoop.hbase.client.TestReplicaWithCluster
Tests run: 5, Failures: 0, Errors: 0, Skipped: 0, Time elapsed: 140.194 sec - in org.apache.hadoop.hbase.client.TestCloneSnapshotFromClientWithRegionReplicas
Running org.apache.hadoop.hbase.client.TestHTablePool$TestHTableReusablePool
Tests run: 4, Failures: 0, Errors: 0, Skipped: 0, Time elapsed: 38.924 sec - in org.apache.hadoop.hbase.client.TestScannerTimeout
Running org.apache.hadoop.hbase.client.TestTableSnapshotScanner
Running org.apache.hadoop.hbase.client.TestReplicasClient
Tests run: 9, Failures: 0, Errors: 0, Skipped: 0, Time elapsed: 12.092 sec - in org.apache.hadoop.hbase.client.TestHTablePool$TestHTableReusablePool
Running org.apache.hadoop.hbase.client.TestHTablePool$TestHTableThreadLocalPool
Tests run: 9, Failures: 0, Errors: 0, Skipped: 0, Time elapsed: 6.679 sec - in org.apache.hadoop.hbase.client.TestHTablePool$TestHTableThreadLocalPool
Running org.apache.hadoop.hbase.client.TestFromClientSide3
Tests run: 3, Failures: 0, Errors: 0, Skipped: 0, Time elapsed: 46.196 sec - in org.apache.hadoop.hbase.client.TestTableSnapshotScanner
Running org.apache.hadoop.hbase.client.TestMetaWithReplicas
Tests run: 5, Failures: 0, Errors: 0, Skipped: 0, Time elapsed: 151.204 sec - in org.apache.hadoop.hbase.client.TestRestoreSnapshotFromClientWithRegionReplicas
Tests run: 9, Failures: 0, Errors: 0, Skipped: 0, Time elapsed: 68.503 sec - in org.apache.hadoop.hbase.client.TestFromClientSide3
Running org.apache.hadoop.hbase.client.TestResultSizeEstimation
Tests run: 2, Failures: 0, Errors: 0, Skipped: 0, Time elapsed: 4.191 sec - in org.apache.hadoop.hbase.client.TestResultSizeEstimation
Tests run: 82, Failures: 0, Errors: 0, Skipped: 4, Time elapsed: 205.663 sec - in org.apache.hadoop.hbase.client.TestFromClientSide
Running org.apache.hadoop.hbase.client.TestRestoreSnapshotFromClient
Running org.apache.hadoop.hbase.client.TestSnapshotMetadata
Running org.apache.hadoop.hbase.client.TestHTableMultiplexerFlushCache
Tests run: 1, Failures: 0, Errors: 0, Skipped: 0, Time elapsed: 6.087 sec - in org.apache.hadoop.hbase.client.TestHTableMultiplexerFlushCache
Running org.apache.hadoop.hbase.TestMultiVersions
Tests run: 3, Failures: 0, Errors: 0, Skipped: 0, Time elapsed: 8.78 sec - in org.apache.hadoop.hbase.TestMultiVersions
Tests run: 4, Failures: 0, Errors: 0, Skipped: 0, Time elapsed: 32.359 sec - in org.apache.hadoop.hbase.client.TestSnapshotMetadata
Running org.apache.hadoop.hbase.procedure.TestZKProcedure
Tests run: 4, Failures: 0, Errors: 0, Skipped: 0, Time elapsed: 2.107 sec - in org.apache.hadoop.hbase.procedure.TestZKProcedure
Running org.apache.hadoop.hbase.TestHColumnDescriptorDefaultVersions
Running org.apache.hadoop.hbase.procedure.TestZKProcedureControllers
Tests run: 4, Failures: 0, Errors: 0, Skipped: 0, Time elapsed: 1.956 sec - in org.apache.hadoop.hbase.procedure.TestZKProcedureControllers
Running org.apache.hadoop.hbase.TestNamespace
Tests run: 3, Failures: 0, Errors: 0, Skipped: 0, Time elapsed: 23.995 sec - in org.apache.hadoop.hbase.TestHColumnDescriptorDefaultVersions
Running org.apache.hadoop.hbase.constraint.TestConstraint
Tests run: 9, Failures: 0, Errors: 0, Skipped: 1, Time elapsed: 25.193 sec - in org.apache.hadoop.hbase.TestNamespace
Running org.apache.hadoop.hbase.TestZooKeeper
Tests run: 12, Failures: 0, Errors: 0, Skipped: 0, Time elapsed: 141.867 sec - in org.apache.hadoop.hbase.client.TestMetaWithReplicas
Tests run: 5, Failures: 0, Errors: 0, Skipped: 0, Time elapsed: 22.402 sec - in org.apache.hadoop.hbase.constraint.TestConstraint
Running org.apache.hadoop.hbase.snapshot.TestFlushSnapshotFromClient
Running org.apache.hadoop.hbase.snapshot.TestExportSnapshot
Tests run: 5, Failures: 0, Errors: 0, Skipped: 0, Time elapsed: 149.996 sec - in org.apache.hadoop.hbase.client.TestRestoreSnapshotFromClient
Tests run: 14, Failures: 0, Errors: 0, Skipped: 0, Time elapsed: 257.19 sec - in org.apache.hadoop.hbase.client.TestReplicasClient
Running org.apache.hadoop.hbase.snapshot.TestRestoreFlushSnapshotFromClient
Running org.apache.hadoop.hbase.snapshot.TestSecureExportSnapshot
Tests run: 9, Failures: 0, Errors: 0, Skipped: 0, Time elapsed: 78.566 sec - in org.apache.hadoop.hbase.snapshot.TestFlushSnapshotFromClient
Running org.apache.hadoop.hbase.snapshot.TestSnapshotClientRetries
Tests run: 2, Failures: 0, Errors: 0, Skipped: 0, Time elapsed: 18.118 sec - in org.apache.hadoop.hbase.snapshot.TestSnapshotClientRetries
Running org.apache.hadoop.hbase.snapshot.TestSnapshotDescriptionUtils
Tests run: 2, Failures: 0, Errors: 0, Skipped: 0, Time elapsed: 0.246 sec - in org.apache.hadoop.hbase.snapshot.TestSnapshotDescriptionUtils
Running org.apache.hadoop.hbase.TestIOFencing
Tests run: 5, Failures: 0, Errors: 0, Skipped: 0, Time elapsed: 76.611 sec - in org.apache.hadoop.hbase.snapshot.TestRestoreFlushSnapshotFromClient
Running org.apache.hadoop.hbase.coprocessor.TestRegionObserverScannerOpenHook
Tests run: 3, Failures: 0, Errors: 0, Skipped: 0, Time elapsed: 11.571 sec - in org.apache.hadoop.hbase.coprocessor.TestRegionObserverScannerOpenHook
Tests run: 12, Failures: 0, Errors: 0, Skipped: 0, Time elapsed: 174.042 sec - in org.apache.hadoop.hbase.TestZooKeeper
Running org.apache.hadoop.hbase.coprocessor.TestOpenTableInCoprocessor
Running org.apache.hadoop.hbase.coprocessor.TestMasterCoprocessorExceptionWithAbort
Tests run: 2, Failures: 0, Errors: 0, Skipped: 0, Time elapsed: 18.788 sec - in org.apache.hadoop.hbase.coprocessor.TestOpenTableInCoprocessor
Tests run: 1, Failures: 0, Errors: 0, Skipped: 0, Time elapsed: 17.652 sec - in org.apache.hadoop.hbase.coprocessor.TestMasterCoprocessorExceptionWithAbort
Running org.apache.hadoop.hbase.coprocessor.TestCoprocessorTableEndpoint
Running org.apache.hadoop.hbase.coprocessor.TestRegionServerCoprocessorEndpoint
Tests run: 2, Failures: 0, Errors: 0, Skipped: 0, Time elapsed: 1.332 sec - in org.apache.hadoop.hbase.coprocessor.TestRegionServerCoprocessorEndpoint
Tests run: 2, Failures: 0, Errors: 0, Skipped: 0, Time elapsed: 8.564 sec - in org.apache.hadoop.hbase.coprocessor.TestCoprocessorTableEndpoint
Running org.apache.hadoop.hbase.coprocessor.TestRegionObserverInterface
Running org.apache.hadoop.hbase.coprocessor.TestMasterCoprocessorExceptionWithRemove
Tests run: 1, Failures: 0, Errors: 0, Skipped: 0, Time elapsed: 5.241 sec - in org.apache.hadoop.hbase.coprocessor.TestMasterCoprocessorExceptionWithRemove
Tests run: 2, Failures: 0, Errors: 0, Skipped: 0, Time elapsed: 112.331 sec - in org.apache.hadoop.hbase.TestIOFencing
Running org.apache.hadoop.hbase.coprocessor.TestAggregateProtocol
Running org.apache.hadoop.hbase.coprocessor.TestBatchCoprocessorEndpoint
Tests run: 4, Failures: 0, Errors: 0, Skipped: 0, Time elapsed: 1.986 sec - in org.apache.hadoop.hbase.coprocessor.TestBatchCoprocessorEndpoint
Tests run: 44, Failures: 0, Errors: 0, Skipped: 0, Time elapsed: 4.854 sec - in org.apache.hadoop.hbase.coprocessor.TestAggregateProtocol
Running org.apache.hadoop.hbase.coprocessor.TestRegionServerObserver
Running org.apache.hadoop.hbase.coprocessor.TestHTableWrapper
Tests run: 1, Failures: 0, Errors: 0, Skipped: 0, Time elapsed: 5.227 sec - in org.apache.hadoop.hbase.coprocessor.TestHTableWrapper
Tests run: 1, Failures: 0, Errors: 0, Skipped: 0, Time elapsed: 18.029 sec - in org.apache.hadoop.hbase.coprocessor.TestRegionServerObserver
Running org.apache.hadoop.hbase.coprocessor.TestRegionServerCoprocessorExceptionWithAbort
Running org.apache.hadoop.hbase.coprocessor.TestClassLoading
Tests run: 2, Failures: 0, Errors: 0, Skipped: 0, Time elapsed: 17.461 sec - in org.apache.hadoop.hbase.coprocessor.TestRegionServerCoprocessorExceptionWithAbort
Tests run: 14, Failures: 0, Errors: 0, Skipped: 2, Time elapsed: 70.941 sec - in org.apache.hadoop.hbase.coprocessor.TestRegionObserverInterface
Running org.apache.hadoop.hbase.coprocessor.TestDoubleColumnInterpreter
Tests run: 9, Failures: 0, Errors: 0, Skipped: 0, Time elapsed: 27.94 sec - in org.apache.hadoop.hbase.coprocessor.TestClassLoading
Tests run: 38, Failures: 0, Errors: 0, Skipped: 0, Time elapsed: 4.474 sec - in org.apache.hadoop.hbase.coprocessor.TestDoubleColumnInterpreter
Running org.apache.hadoop.hbase.coprocessor.TestRegionObserverBypass
Tests run: 2, Failures: 0, Errors: 0, Skipped: 0, Time elapsed: 7.119 sec - in org.apache.hadoop.hbase.coprocessor.TestRegionObserverBypass
Running org.apache.hadoop.hbase.coprocessor.TestRowProcessorEndpoint
Running org.apache.hadoop.hbase.coprocessor.TestCoprocessorStop
Running org.apache.hadoop.hbase.coprocessor.TestRegionServerCoprocessorExceptionWithRemove
Tests run: 1, Failures: 0, Errors: 0, Skipped: 0, Time elapsed: 17.11 sec - in org.apache.hadoop.hbase.coprocessor.TestCoprocessorStop
Tests run: 4, Failures: 0, Errors: 0, Skipped: 0, Time elapsed: 18.792 sec - in org.apache.hadoop.hbase.coprocessor.TestRowProcessorEndpoint
Tests run: 1, Failures: 0, Errors: 0, Skipped: 0, Time elapsed: 15.781 sec - in org.apache.hadoop.hbase.coprocessor.TestRegionServerCoprocessorExceptionWithRemove
Running org.apache.hadoop.hbase.coprocessor.TestMasterObserver
Running org.apache.hadoop.hbase.coprocessor.TestBigDecimalColumnInterpreter
Tests run: 38, Failures: 0, Errors: 0, Skipped: 0, Time elapsed: 4.68 sec - in org.apache.hadoop.hbase.coprocessor.TestBigDecimalColumnInterpreter
Running org.apache.hadoop.hbase.coprocessor.TestCoprocessorEndpoint
Tests run: 9, Failures: 0, Errors: 0, Skipped: 0, Time elapsed: 318.178 sec - in org.apache.hadoop.hbase.snapshot.TestExportSnapshot
Running org.apache.hadoop.hbase.TestGlobalMemStoreSize
Tests run: 6, Failures: 0, Errors: 0, Skipped: 0, Time elapsed: 1.95 sec - in org.apache.hadoop.hbase.coprocessor.TestCoprocessorEndpoint
Running org.apache.hadoop.hbase.coprocessor.TestWALObserver
Running org.apache.hadoop.hbase.TestJMXListener
Tests run: 1, Failures: 0, Errors: 0, Skipped: 0, Time elapsed: 13.352 sec - in org.apache.hadoop.hbase.TestGlobalMemStoreSize
Tests run: 6, Failures: 0, Errors: 0, Skipped: 0, Time elapsed: 8.192 sec - in org.apache.hadoop.hbase.coprocessor.TestWALObserver
Running org.apache.hadoop.hbase.TestMetaTableLocator
Tests run: 7, Failures: 0, Errors: 0, Skipped: 0, Time elapsed: 3.77 sec - in org.apache.hadoop.hbase.TestMetaTableLocator
Running org.apache.hadoop.hbase.zookeeper.TestZKTableStateManager
Tests run: 1, Failures: 0, Errors: 0, Skipped: 0, Time elapsed: 0.736 sec - in org.apache.hadoop.hbase.zookeeper.TestZKTableStateManager
Running org.apache.hadoop.hbase.zookeeper.TestZKMulti
Running org.apache.hadoop.hbase.zookeeper.TestZooKeeperACL
Tests run: 7, Failures: 0, Errors: 0, Skipped: 0, Time elapsed: 0.339 sec - in org.apache.hadoop.hbase.zookeeper.TestZooKeeperACL
Tests run: 12, Failures: 0, Errors: 0, Skipped: 0, Time elapsed: 1.599 sec - in org.apache.hadoop.hbase.zookeeper.TestZKMulti
Running org.apache.hadoop.hbase.zookeeper.lock.TestZKInterProcessReadWriteLock
Tests run: 2, Failures: 0, Errors: 0, Skipped: 0, Time elapsed: 16.402 sec - in org.apache.hadoop.hbase.TestJMXListener
Running org.apache.hadoop.hbase.zookeeper.TestZKLeaderManager
Tests run: 7, Failures: 0, Errors: 0, Skipped: 0, Time elapsed: 36.627 sec - in org.apache.hadoop.hbase.coprocessor.TestMasterObserver
Tests run: 1, Failures: 0, Errors: 0, Skipped: 0, Time elapsed: 0.15 sec - in org.apache.hadoop.hbase.zookeeper.TestZKLeaderManager
Running org.apache.hadoop.hbase.zookeeper.TestRecoverableZooKeeper
Running org.apache.hadoop.hbase.zookeeper.TestHQuorumPeer
Running org.apache.hadoop.hbase.zookeeper.TestZooKeeperNodeTracker
Tests run: 1, Failures: 0, Errors: 0, Skipped: 0, Time elapsed: 1.278 sec - in org.apache.hadoop.hbase.zookeeper.TestRecoverableZooKeeper
Tests run: 3, Failures: 0, Errors: 0, Skipped: 0, Time elapsed: 0.995 sec - in org.apache.hadoop.hbase.zookeeper.TestZooKeeperNodeTracker
Tests run: 4, Failures: 0, Errors: 0, Skipped: 0, Time elapsed: 1.56 sec - in org.apache.hadoop.hbase.zookeeper.TestHQuorumPeer
Running org.apache.hadoop.hbase.TestClusterBootOrder
Running org.apache.hadoop.hbase.TestPartialResultsFromClientSide
Running org.apache.hadoop.hbase.TestServerSideScanMetricsFromClientSide
Tests run: 2, Failures: 0, Errors: 0, Skipped: 0, Time elapsed: 3.106 sec - in org.apache.hadoop.hbase.TestServerSideScanMetricsFromClientSide
Tests run: 6, Failures: 0, Errors: 0, Skipped: 0, Time elapsed: 24.548 sec - in org.apache.hadoop.hbase.zookeeper.lock.TestZKInterProcessReadWriteLock
Tests run: 2, Failures: 0, Errors: 0, Skipped: 0, Time elapsed: 27.045 sec - in org.apache.hadoop.hbase.TestClusterBootOrder
Tests run: 9, Failures: 0, Errors: 0, Skipped: 0, Time elapsed: 324.342 sec - in org.apache.hadoop.hbase.snapshot.TestSecureExportSnapshot
Tests run: 13, Failures: 0, Errors: 0, Skipped: 0, Time elapsed: 48.15 sec - in org.apache.hadoop.hbase.TestPartialResultsFromClientSide

Results :

Tests in error: 
  TestTableMapReduce>TestTableMapReduceBase.beforeClass:78 » Bind Port in use: l...
  TestMasterFailoverWithProcedures.testWALfencingWithoutWALRolling:173->testWALfencing:205 » FileNotFound
org.apache.hadoop.hbase.security.token.TestGenerateDelegationToken.org.apache.hadoop.hbase.security.token.TestGenerateDelegationToken
  Run 1: TestGenerateDelegationToken.org.apache.hadoop.hbase.security.token.TestGenerateDelegationToken » Bind
  Run 2: TestGenerateDelegationToken.tearDown:137 NullPointer


Tests run: 2476, Failures: 0, Errors: 3, Skipped: 58

[INFO] ------------------------------------------------------------------------
[INFO] Reactor Summary:
[INFO] 
[INFO] Apache HBase ...................................... SUCCESS [1:07.697s]
[INFO] Apache HBase - Checkstyle ......................... SUCCESS [5.560s]
[INFO] Apache HBase - Resource Bundle .................... SUCCESS [0.198s]
[INFO] Apache HBase - Annotations ........................ SUCCESS [1.290s]
[INFO] Apache HBase - Protocol ........................... SUCCESS [15.877s]
[INFO] Apache HBase - Common ............................. SUCCESS [2:47.643s]
[INFO] Apache HBase - Procedure .......................... SUCCESS [1:52.358s]
[INFO] Apache HBase - Client ............................. SUCCESS [1:30.954s]
[INFO] Apache HBase - Hadoop Compatibility ............... SUCCESS [7.874s]
[INFO] Apache HBase - Hadoop Two Compatibility ........... SUCCESS [10.100s]
[INFO] Apache HBase - Prefix Tree ........................ SUCCESS [9.652s]
[INFO] Apache HBase - Server ............................. FAILURE [1:27:54.307s]
[INFO] Apache HBase - Testing Util ....................... SKIPPED
[INFO] Apache HBase - Thrift ............................. SKIPPED
[INFO] Apache HBase - Rest ............................... SKIPPED
[INFO] Apache HBase - Shell .............................. SKIPPED
[INFO] Apache HBase - Integration Tests .................. SKIPPED
[INFO] Apache HBase - Examples ........................... SKIPPED
[INFO] Apache HBase - External Block Cache ............... SKIPPED
[INFO] Apache HBase - Assembly ........................... SKIPPED
[INFO] Apache HBase - Shaded ............................. SKIPPED
[INFO] Apache HBase - Shaded - Client .................... SKIPPED
[INFO] Apache HBase - Shaded - Server .................... SKIPPED
[INFO] ------------------------------------------------------------------------
[INFO] BUILD FAILURE
[INFO] ------------------------------------------------------------------------
[INFO] Total time: 1:36:23.273s
[INFO] Finished at: Fri Oct 16 03:31:55 UTC 2015
[INFO] Final Memory: 93M/622M
[INFO] ------------------------------------------------------------------------
[ERROR] Failed to execute goal org.apache.maven.plugins:maven-surefire-plugin:2.18.1:test (secondPartTestsExecution) on project hbase-server: ExecutionException: java.lang.RuntimeException: java.lang.RuntimeException: org.apache.maven.surefire.report.ReporterException: When writing xml report stdout/stderr: /tmp/stderr3593958034424812281deferred (No such file or directory) -> [Help 1]
[ERROR] 
[ERROR] To see the full stack trace of the errors, re-run Maven with the -e switch.
[ERROR] Re-run Maven using the -X switch to enable full debug logging.
[ERROR] 
[ERROR] For more information about the errors and possible solutions, please read the following articles:
[ERROR] [Help 1] http://cwiki.apache.org/confluence/display/MAVEN/MojoFailureException
[ERROR] 
[ERROR] After correcting the problems, you can resume the build with the command
[ERROR]   mvn <goals> -rf :hbase-server
Build step 'Invoke top-level Maven targets' marked build as failure
Performing Post build task...
Match found for :.* : True
Logical operation result is TRUE
Running script  :     ZOMBIE_TESTS_COUNT=`jps -v | grep surefirebooter | grep '-Dhbase.test' | wc -l`
  if [[ $ZOMBIE_TESTS_COUNT != 0 ]] ; then
    #It seems sometimes the tests are not dying immediately. Let's give them 30s
    echo "Suspicious java process found - waiting 30s to see if there are just slow to stop"
    sleep 30
    ZOMBIE_TESTS_COUNT=`jps -v | grep surefirebooter | grep '-Dhbase.test' | wc -l`
    if [[ $ZOMBIE_TESTS_COUNT != 0 ]] ; then
      echo "There are $ZOMBIE_TESTS_COUNT zombie tests, they should have been killed by surefire but survived"
      echo "************ zombies jps listing"
      jps -v
      jps -v | grep surefirebooter | grep '-Dhbase.test'
      echo "************ BEGIN zombies jstack extract"
      # HBase tests have been flagged with an innocuous '-Dhbase.test' just so they can
      # be identified as hbase in a process listing.
      ZB_STACK=`jps -v | grep surefirebooter | grep '-Dhbase.test' | cut -d ' ' -f 1 | xargs -n 1 jstack | grep ".test" | grep "\.java"`
      jps -v | grep surefirebooter | grep '-Dhbase.test' | cut -d ' ' -f 1 | xargs -n 1 jstack
      echo "************ END  zombies jstack extract"
      JIRA_COMMENT="$JIRA_COMMENT

     {color:red}-1 core zombie tests{color}.  There are ${ZOMBIE_TESTS_COUNT} zombie test(s): ${ZB_STACK}"
      BAD=1
      # Killing these zombies
      echo 'Killing ZOMBIES!!!'
      jps -v
      jps -v | grep surefirebooter | grep '-Dhbase.test' | cut -d ' ' -f 1 | xargs kill -9
    else
      echo "We're ok: there is no zombie test, but some tests took some time to stop"
    fi
[Hadoop] $ /bin/bash -xe /tmp/hudson7291891293364043501.sh
++ jps -v
++ grep surefirebooter
++ wc -l
++ grep -Dhbase.test
grep: unknown devices method
grep: write error: Broken pipe
+ ZOMBIE_TESTS_COUNT=0
/tmp/hudson7291891293364043501.sh: line 30: syntax error: unexpected end of file
POST BUILD TASK : FAILURE
END OF POST BUILD TASK : 0
Archiving artifacts

Jenkins build is back to normal : HBase-1.2 » latest1.7,Hadoop #262

Posted by Apache Jenkins Server <je...@builds.apache.org>.
See <https://builds.apache.org/job/HBase-1.2/jdk=latest1.7,label=Hadoop/262/>


Build failed in Jenkins: HBase-1.2 » latest1.7,Hadoop #261

Posted by Apache Jenkins Server <je...@builds.apache.org>.
See <https://builds.apache.org/job/HBase-1.2/jdk=latest1.7,label=Hadoop/261/>

------------------------------------------
[...truncated 44280 lines...]
Tests run: 16, Failures: 0, Errors: 0, Skipped: 0, Time elapsed: 249.555 sec - in org.apache.hadoop.hbase.mapreduce.TestSecureLoadIncrementalHFiles
Running org.apache.hadoop.hbase.mapreduce.TestLoadIncrementalHFiles
Tests run: 7, Failures: 0, Errors: 0, Skipped: 0, Time elapsed: 219.104 sec - in org.apache.hadoop.hbase.mapreduce.TestTableInputFormatScan1
Tests run: 4, Failures: 0, Errors: 0, Skipped: 0, Time elapsed: 495.629 sec - in org.apache.hadoop.hbase.master.balancer.TestStochasticLoadBalancer2
Running org.apache.hadoop.hbase.mapreduce.TestLoadIncrementalHFilesSplitRecovery
Running org.apache.hadoop.hbase.mapreduce.TestSyncTable
Tests run: 5, Failures: 0, Errors: 0, Skipped: 0, Time elapsed: 38.95 sec - in org.apache.hadoop.hbase.mapreduce.TestLoadIncrementalHFilesSplitRecovery
Tests run: 11, Failures: 0, Errors: 0, Skipped: 0, Time elapsed: 334.643 sec - in org.apache.hadoop.hbase.mapreduce.TestImportTsv
Running org.apache.hadoop.hbase.mapreduce.TestTimeRangeMapRed
Running org.apache.hadoop.hbase.mapreduce.TestMultiTableInputFormat
Tests run: 1, Failures: 0, Errors: 0, Skipped: 0, Time elapsed: 110.258 sec - in org.apache.hadoop.hbase.mapreduce.TestSyncTable
Tests run: 1, Failures: 0, Errors: 0, Skipped: 0, Time elapsed: 73.393 sec - in org.apache.hadoop.hbase.mapreduce.TestTimeRangeMapRed
Tests run: 7, Failures: 0, Errors: 0, Skipped: 0, Time elapsed: 251.946 sec - in org.apache.hadoop.hbase.mapreduce.TestTableInputFormatScan2
Running org.apache.hadoop.hbase.mapreduce.TestImportTSVWithOperationAttributes
Running org.apache.hadoop.hbase.mapreduce.TestMultithreadedTableMapper
Tests run: 16, Failures: 0, Errors: 0, Skipped: 0, Time elapsed: 259.957 sec - in org.apache.hadoop.hbase.mapreduce.TestLoadIncrementalHFiles
Running org.apache.hadoop.hbase.mapreduce.TestTableSnapshotInputFormat
Running org.apache.hadoop.hbase.mapreduce.TestRowCounter
Tests run: 4, Failures: 0, Errors: 0, Skipped: 0, Time elapsed: 160.857 sec - in org.apache.hadoop.hbase.mapreduce.TestMultiTableInputFormat
Running org.apache.hadoop.hbase.mapreduce.TestLoadIncrementalHFilesUseSecurityEndPoint
Tests run: 2, Failures: 0, Errors: 0, Skipped: 0, Time elapsed: 101.807 sec - in org.apache.hadoop.hbase.mapreduce.TestImportTSVWithOperationAttributes
Tests run: 1, Failures: 0, Errors: 0, Skipped: 0, Time elapsed: 106.78 sec - in org.apache.hadoop.hbase.mapreduce.TestMultithreadedTableMapper
Running org.apache.hadoop.hbase.mapreduce.TestTableInputFormat
Running org.apache.hadoop.hbase.mapreduce.TestImportTSVWithTTLs
Tests run: 1, Failures: 0, Errors: 0, Skipped: 0, Time elapsed: 46.708 sec - in org.apache.hadoop.hbase.mapreduce.TestImportTSVWithTTLs
Running org.apache.hadoop.hbase.mapreduce.TestHFileOutputFormat2
Tests run: 14, Failures: 0, Errors: 0, Skipped: 14, Time elapsed: 0.004 sec - in org.apache.hadoop.hbase.mapreduce.TestHFileOutputFormat2
Running org.apache.hadoop.hbase.mapreduce.TestHFileOutputFormat
Tests run: 8, Failures: 0, Errors: 0, Skipped: 0, Time elapsed: 99.969 sec - in org.apache.hadoop.hbase.mapreduce.TestTableInputFormat
Tests run: 6, Failures: 0, Errors: 0, Skipped: 0, Time elapsed: 208.891 sec - in org.apache.hadoop.hbase.mapreduce.TestRowCounter
Running org.apache.hadoop.hbase.mapreduce.TestWALRecordReader
Tests run: 2, Failures: 0, Errors: 0, Skipped: 0, Time elapsed: 1.253 sec - in org.apache.hadoop.hbase.mapreduce.TestWALRecordReader
Running org.apache.hadoop.hbase.mapreduce.TestCellCounter
Running org.apache.hadoop.hbase.mapreduce.TestCopyTable
Tests run: 16, Failures: 0, Errors: 0, Skipped: 0, Time elapsed: 258.052 sec - in org.apache.hadoop.hbase.mapreduce.TestLoadIncrementalHFilesUseSecurityEndPoint
Tests run: 8, Failures: 0, Errors: 0, Skipped: 0, Time elapsed: 369.124 sec - in org.apache.hadoop.hbase.mapreduce.TestTableSnapshotInputFormat
Running org.apache.hadoop.hbase.mapreduce.TestTableMapReduce
Running org.apache.hadoop.hbase.mapreduce.TestImportExport
Tests run: 5, Failures: 0, Errors: 0, Skipped: 0, Time elapsed: 164.794 sec - in org.apache.hadoop.hbase.mapreduce.TestCopyTable
Tests run: 7, Failures: 0, Errors: 0, Skipped: 0, Time elapsed: 194.726 sec - in org.apache.hadoop.hbase.mapreduce.TestCellCounter
Running org.apache.hadoop.hbase.mapreduce.TestSecureLoadIncrementalHFilesSplitRecovery
Running org.apache.hadoop.hbase.mapreduce.TestHashTable
Tests run: 5, Failures: 0, Errors: 0, Skipped: 0, Time elapsed: 35.215 sec - in org.apache.hadoop.hbase.mapreduce.TestSecureLoadIncrementalHFilesSplitRecovery
Tests run: 13, Failures: 0, Errors: 0, Skipped: 1, Time elapsed: 320.414 sec - in org.apache.hadoop.hbase.mapreduce.TestHFileOutputFormat
Running org.apache.hadoop.hbase.mapreduce.TestImportTSVWithVisibilityLabels
Running org.apache.hadoop.hbase.mapreduce.TestMultiTableSnapshotInputFormat
Tests run: 1, Failures: 0, Errors: 0, Skipped: 0, Time elapsed: 85.89 sec - in org.apache.hadoop.hbase.mapreduce.TestHashTable
Running org.apache.hadoop.hbase.coprocessor.TestRowProcessorEndpoint
Tests run: 2, Failures: 0, Errors: 0, Skipped: 0, Time elapsed: 171.622 sec - in org.apache.hadoop.hbase.mapreduce.TestTableMapReduce
Running org.apache.hadoop.hbase.coprocessor.TestHTableWrapper
Tests run: 1, Failures: 0, Errors: 0, Skipped: 0, Time elapsed: 9.181 sec - in org.apache.hadoop.hbase.coprocessor.TestHTableWrapper
Tests run: 4, Failures: 0, Errors: 0, Skipped: 0, Time elapsed: 28.923 sec - in org.apache.hadoop.hbase.coprocessor.TestRowProcessorEndpoint
Running org.apache.hadoop.hbase.coprocessor.TestBigDecimalColumnInterpreter
Running org.apache.hadoop.hbase.coprocessor.TestCoprocessorTableEndpoint
Tests run: 38, Failures: 0, Errors: 0, Skipped: 0, Time elapsed: 5.016 sec - in org.apache.hadoop.hbase.coprocessor.TestBigDecimalColumnInterpreter
Running org.apache.hadoop.hbase.coprocessor.TestCoprocessorEndpoint
Tests run: 2, Failures: 0, Errors: 0, Skipped: 0, Time elapsed: 16.81 sec - in org.apache.hadoop.hbase.coprocessor.TestCoprocessorTableEndpoint
Tests run: 6, Failures: 0, Errors: 0, Skipped: 0, Time elapsed: 2.466 sec - in org.apache.hadoop.hbase.coprocessor.TestCoprocessorEndpoint
Running org.apache.hadoop.hbase.coprocessor.TestRegionServerCoprocessorExceptionWithRemove
Running org.apache.hadoop.hbase.coprocessor.TestAggregateProtocol
Tests run: 44, Failures: 0, Errors: 0, Skipped: 0, Time elapsed: 6.29 sec - in org.apache.hadoop.hbase.coprocessor.TestAggregateProtocol
Tests run: 1, Failures: 0, Errors: 0, Skipped: 0, Time elapsed: 16.288 sec - in org.apache.hadoop.hbase.coprocessor.TestRegionServerCoprocessorExceptionWithRemove
Running org.apache.hadoop.hbase.coprocessor.TestMasterObserver
Running org.apache.hadoop.hbase.coprocessor.TestRegionObserverInterface
Tests run: 4, Failures: 0, Errors: 0, Skipped: 0, Time elapsed: 162.102 sec - in org.apache.hadoop.hbase.mapreduce.TestMultiTableSnapshotInputFormat
Running org.apache.hadoop.hbase.coprocessor.TestRegionServerCoprocessorExceptionWithAbort
Tests run: 7, Failures: 0, Errors: 0, Skipped: 0, Time elapsed: 56.274 sec - in org.apache.hadoop.hbase.coprocessor.TestMasterObserver
Running org.apache.hadoop.hbase.coprocessor.TestRegionObserverBypass
Tests run: 2, Failures: 0, Errors: 0, Skipped: 0, Time elapsed: 23.648 sec - in org.apache.hadoop.hbase.coprocessor.TestRegionServerCoprocessorExceptionWithAbort
Tests run: 2, Failures: 0, Errors: 0, Skipped: 0, Time elapsed: 11.096 sec - in org.apache.hadoop.hbase.coprocessor.TestRegionObserverBypass
Running org.apache.hadoop.hbase.coprocessor.TestRegionServerCoprocessorEndpoint
Tests run: 2, Failures: 0, Errors: 0, Skipped: 0, Time elapsed: 1.599 sec - in org.apache.hadoop.hbase.coprocessor.TestRegionServerCoprocessorEndpoint
Running org.apache.hadoop.hbase.coprocessor.TestRegionObserverScannerOpenHook
Running org.apache.hadoop.hbase.coprocessor.TestMasterCoprocessorExceptionWithRemove
Tests run: 5, Failures: 0, Errors: 0, Skipped: 0, Time elapsed: 214.503 sec - in org.apache.hadoop.hbase.mapreduce.TestImportTSVWithVisibilityLabels
Tests run: 1, Failures: 0, Errors: 0, Skipped: 0, Time elapsed: 6.886 sec - in org.apache.hadoop.hbase.coprocessor.TestMasterCoprocessorExceptionWithRemove
Tests run: 3, Failures: 0, Errors: 0, Skipped: 0, Time elapsed: 13.997 sec - in org.apache.hadoop.hbase.coprocessor.TestRegionObserverScannerOpenHook
Running org.apache.hadoop.hbase.coprocessor.TestRegionServerObserver
Tests run: 14, Failures: 0, Errors: 0, Skipped: 2, Time elapsed: 98.998 sec - in org.apache.hadoop.hbase.coprocessor.TestRegionObserverInterface
Running org.apache.hadoop.hbase.coprocessor.TestDoubleColumnInterpreter
Running org.apache.hadoop.hbase.coprocessor.TestWALObserver
Tests run: 38, Failures: 0, Errors: 0, Skipped: 0, Time elapsed: 5.3 sec - in org.apache.hadoop.hbase.coprocessor.TestDoubleColumnInterpreter
Running org.apache.hadoop.hbase.coprocessor.TestMasterCoprocessorExceptionWithAbort
Tests run: 6, Failures: 0, Errors: 0, Skipped: 0, Time elapsed: 8.914 sec - in org.apache.hadoop.hbase.coprocessor.TestWALObserver
Tests run: 1, Failures: 0, Errors: 0, Skipped: 0, Time elapsed: 19.691 sec - in org.apache.hadoop.hbase.coprocessor.TestRegionServerObserver
Running org.apache.hadoop.hbase.coprocessor.TestBatchCoprocessorEndpoint
Running org.apache.hadoop.hbase.coprocessor.TestOpenTableInCoprocessor
Tests run: 4, Failures: 0, Errors: 0, Skipped: 0, Time elapsed: 1.971 sec - in org.apache.hadoop.hbase.coprocessor.TestBatchCoprocessorEndpoint
Tests run: 1, Failures: 0, Errors: 0, Skipped: 0, Time elapsed: 18.412 sec - in org.apache.hadoop.hbase.coprocessor.TestMasterCoprocessorExceptionWithAbort
Running org.apache.hadoop.hbase.coprocessor.TestCoprocessorStop
Running org.apache.hadoop.hbase.coprocessor.TestClassLoading
Running org.apache.hadoop.hbase.TestNamespace
Tests run: 1, Failures: 0, Errors: 0, Skipped: 0, Time elapsed: 16.702 sec - in org.apache.hadoop.hbase.coprocessor.TestCoprocessorStop
Running org.apache.hadoop.hbase.TestLocalHBaseCluster
Tests run: 2, Failures: 0, Errors: 0, Skipped: 0, Time elapsed: 27.787 sec - in org.apache.hadoop.hbase.coprocessor.TestOpenTableInCoprocessor
Tests run: 1, Failures: 0, Errors: 0, Skipped: 0, Time elapsed: 11.597 sec - in org.apache.hadoop.hbase.TestLocalHBaseCluster
Running org.apache.hadoop.hbase.TestMultiVersions
Running org.apache.hadoop.hbase.TestMetaTableAccessor
Tests run: 9, Failures: 0, Errors: 0, Skipped: 0, Time elapsed: 38.432 sec - in org.apache.hadoop.hbase.coprocessor.TestClassLoading
Tests run: 3, Failures: 0, Errors: 0, Skipped: 0, Time elapsed: 15.652 sec - in org.apache.hadoop.hbase.TestMultiVersions
Running org.apache.hadoop.hbase.TestMetaTableLocator
Tests run: 12, Failures: 0, Errors: 0, Skipped: 0, Time elapsed: 437.86 sec - in org.apache.hadoop.hbase.mapreduce.TestImportExport
Running org.apache.hadoop.hbase.trace.TestHTraceHooks
Tests run: 7, Failures: 0, Errors: 0, Skipped: 0, Time elapsed: 4.764 sec - in org.apache.hadoop.hbase.TestMetaTableLocator
Tests run: 9, Failures: 0, Errors: 0, Skipped: 1, Time elapsed: 45.667 sec - in org.apache.hadoop.hbase.TestNamespace
Tests run: 1, Failures: 0, Errors: 0, Skipped: 0, Time elapsed: 4.604 sec - in org.apache.hadoop.hbase.trace.TestHTraceHooks
Tests run: 13, Failures: 0, Errors: 0, Skipped: 0, Time elapsed: 22.58 sec - in org.apache.hadoop.hbase.TestMetaTableAccessor
Running org.apache.hadoop.hbase.snapshot.TestSnapshotClientRetries
Running org.apache.hadoop.hbase.snapshot.TestRestoreFlushSnapshotFromClient
Running org.apache.hadoop.hbase.snapshot.TestFlushSnapshotFromClient
Tests run: 2, Failures: 0, Errors: 0, Skipped: 0, Time elapsed: 22.58 sec - in org.apache.hadoop.hbase.snapshot.TestSnapshotClientRetries
Running org.apache.hadoop.hbase.snapshot.TestSnapshotDescriptionUtils
Running org.apache.hadoop.hbase.snapshot.TestExportSnapshot
Tests run: 2, Failures: 0, Errors: 0, Skipped: 0, Time elapsed: 0.22 sec - in org.apache.hadoop.hbase.snapshot.TestSnapshotDescriptionUtils
Running org.apache.hadoop.hbase.snapshot.TestSecureExportSnapshot
Running org.apache.hadoop.hbase.TestMetaMigrationConvertingToPB
Tests run: 3, Failures: 0, Errors: 0, Skipped: 0, Time elapsed: 1.815 sec - in org.apache.hadoop.hbase.TestMetaMigrationConvertingToPB
Running org.apache.hadoop.hbase.TestPartialResultsFromClientSide
Tests run: 5, Failures: 0, Errors: 0, Skipped: 0, Time elapsed: 101.412 sec - in org.apache.hadoop.hbase.snapshot.TestRestoreFlushSnapshotFromClient
Running org.apache.hadoop.hbase.TestMovedRegionsCleaner
Tests run: 1, Failures: 0, Errors: 0, Skipped: 0, Time elapsed: 12.144 sec - in org.apache.hadoop.hbase.TestMovedRegionsCleaner
Tests run: 13, Failures: 0, Errors: 0, Skipped: 0, Time elapsed: 58.255 sec - in org.apache.hadoop.hbase.TestPartialResultsFromClientSide
Running org.apache.hadoop.hbase.quotas.TestQuotaTableUtil
Tests run: 3, Failures: 0, Errors: 0, Skipped: 0, Time elapsed: 2.637 sec - in org.apache.hadoop.hbase.quotas.TestQuotaTableUtil
Running org.apache.hadoop.hbase.quotas.TestQuotaAdmin
Tests run: 9, Failures: 0, Errors: 0, Skipped: 0, Time elapsed: 129.404 sec - in org.apache.hadoop.hbase.snapshot.TestFlushSnapshotFromClient
Running org.apache.hadoop.hbase.util.TestMiniClusterLoadParallel
Tests run: 3, Failures: 0, Errors: 0, Skipped: 0, Time elapsed: 3.362 sec - in org.apache.hadoop.hbase.quotas.TestQuotaAdmin
Running org.apache.hadoop.hbase.util.TestIdLock
Running org.apache.hadoop.hbase.quotas.TestQuotaThrottle
Tests run: 1, Failures: 0, Errors: 0, Skipped: 0, Time elapsed: 15.433 sec - in org.apache.hadoop.hbase.util.TestIdLock
Running org.apache.hadoop.hbase.util.TestHBaseFsck
Tests run: 12, Failures: 0, Errors: 0, Skipped: 0, Time elapsed: 32.576 sec - in org.apache.hadoop.hbase.quotas.TestQuotaThrottle
Running org.apache.hadoop.hbase.util.TestMergeTable
Tests run: 4, Failures: 0, Errors: 0, Skipped: 0, Time elapsed: 63.111 sec - in org.apache.hadoop.hbase.util.TestMiniClusterLoadParallel
Running org.apache.hadoop.hbase.util.TestFSTableDescriptors
Tests run: 15, Failures: 0, Errors: 0, Skipped: 0, Time elapsed: 2.705 sec - in org.apache.hadoop.hbase.util.TestFSTableDescriptors
Running org.apache.hadoop.hbase.util.TestMiniClusterLoadSequential
Tests run: 1, Failures: 0, Errors: 0, Skipped: 0, Time elapsed: 27.935 sec - in org.apache.hadoop.hbase.util.TestMergeTable
Running org.apache.hadoop.hbase.util.TestConnectionCache
Tests run: 1, Failures: 0, Errors: 0, Skipped: 0, Time elapsed: 21.359 sec - in org.apache.hadoop.hbase.util.TestConnectionCache
Running org.apache.hadoop.hbase.util.TestDefaultEnvironmentEdge
Tests run: 1, Failures: 0, Errors: 0, Skipped: 0, Time elapsed: 0.44 sec - in org.apache.hadoop.hbase.util.TestDefaultEnvironmentEdge
Running org.apache.hadoop.hbase.util.TestFSVisitor
Tests run: 3, Failures: 0, Errors: 0, Skipped: 0, Time elapsed: 5.531 sec - in org.apache.hadoop.hbase.util.TestFSVisitor
Running org.apache.hadoop.hbase.util.TestTableName
Tests run: 6, Failures: 0, Errors: 0, Skipped: 0, Time elapsed: 0.628 sec - in org.apache.hadoop.hbase.util.TestTableName
Running org.apache.hadoop.hbase.util.TestHBaseFsckEncryption
Tests run: 4, Failures: 0, Errors: 0, Skipped: 0, Time elapsed: 63.981 sec - in org.apache.hadoop.hbase.util.TestMiniClusterLoadSequential
Running org.apache.hadoop.hbase.util.TestFSHDFSUtils
Tests run: 1, Failures: 0, Errors: 0, Skipped: 0, Time elapsed: 16.908 sec - in org.apache.hadoop.hbase.util.TestHBaseFsckEncryption
Running org.apache.hadoop.hbase.util.TestMiniClusterLoadEncoded
Tests run: 3, Failures: 0, Errors: 0, Skipped: 0, Time elapsed: 8.285 sec - in org.apache.hadoop.hbase.util.TestFSHDFSUtils
Running org.apache.hadoop.hbase.util.hbck.TestOfflineMetaRebuildOverlap

Results :

Failed tests: 
  TestSplitTransactionOnCluster.testShouldFailSplitIfZNodeDoesNotExistDueToPrevRollBack:220 not able to find a splittable region

Tests run: 2246, Failures: 1, Errors: 0, Skipped: 57

[INFO] ------------------------------------------------------------------------
[INFO] Reactor Summary:
[INFO] 
[INFO] Apache HBase ...................................... SUCCESS [1:26.987s]
[INFO] Apache HBase - Checkstyle ......................... SUCCESS [8.648s]
[INFO] Apache HBase - Resource Bundle .................... SUCCESS [0.173s]
[INFO] Apache HBase - Annotations ........................ SUCCESS [1.013s]
[INFO] Apache HBase - Protocol ........................... SUCCESS [16.960s]
[INFO] Apache HBase - Common ............................. SUCCESS [2:49.428s]
[INFO] Apache HBase - Procedure .......................... SUCCESS [1:53.241s]
[INFO] Apache HBase - Client ............................. SUCCESS [1:31.337s]
[INFO] Apache HBase - Hadoop Compatibility ............... SUCCESS [8.214s]
[INFO] Apache HBase - Hadoop Two Compatibility ........... SUCCESS [8.597s]
[INFO] Apache HBase - Prefix Tree ........................ SUCCESS [9.318s]
[INFO] Apache HBase - Server ............................. FAILURE [1:35:07.858s]
[INFO] Apache HBase - Testing Util ....................... SKIPPED
[INFO] Apache HBase - Thrift ............................. SKIPPED
[INFO] Apache HBase - Rest ............................... SKIPPED
[INFO] Apache HBase - Shell .............................. SKIPPED
[INFO] Apache HBase - Integration Tests .................. SKIPPED
[INFO] Apache HBase - Examples ........................... SKIPPED
[INFO] Apache HBase - External Block Cache ............... SKIPPED
[INFO] Apache HBase - Assembly ........................... SKIPPED
[INFO] Apache HBase - Shaded ............................. SKIPPED
[INFO] Apache HBase - Shaded - Client .................... SKIPPED
[INFO] Apache HBase - Shaded - Server .................... SKIPPED
[INFO] ------------------------------------------------------------------------
[INFO] BUILD FAILURE
[INFO] ------------------------------------------------------------------------
[INFO] Total time: 1:44:06.491s
[INFO] Finished at: Fri Oct 16 06:17:06 UTC 2015
[INFO] Final Memory: 437M/590M
[INFO] ------------------------------------------------------------------------
[ERROR] Failed to execute goal org.apache.maven.plugins:maven-surefire-plugin:2.18.1:test (secondPartTestsExecution) on project hbase-server: ExecutionException: java.lang.RuntimeException: java.lang.RuntimeException: org.apache.maven.surefire.report.ReporterException: When writing xml report stdout/stderr: /tmp/stderr4917176647421079664deferred (No such file or directory) -> [Help 1]
[ERROR] 
[ERROR] To see the full stack trace of the errors, re-run Maven with the -e switch.
[ERROR] Re-run Maven using the -X switch to enable full debug logging.
[ERROR] 
[ERROR] For more information about the errors and possible solutions, please read the following articles:
[ERROR] [Help 1] http://cwiki.apache.org/confluence/display/MAVEN/MojoFailureException
[ERROR] 
[ERROR] After correcting the problems, you can resume the build with the command
[ERROR]   mvn <goals> -rf :hbase-server
Build step 'Invoke top-level Maven targets' marked build as failure
Performing Post build task...
Match found for :.* : True
Logical operation result is TRUE
Running script  :     ZOMBIE_TESTS_COUNT=`jps -v | grep surefirebooter | grep '-Dhbase.test' | wc -l`
  if [[ $ZOMBIE_TESTS_COUNT != 0 ]] ; then
    #It seems sometimes the tests are not dying immediately. Let's give them 30s
    echo "Suspicious java process found - waiting 30s to see if there are just slow to stop"
    sleep 30
    ZOMBIE_TESTS_COUNT=`jps -v | grep surefirebooter | grep '-Dhbase.test' | wc -l`
    if [[ $ZOMBIE_TESTS_COUNT != 0 ]] ; then
      echo "There are $ZOMBIE_TESTS_COUNT zombie tests, they should have been killed by surefire but survived"
      echo "************ zombies jps listing"
      jps -v
      jps -v | grep surefirebooter | grep '-Dhbase.test'
      echo "************ BEGIN zombies jstack extract"
      # HBase tests have been flagged with an innocuous '-Dhbase.test' just so they can
      # be identified as hbase in a process listing.
      ZB_STACK=`jps -v | grep surefirebooter | grep '-Dhbase.test' | cut -d ' ' -f 1 | xargs -n 1 jstack | grep ".test" | grep "\.java"`
      jps -v | grep surefirebooter | grep '-Dhbase.test' | cut -d ' ' -f 1 | xargs -n 1 jstack
      echo "************ END  zombies jstack extract"
      JIRA_COMMENT="$JIRA_COMMENT

     {color:red}-1 core zombie tests{color}.  There are ${ZOMBIE_TESTS_COUNT} zombie test(s): ${ZB_STACK}"
      BAD=1
      # Killing these zombies
      echo 'Killing ZOMBIES!!!'
      jps -v
      jps -v | grep surefirebooter | grep '-Dhbase.test' | cut -d ' ' -f 1 | xargs kill -9
    else
      echo "We're ok: there is no zombie test, but some tests took some time to stop"
    fi
[Hadoop] $ /bin/bash -xe /tmp/hudson6565536852916519235.sh
++ grep -Dhbase.test
++ grep surefirebooter
++ jps -v
++ wc -l
grep: unknown devices method
grep: write error: Broken pipe
+ ZOMBIE_TESTS_COUNT=0
/tmp/hudson6565536852916519235.sh: line 30: syntax error: unexpected end of file
POST BUILD TASK : FAILURE
END OF POST BUILD TASK : 0
Archiving artifacts

Re: Build failed in Jenkins: HBase-1.2 » latest1.7,Hadoop #260

Posted by Stack <st...@duboce.net>.
Here, ditto, no way to turn off the DN infoport so they can clash with
another running test... Maybe we could randomize DN ports?
St.Ack

On Thu, Oct 15, 2015 at 8:34 PM, Apache Jenkins Server <
jenkins@builds.apache.org> wrote:

> See <
> https://builds.apache.org/job/HBase-1.2/jdk=latest1.7,label=Hadoop/260/>
>
> ------------------------------------------
> [...truncated 44384 lines...]
> Tests run: 21, Failures: 0, Errors: 0, Skipped: 3, Time elapsed: 157.18
> sec - in org.apache.hadoop.hbase.client.TestHCM
> Running org.apache.hadoop.hbase.client.TestClientOperationInterrupt
> Running org.apache.hadoop.hbase.client.TestRpcControllerFactory
> Tests run: 8, Failures: 0, Errors: 0, Skipped: 4, Time elapsed: 44.412 sec
> - in org.apache.hadoop.hbase.client.TestSnapshotCloneIndependence
> Tests run: 1, Failures: 0, Errors: 0, Skipped: 0, Time elapsed: 3.257 sec
> - in org.apache.hadoop.hbase.client.TestRpcControllerFactory
> Running org.apache.hadoop.hbase.client.TestScannersFromClientSide
> Running org.apache.hadoop.hbase.client.TestCheckAndMutate
> Tests run: 1, Failures: 0, Errors: 0, Skipped: 0, Time elapsed: 2.279 sec
> - in org.apache.hadoop.hbase.client.TestCheckAndMutate
> Running org.apache.hadoop.hbase.client.TestFromClientSide
> Tests run: 7, Failures: 0, Errors: 0, Skipped: 0, Time elapsed: 13.126 sec
> - in org.apache.hadoop.hbase.client.TestScannersFromClientSide
> Running
> org.apache.hadoop.hbase.client.TestHTablePool$TestHTableThreadLocalPool
> Running org.apache.hadoop.hbase.client.TestUpdateConfiguration
> Tests run: 2, Failures: 0, Errors: 0, Skipped: 0, Time elapsed: 0.239 sec
> - in org.apache.hadoop.hbase.client.TestUpdateConfiguration
> Tests run: 9, Failures: 0, Errors: 0, Skipped: 0, Time elapsed: 7.365 sec
> - in org.apache.hadoop.hbase.client.TestHTablePool$TestHTableThreadLocalPool
> Running org.apache.hadoop.hbase.client.TestClientPushback
> Tests run: 1, Failures: 0, Errors: 0, Skipped: 0, Time elapsed: 1.661 sec
> - in org.apache.hadoop.hbase.client.TestClientPushback
> Running
> org.apache.hadoop.hbase.client.TestHTablePool$TestHTableReusablePool
> Tests run: 9, Failures: 0, Errors: 0, Skipped: 0, Time elapsed: 6.17 sec -
> in org.apache.hadoop.hbase.client.TestHTablePool$TestHTableReusablePool
> Running
> org.apache.hadoop.hbase.client.TestRestoreSnapshotFromClientWithRegionReplicas
> Tests run: 1, Failures: 0, Errors: 0, Skipped: 0, Time elapsed: 54.179 sec
> - in org.apache.hadoop.hbase.client.TestClientOperationInterrupt
> Running org.apache.hadoop.hbase.client.TestReplicaWithCluster
> Running org.apache.hadoop.hbase.client.TestHTableMultiplexer
> Tests run: 1, Failures: 0, Errors: 0, Skipped: 0, Time elapsed: 9.116 sec
> - in org.apache.hadoop.hbase.client.TestHTableMultiplexer
> Running org.apache.hadoop.hbase.client.TestScannerTimeout
> Tests run: 4, Failures: 0, Errors: 0, Skipped: 0, Time elapsed: 43.144 sec
> - in org.apache.hadoop.hbase.client.TestReplicaWithCluster
> Tests run: 5, Failures: 0, Errors: 0, Skipped: 0, Time elapsed: 140.194
> sec - in
> org.apache.hadoop.hbase.client.TestCloneSnapshotFromClientWithRegionReplicas
> Running
> org.apache.hadoop.hbase.client.TestHTablePool$TestHTableReusablePool
> Tests run: 4, Failures: 0, Errors: 0, Skipped: 0, Time elapsed: 38.924 sec
> - in org.apache.hadoop.hbase.client.TestScannerTimeout
> Running org.apache.hadoop.hbase.client.TestTableSnapshotScanner
> Running org.apache.hadoop.hbase.client.TestReplicasClient
> Tests run: 9, Failures: 0, Errors: 0, Skipped: 0, Time elapsed: 12.092 sec
> - in org.apache.hadoop.hbase.client.TestHTablePool$TestHTableReusablePool
> Running
> org.apache.hadoop.hbase.client.TestHTablePool$TestHTableThreadLocalPool
> Tests run: 9, Failures: 0, Errors: 0, Skipped: 0, Time elapsed: 6.679 sec
> - in org.apache.hadoop.hbase.client.TestHTablePool$TestHTableThreadLocalPool
> Running org.apache.hadoop.hbase.client.TestFromClientSide3
> Tests run: 3, Failures: 0, Errors: 0, Skipped: 0, Time elapsed: 46.196 sec
> - in org.apache.hadoop.hbase.client.TestTableSnapshotScanner
> Running org.apache.hadoop.hbase.client.TestMetaWithReplicas
> Tests run: 5, Failures: 0, Errors: 0, Skipped: 0, Time elapsed: 151.204
> sec - in
> org.apache.hadoop.hbase.client.TestRestoreSnapshotFromClientWithRegionReplicas
> Tests run: 9, Failures: 0, Errors: 0, Skipped: 0, Time elapsed: 68.503 sec
> - in org.apache.hadoop.hbase.client.TestFromClientSide3
> Running org.apache.hadoop.hbase.client.TestResultSizeEstimation
> Tests run: 2, Failures: 0, Errors: 0, Skipped: 0, Time elapsed: 4.191 sec
> - in org.apache.hadoop.hbase.client.TestResultSizeEstimation
> Tests run: 82, Failures: 0, Errors: 0, Skipped: 4, Time elapsed: 205.663
> sec - in org.apache.hadoop.hbase.client.TestFromClientSide
> Running org.apache.hadoop.hbase.client.TestRestoreSnapshotFromClient
> Running org.apache.hadoop.hbase.client.TestSnapshotMetadata
> Running org.apache.hadoop.hbase.client.TestHTableMultiplexerFlushCache
> Tests run: 1, Failures: 0, Errors: 0, Skipped: 0, Time elapsed: 6.087 sec
> - in org.apache.hadoop.hbase.client.TestHTableMultiplexerFlushCache
> Running org.apache.hadoop.hbase.TestMultiVersions
> Tests run: 3, Failures: 0, Errors: 0, Skipped: 0, Time elapsed: 8.78 sec -
> in org.apache.hadoop.hbase.TestMultiVersions
> Tests run: 4, Failures: 0, Errors: 0, Skipped: 0, Time elapsed: 32.359 sec
> - in org.apache.hadoop.hbase.client.TestSnapshotMetadata
> Running org.apache.hadoop.hbase.procedure.TestZKProcedure
> Tests run: 4, Failures: 0, Errors: 0, Skipped: 0, Time elapsed: 2.107 sec
> - in org.apache.hadoop.hbase.procedure.TestZKProcedure
> Running org.apache.hadoop.hbase.TestHColumnDescriptorDefaultVersions
> Running org.apache.hadoop.hbase.procedure.TestZKProcedureControllers
> Tests run: 4, Failures: 0, Errors: 0, Skipped: 0, Time elapsed: 1.956 sec
> - in org.apache.hadoop.hbase.procedure.TestZKProcedureControllers
> Running org.apache.hadoop.hbase.TestNamespace
> Tests run: 3, Failures: 0, Errors: 0, Skipped: 0, Time elapsed: 23.995 sec
> - in org.apache.hadoop.hbase.TestHColumnDescriptorDefaultVersions
> Running org.apache.hadoop.hbase.constraint.TestConstraint
> Tests run: 9, Failures: 0, Errors: 0, Skipped: 1, Time elapsed: 25.193 sec
> - in org.apache.hadoop.hbase.TestNamespace
> Running org.apache.hadoop.hbase.TestZooKeeper
> Tests run: 12, Failures: 0, Errors: 0, Skipped: 0, Time elapsed: 141.867
> sec - in org.apache.hadoop.hbase.client.TestMetaWithReplicas
> Tests run: 5, Failures: 0, Errors: 0, Skipped: 0, Time elapsed: 22.402 sec
> - in org.apache.hadoop.hbase.constraint.TestConstraint
> Running org.apache.hadoop.hbase.snapshot.TestFlushSnapshotFromClient
> Running org.apache.hadoop.hbase.snapshot.TestExportSnapshot
> Tests run: 5, Failures: 0, Errors: 0, Skipped: 0, Time elapsed: 149.996
> sec - in org.apache.hadoop.hbase.client.TestRestoreSnapshotFromClient
> Tests run: 14, Failures: 0, Errors: 0, Skipped: 0, Time elapsed: 257.19
> sec - in org.apache.hadoop.hbase.client.TestReplicasClient
> Running org.apache.hadoop.hbase.snapshot.TestRestoreFlushSnapshotFromClient
> Running org.apache.hadoop.hbase.snapshot.TestSecureExportSnapshot
> Tests run: 9, Failures: 0, Errors: 0, Skipped: 0, Time elapsed: 78.566 sec
> - in org.apache.hadoop.hbase.snapshot.TestFlushSnapshotFromClient
> Running org.apache.hadoop.hbase.snapshot.TestSnapshotClientRetries
> Tests run: 2, Failures: 0, Errors: 0, Skipped: 0, Time elapsed: 18.118 sec
> - in org.apache.hadoop.hbase.snapshot.TestSnapshotClientRetries
> Running org.apache.hadoop.hbase.snapshot.TestSnapshotDescriptionUtils
> Tests run: 2, Failures: 0, Errors: 0, Skipped: 0, Time elapsed: 0.246 sec
> - in org.apache.hadoop.hbase.snapshot.TestSnapshotDescriptionUtils
> Running org.apache.hadoop.hbase.TestIOFencing
> Tests run: 5, Failures: 0, Errors: 0, Skipped: 0, Time elapsed: 76.611 sec
> - in org.apache.hadoop.hbase.snapshot.TestRestoreFlushSnapshotFromClient
> Running
> org.apache.hadoop.hbase.coprocessor.TestRegionObserverScannerOpenHook
> Tests run: 3, Failures: 0, Errors: 0, Skipped: 0, Time elapsed: 11.571 sec
> - in org.apache.hadoop.hbase.coprocessor.TestRegionObserverScannerOpenHook
> Tests run: 12, Failures: 0, Errors: 0, Skipped: 0, Time elapsed: 174.042
> sec - in org.apache.hadoop.hbase.TestZooKeeper
> Running org.apache.hadoop.hbase.coprocessor.TestOpenTableInCoprocessor
> Running
> org.apache.hadoop.hbase.coprocessor.TestMasterCoprocessorExceptionWithAbort
> Tests run: 2, Failures: 0, Errors: 0, Skipped: 0, Time elapsed: 18.788 sec
> - in org.apache.hadoop.hbase.coprocessor.TestOpenTableInCoprocessor
> Tests run: 1, Failures: 0, Errors: 0, Skipped: 0, Time elapsed: 17.652 sec
> - in
> org.apache.hadoop.hbase.coprocessor.TestMasterCoprocessorExceptionWithAbort
> Running org.apache.hadoop.hbase.coprocessor.TestCoprocessorTableEndpoint
> Running
> org.apache.hadoop.hbase.coprocessor.TestRegionServerCoprocessorEndpoint
> Tests run: 2, Failures: 0, Errors: 0, Skipped: 0, Time elapsed: 1.332 sec
> - in org.apache.hadoop.hbase.coprocessor.TestRegionServerCoprocessorEndpoint
> Tests run: 2, Failures: 0, Errors: 0, Skipped: 0, Time elapsed: 8.564 sec
> - in org.apache.hadoop.hbase.coprocessor.TestCoprocessorTableEndpoint
> Running org.apache.hadoop.hbase.coprocessor.TestRegionObserverInterface
> Running
> org.apache.hadoop.hbase.coprocessor.TestMasterCoprocessorExceptionWithRemove
> Tests run: 1, Failures: 0, Errors: 0, Skipped: 0, Time elapsed: 5.241 sec
> - in
> org.apache.hadoop.hbase.coprocessor.TestMasterCoprocessorExceptionWithRemove
> Tests run: 2, Failures: 0, Errors: 0, Skipped: 0, Time elapsed: 112.331
> sec - in org.apache.hadoop.hbase.TestIOFencing
> Running org.apache.hadoop.hbase.coprocessor.TestAggregateProtocol
> Running org.apache.hadoop.hbase.coprocessor.TestBatchCoprocessorEndpoint
> Tests run: 4, Failures: 0, Errors: 0, Skipped: 0, Time elapsed: 1.986 sec
> - in org.apache.hadoop.hbase.coprocessor.TestBatchCoprocessorEndpoint
> Tests run: 44, Failures: 0, Errors: 0, Skipped: 0, Time elapsed: 4.854 sec
> - in org.apache.hadoop.hbase.coprocessor.TestAggregateProtocol
> Running org.apache.hadoop.hbase.coprocessor.TestRegionServerObserver
> Running org.apache.hadoop.hbase.coprocessor.TestHTableWrapper
> Tests run: 1, Failures: 0, Errors: 0, Skipped: 0, Time elapsed: 5.227 sec
> - in org.apache.hadoop.hbase.coprocessor.TestHTableWrapper
> Tests run: 1, Failures: 0, Errors: 0, Skipped: 0, Time elapsed: 18.029 sec
> - in org.apache.hadoop.hbase.coprocessor.TestRegionServerObserver
> Running
> org.apache.hadoop.hbase.coprocessor.TestRegionServerCoprocessorExceptionWithAbort
> Running org.apache.hadoop.hbase.coprocessor.TestClassLoading
> Tests run: 2, Failures: 0, Errors: 0, Skipped: 0, Time elapsed: 17.461 sec
> - in
> org.apache.hadoop.hbase.coprocessor.TestRegionServerCoprocessorExceptionWithAbort
> Tests run: 14, Failures: 0, Errors: 0, Skipped: 2, Time elapsed: 70.941
> sec - in org.apache.hadoop.hbase.coprocessor.TestRegionObserverInterface
> Running org.apache.hadoop.hbase.coprocessor.TestDoubleColumnInterpreter
> Tests run: 9, Failures: 0, Errors: 0, Skipped: 0, Time elapsed: 27.94 sec
> - in org.apache.hadoop.hbase.coprocessor.TestClassLoading
> Tests run: 38, Failures: 0, Errors: 0, Skipped: 0, Time elapsed: 4.474 sec
> - in org.apache.hadoop.hbase.coprocessor.TestDoubleColumnInterpreter
> Running org.apache.hadoop.hbase.coprocessor.TestRegionObserverBypass
> Tests run: 2, Failures: 0, Errors: 0, Skipped: 0, Time elapsed: 7.119 sec
> - in org.apache.hadoop.hbase.coprocessor.TestRegionObserverBypass
> Running org.apache.hadoop.hbase.coprocessor.TestRowProcessorEndpoint
> Running org.apache.hadoop.hbase.coprocessor.TestCoprocessorStop
> Running
> org.apache.hadoop.hbase.coprocessor.TestRegionServerCoprocessorExceptionWithRemove
> Tests run: 1, Failures: 0, Errors: 0, Skipped: 0, Time elapsed: 17.11 sec
> - in org.apache.hadoop.hbase.coprocessor.TestCoprocessorStop
> Tests run: 4, Failures: 0, Errors: 0, Skipped: 0, Time elapsed: 18.792 sec
> - in org.apache.hadoop.hbase.coprocessor.TestRowProcessorEndpoint
> Tests run: 1, Failures: 0, Errors: 0, Skipped: 0, Time elapsed: 15.781 sec
> - in
> org.apache.hadoop.hbase.coprocessor.TestRegionServerCoprocessorExceptionWithRemove
> Running org.apache.hadoop.hbase.coprocessor.TestMasterObserver
> Running org.apache.hadoop.hbase.coprocessor.TestBigDecimalColumnInterpreter
> Tests run: 38, Failures: 0, Errors: 0, Skipped: 0, Time elapsed: 4.68 sec
> - in org.apache.hadoop.hbase.coprocessor.TestBigDecimalColumnInterpreter
> Running org.apache.hadoop.hbase.coprocessor.TestCoprocessorEndpoint
> Tests run: 9, Failures: 0, Errors: 0, Skipped: 0, Time elapsed: 318.178
> sec - in org.apache.hadoop.hbase.snapshot.TestExportSnapshot
> Running org.apache.hadoop.hbase.TestGlobalMemStoreSize
> Tests run: 6, Failures: 0, Errors: 0, Skipped: 0, Time elapsed: 1.95 sec -
> in org.apache.hadoop.hbase.coprocessor.TestCoprocessorEndpoint
> Running org.apache.hadoop.hbase.coprocessor.TestWALObserver
> Running org.apache.hadoop.hbase.TestJMXListener
> Tests run: 1, Failures: 0, Errors: 0, Skipped: 0, Time elapsed: 13.352 sec
> - in org.apache.hadoop.hbase.TestGlobalMemStoreSize
> Tests run: 6, Failures: 0, Errors: 0, Skipped: 0, Time elapsed: 8.192 sec
> - in org.apache.hadoop.hbase.coprocessor.TestWALObserver
> Running org.apache.hadoop.hbase.TestMetaTableLocator
> Tests run: 7, Failures: 0, Errors: 0, Skipped: 0, Time elapsed: 3.77 sec -
> in org.apache.hadoop.hbase.TestMetaTableLocator
> Running org.apache.hadoop.hbase.zookeeper.TestZKTableStateManager
> Tests run: 1, Failures: 0, Errors: 0, Skipped: 0, Time elapsed: 0.736 sec
> - in org.apache.hadoop.hbase.zookeeper.TestZKTableStateManager
> Running org.apache.hadoop.hbase.zookeeper.TestZKMulti
> Running org.apache.hadoop.hbase.zookeeper.TestZooKeeperACL
> Tests run: 7, Failures: 0, Errors: 0, Skipped: 0, Time elapsed: 0.339 sec
> - in org.apache.hadoop.hbase.zookeeper.TestZooKeeperACL
> Tests run: 12, Failures: 0, Errors: 0, Skipped: 0, Time elapsed: 1.599 sec
> - in org.apache.hadoop.hbase.zookeeper.TestZKMulti
> Running
> org.apache.hadoop.hbase.zookeeper.lock.TestZKInterProcessReadWriteLock
> Tests run: 2, Failures: 0, Errors: 0, Skipped: 0, Time elapsed: 16.402 sec
> - in org.apache.hadoop.hbase.TestJMXListener
> Running org.apache.hadoop.hbase.zookeeper.TestZKLeaderManager
> Tests run: 7, Failures: 0, Errors: 0, Skipped: 0, Time elapsed: 36.627 sec
> - in org.apache.hadoop.hbase.coprocessor.TestMasterObserver
> Tests run: 1, Failures: 0, Errors: 0, Skipped: 0, Time elapsed: 0.15 sec -
> in org.apache.hadoop.hbase.zookeeper.TestZKLeaderManager
> Running org.apache.hadoop.hbase.zookeeper.TestRecoverableZooKeeper
> Running org.apache.hadoop.hbase.zookeeper.TestHQuorumPeer
> Running org.apache.hadoop.hbase.zookeeper.TestZooKeeperNodeTracker
> Tests run: 1, Failures: 0, Errors: 0, Skipped: 0, Time elapsed: 1.278 sec
> - in org.apache.hadoop.hbase.zookeeper.TestRecoverableZooKeeper
> Tests run: 3, Failures: 0, Errors: 0, Skipped: 0, Time elapsed: 0.995 sec
> - in org.apache.hadoop.hbase.zookeeper.TestZooKeeperNodeTracker
> Tests run: 4, Failures: 0, Errors: 0, Skipped: 0, Time elapsed: 1.56 sec -
> in org.apache.hadoop.hbase.zookeeper.TestHQuorumPeer
> Running org.apache.hadoop.hbase.TestClusterBootOrder
> Running org.apache.hadoop.hbase.TestPartialResultsFromClientSide
> Running org.apache.hadoop.hbase.TestServerSideScanMetricsFromClientSide
> Tests run: 2, Failures: 0, Errors: 0, Skipped: 0, Time elapsed: 3.106 sec
> - in org.apache.hadoop.hbase.TestServerSideScanMetricsFromClientSide
> Tests run: 6, Failures: 0, Errors: 0, Skipped: 0, Time elapsed: 24.548 sec
> - in org.apache.hadoop.hbase.zookeeper.lock.TestZKInterProcessReadWriteLock
> Tests run: 2, Failures: 0, Errors: 0, Skipped: 0, Time elapsed: 27.045 sec
> - in org.apache.hadoop.hbase.TestClusterBootOrder
> Tests run: 9, Failures: 0, Errors: 0, Skipped: 0, Time elapsed: 324.342
> sec - in org.apache.hadoop.hbase.snapshot.TestSecureExportSnapshot
> Tests run: 13, Failures: 0, Errors: 0, Skipped: 0, Time elapsed: 48.15 sec
> - in org.apache.hadoop.hbase.TestPartialResultsFromClientSide
>
> Results :
>
> Tests in error:
>   TestTableMapReduce>TestTableMapReduceBase.beforeClass:78 » Bind Port in
> use: l...
>
> TestMasterFailoverWithProcedures.testWALfencingWithoutWALRolling:173->testWALfencing:205
> » FileNotFound
>
> org.apache.hadoop.hbase.security.token.TestGenerateDelegationToken.org.apache.hadoop.hbase.security.token.TestGenerateDelegationToken
>   Run 1:
> TestGenerateDelegationToken.org.apache.hadoop.hbase.security.token.TestGenerateDelegationToken
> » Bind
>   Run 2: TestGenerateDelegationToken.tearDown:137 NullPointer
>
>
> Tests run: 2476, Failures: 0, Errors: 3, Skipped: 58
>
> [INFO]
> ------------------------------------------------------------------------
> [INFO] Reactor Summary:
> [INFO]
> [INFO] Apache HBase ...................................... SUCCESS
> [1:07.697s]
> [INFO] Apache HBase - Checkstyle ......................... SUCCESS [5.560s]
> [INFO] Apache HBase - Resource Bundle .................... SUCCESS [0.198s]
> [INFO] Apache HBase - Annotations ........................ SUCCESS [1.290s]
> [INFO] Apache HBase - Protocol ........................... SUCCESS
> [15.877s]
> [INFO] Apache HBase - Common ............................. SUCCESS
> [2:47.643s]
> [INFO] Apache HBase - Procedure .......................... SUCCESS
> [1:52.358s]
> [INFO] Apache HBase - Client ............................. SUCCESS
> [1:30.954s]
> [INFO] Apache HBase - Hadoop Compatibility ............... SUCCESS [7.874s]
> [INFO] Apache HBase - Hadoop Two Compatibility ........... SUCCESS
> [10.100s]
> [INFO] Apache HBase - Prefix Tree ........................ SUCCESS [9.652s]
> [INFO] Apache HBase - Server ............................. FAILURE
> [1:27:54.307s]
> [INFO] Apache HBase - Testing Util ....................... SKIPPED
> [INFO] Apache HBase - Thrift ............................. SKIPPED
> [INFO] Apache HBase - Rest ............................... SKIPPED
> [INFO] Apache HBase - Shell .............................. SKIPPED
> [INFO] Apache HBase - Integration Tests .................. SKIPPED
> [INFO] Apache HBase - Examples ........................... SKIPPED
> [INFO] Apache HBase - External Block Cache ............... SKIPPED
> [INFO] Apache HBase - Assembly ........................... SKIPPED
> [INFO] Apache HBase - Shaded ............................. SKIPPED
> [INFO] Apache HBase - Shaded - Client .................... SKIPPED
> [INFO] Apache HBase - Shaded - Server .................... SKIPPED
> [INFO]
> ------------------------------------------------------------------------
> [INFO] BUILD FAILURE
> [INFO]
> ------------------------------------------------------------------------
> [INFO] Total time: 1:36:23.273s
> [INFO] Finished at: Fri Oct 16 03:31:55 UTC 2015
> [INFO] Final Memory: 93M/622M
> [INFO]
> ------------------------------------------------------------------------
> [ERROR] Failed to execute goal
> org.apache.maven.plugins:maven-surefire-plugin:2.18.1:test
> (secondPartTestsExecution) on project hbase-server: ExecutionException:
> java.lang.RuntimeException: java.lang.RuntimeException:
> org.apache.maven.surefire.report.ReporterException: When writing xml report
> stdout/stderr: /tmp/stderr3593958034424812281deferred (No such file or
> directory) -> [Help 1]
> [ERROR]
> [ERROR] To see the full stack trace of the errors, re-run Maven with the
> -e switch.
> [ERROR] Re-run Maven using the -X switch to enable full debug logging.
> [ERROR]
> [ERROR] For more information about the errors and possible solutions,
> please read the following articles:
> [ERROR] [Help 1]
> http://cwiki.apache.org/confluence/display/MAVEN/MojoFailureException
> [ERROR]
> [ERROR] After correcting the problems, you can resume the build with the
> command
> [ERROR]   mvn <goals> -rf :hbase-server
> Build step 'Invoke top-level Maven targets' marked build as failure
> Performing Post build task...
> Match found for :.* : True
> Logical operation result is TRUE
> Running script  :     ZOMBIE_TESTS_COUNT=`jps -v | grep surefirebooter |
> grep '-Dhbase.test' | wc -l`
>   if [[ $ZOMBIE_TESTS_COUNT != 0 ]] ; then
>     #It seems sometimes the tests are not dying immediately. Let's give
> them 30s
>     echo "Suspicious java process found - waiting 30s to see if there are
> just slow to stop"
>     sleep 30
>     ZOMBIE_TESTS_COUNT=`jps -v | grep surefirebooter | grep '-Dhbase.test'
> | wc -l`
>     if [[ $ZOMBIE_TESTS_COUNT != 0 ]] ; then
>       echo "There are $ZOMBIE_TESTS_COUNT zombie tests, they should have
> been killed by surefire but survived"
>       echo "************ zombies jps listing"
>       jps -v
>       jps -v | grep surefirebooter | grep '-Dhbase.test'
>       echo "************ BEGIN zombies jstack extract"
>       # HBase tests have been flagged with an innocuous '-Dhbase.test'
> just so they can
>       # be identified as hbase in a process listing.
>       ZB_STACK=`jps -v | grep surefirebooter | grep '-Dhbase.test' | cut
> -d ' ' -f 1 | xargs -n 1 jstack | grep ".test" | grep "\.java"`
>       jps -v | grep surefirebooter | grep '-Dhbase.test' | cut -d ' ' -f 1
> | xargs -n 1 jstack
>       echo "************ END  zombies jstack extract"
>       JIRA_COMMENT="$JIRA_COMMENT
>
>      {color:red}-1 core zombie tests{color}.  There are
> ${ZOMBIE_TESTS_COUNT} zombie test(s): ${ZB_STACK}"
>       BAD=1
>       # Killing these zombies
>       echo 'Killing ZOMBIES!!!'
>       jps -v
>       jps -v | grep surefirebooter | grep '-Dhbase.test' | cut -d ' ' -f 1
> | xargs kill -9
>     else
>       echo "We're ok: there is no zombie test, but some tests took some
> time to stop"
>     fi
> [Hadoop] $ /bin/bash -xe /tmp/hudson7291891293364043501.sh
> ++ jps -v
> ++ grep surefirebooter
> ++ wc -l
> ++ grep -Dhbase.test
> grep: unknown devices method
> grep: write error: Broken pipe
> + ZOMBIE_TESTS_COUNT=0
> /tmp/hudson7291891293364043501.sh: line 30: syntax error: unexpected end
> of file
> POST BUILD TASK : FAILURE
> END OF POST BUILD TASK : 0
> Archiving artifacts
>