You are viewing a plain text version of this content. The canonical link for it is here.
Posted to dev@pdfbox.apache.org by Apache Jenkins Server <hu...@hudson.apache.org> on 2011/04/29 21:02:11 UTC

Build failed in Jenkins: PDFBox-trunk #265

See <https://builds.apache.org/hudson/job/PDFBox-trunk/265/changes>

Changes:

[lehmi] PDFBOX-1005: improved buffer handling when it needs to grow as proposed by Kevin Jackson

------------------------------------------
[...truncated 1235 lines...]
[INFO] skip non existing resourceDirectory <https://builds.apache.org/hudson/job/PDFBox-trunk/ws/trunk/fontbox/src/main/resources>
[INFO] Copying 3 resources

[INFO] --- maven-resources-plugin:2.3:resources (default-resources) @ fontbox ---
[INFO] 
[INFO] --- maven-compiler-plugin:2.0.2:compile (default-compile) @ fontbox ---
[INFO] Compiling 66 source files to <https://builds.apache.org/hudson/job/PDFBox-trunk/ws/trunk/fontbox/target/classes>
[INFO] Using 'ISO-8859-1' encoding to copy filtered resources.
[INFO] [INFO] Copying 1 resource
[INFO] Copying 3 resources

[INFO] --- maven-resources-plugin:2.3:testResources (default-testResources) @ fontbox ---
[INFO] [INFO] Compiling 4 source files to <https://builds.apache.org/hudson/job/PDFBox-trunk/ws/trunk/fontbox/target/test-classes>

[INFO] --- maven-compiler-plugin:2.0.2:testCompile (default-testCompile) @ fontbox ---
[INFO] 
[INFO] --- maven-surefire-plugin:2.4.3:test (default-test) @ fontbox ---
[INFO] Surefire report directory: <https://builds.apache.org/hudson/job/PDFBox-trunk/ws/trunk/fontbox/target/surefire-reports>

-------------------------------------------------------
 T E S T S
-------------------------------------------------------
Running org.apache.fontbox.cff.Type1CharStringTest
Tests run: 2, Failures: 0, Errors: 0, Skipped: 0, Time elapsed: 0.027 sec
Running org.apache.fontbox.cmap.TestCMapParser
Tests run: 1, Failures: 0, Errors: 0, Skipped: 0, Time elapsed: 0.013 sec
Running org.apache.fontbox.cmap.TestCMap
Tests run: 1, Failures: 0, Errors: 0, Skipped: 0, Time elapsed: 0.005 sec
Running org.apache.fontbox.cff.Type1FontUtilTest
Tests run: 3, Failures: 0, Errors: 0, Skipped: 0, Time elapsed: 0.01 sec

Results :

Tests run: 7, Failures: 0, Errors: 0, Skipped: 0

[JENKINS] Recording test results
[INFO] 
[INFO] --- maven-bundle-plugin:2.0.0:bundle (default-bundle) @ fontbox ---
[INFO] 
[INFO] --- apache-rat-plugin:0.6:check (default) @ fontbox ---
[INFO] Exclude: release.properties
[INFO] 
[INFO] [INFO] Installing <https://builds.apache.org/hudson/job/PDFBox-trunk/ws/trunk/fontbox/target/fontbox-1.6.0-SNAPSHOT.jar> to /home/hudson/.m2/repository/org/apache/pdfbox/fontbox/1.6.0-SNAPSHOT/fontbox-1.6.0-SNAPSHOT.jar
--- maven-install-plugin:2.2:install (default-install) @ fontbox ---
[INFO] Installing <https://builds.apache.org/hudson/job/PDFBox-trunk/ws/trunk/fontbox/pom.xml> to /home/hudson/.m2/repository/org/apache/pdfbox/fontbox/1.6.0-SNAPSHOT/fontbox-1.6.0-SNAPSHOT.pom
[INFO] [INFO] Parsing file:/home/hudson/.m2/repository/repository.xml

[INFO] --- maven-bundle-plugin:2.0.0:install (default-install) @ fontbox ---
[INFO] Installing org/apache/pdfbox/fontbox/1.6.0-SNAPSHOT/fontbox-1.6.0-SNAPSHOT.jar
[INFO] Writing OBR metadata
[INFO] Downloading: https://repository.apache.org/content/repositories/snapshots/org/apache/pdfbox/fontbox/1.6.0-SNAPSHOT/maven-metadata.xml

[INFO] --- maven-deploy-plugin:2.4:deploy (default-deploy) @ fontbox ---
Downloaded: https://repository.apache.org/content/repositories/snapshots/org/apache/pdfbox/fontbox/1.6.0-SNAPSHOT/maven-metadata.xml (777 B at 4.6 KB/sec)
Uploading: https://repository.apache.org/content/repositories/snapshots/org/apache/pdfbox/fontbox/1.6.0-SNAPSHOT/fontbox-1.6.0-20110429.190150-19.jar
Uploaded: https://repository.apache.org/content/repositories/snapshots/org/apache/pdfbox/fontbox/1.6.0-SNAPSHOT/fontbox-1.6.0-20110429.190150-19.jar (171 KB at 220.8 KB/sec)
Uploading: https://repository.apache.org/content/repositories/snapshots/org/apache/pdfbox/fontbox/1.6.0-SNAPSHOT/fontbox-1.6.0-20110429.190150-19.pom
Uploaded: https://repository.apache.org/content/repositories/snapshots/org/apache/pdfbox/fontbox/1.6.0-SNAPSHOT/fontbox-1.6.0-20110429.190150-19.pom (4 KB at 10.3 KB/sec)
Downloading: https://repository.apache.org/content/repositories/snapshots/org/apache/pdfbox/fontbox/maven-metadata.xml
Downloaded: https://repository.apache.org/content/repositories/snapshots/org/apache/pdfbox/fontbox/maven-metadata.xml (582 B at 2.1 KB/sec)
Uploading: https://repository.apache.org/content/repositories/snapshots/org/apache/pdfbox/fontbox/1.6.0-SNAPSHOT/maven-metadata.xml
Uploaded: https://repository.apache.org/content/repositories/snapshots/org/apache/pdfbox/fontbox/1.6.0-SNAPSHOT/maven-metadata.xml (777 B at 3.4 KB/sec)
Uploading: https://repository.apache.org/content/repositories/snapshots/org/apache/pdfbox/fontbox/maven-metadata.xml
Uploaded: https://repository.apache.org/content/repositories/snapshots/org/apache/pdfbox/fontbox/maven-metadata.xml (582 B at 2.7 KB/sec)
[INFO] [INFO] Remote OBR update disabled (enable with -DremoteOBR)

[INFO] --- maven-bundle-plugin:2.0.0:deploy (default-deploy) @ fontbox ---
projectSucceeded org.apache.pdfbox:fontbox:1.6.0-SNAPSHOT
[JENKINS] Archiving <https://builds.apache.org/hudson/job/PDFBox-trunk/ws/trunk/fontbox/pom.xml> to /home/hudson/hudson/jobs/PDFBox-trunk/modules/org.apache.pdfbox$fontbox/builds/2011-04-29_19-01-10/archive/org.apache.pdfbox/fontbox/1.6.0-SNAPSHOT/fontbox-1.6.0-SNAPSHOT.pom
[JENKINS] Archiving <https://builds.apache.org/hudson/job/PDFBox-trunk/ws/trunk/fontbox/target/fontbox-1.6.0-SNAPSHOT.jar> to /home/hudson/hudson/jobs/PDFBox-trunk/modules/org.apache.pdfbox$fontbox/builds/2011-04-29_19-01-10/archive/org.apache.pdfbox/fontbox/1.6.0-20110429.190150-19/fontbox-1.6.0-20110429.190150-19.jar
[INFO]                                                                         
[INFO] ------------------------------------------------------------------------
[INFO] Building Apache JempBox 1.6.0-SNAPSHOT
[INFO] ------------------------------------------------------------------------
[INFO] 
[INFO] --- maven-clean-plugin:2.3:clean (default-clean) @ jempbox ---
[INFO] 
[INFO] --- maven-remote-resources-plugin:1.0:process (default) @ jempbox ---
[INFO] [INFO] Using 'ISO-8859-1' encoding to copy filtered resources.
[INFO] skip non existing resourceDirectory <https://builds.apache.org/hudson/job/PDFBox-trunk/ws/trunk/jempbox/src/main/resources>
[INFO] Copying 3 resources

[INFO] --- maven-resources-plugin:2.3:resources (default-resources) @ jempbox ---
[INFO] [INFO] Compiling 24 source files to <https://builds.apache.org/hudson/job/PDFBox-trunk/ws/trunk/jempbox/target/classes>

[INFO] --- maven-compiler-plugin:2.0.2:compile (default-compile) @ jempbox ---
[INFO] [INFO] Using 'ISO-8859-1' encoding to copy filtered resources.
[INFO] skip non existing resourceDirectory <https://builds.apache.org/hudson/job/PDFBox-trunk/ws/trunk/jempbox/src/test/resources>
[INFO] Copying 3 resources

[INFO] --- maven-resources-plugin:2.3:testResources (default-testResources) @ jempbox ---
[INFO] Compiling 3 source files to <https://builds.apache.org/hudson/job/PDFBox-trunk/ws/trunk/jempbox/target/test-classes>
[INFO] 
[INFO] --- maven-compiler-plugin:2.0.2:testCompile (default-testCompile) @ jempbox ---
[INFO] [INFO] Surefire report directory: <https://builds.apache.org/hudson/job/PDFBox-trunk/ws/trunk/jempbox/target/surefire-reports>

[INFO] --- maven-surefire-plugin:2.4.3:test (default-test) @ jempbox ---

-------------------------------------------------------
 T E S T S
-------------------------------------------------------
Running org.apache.jempbox.xmp.XMPMetadataTest
Tests run: 3, Failures: 0, Errors: 0, Skipped: 0, Time elapsed: 0.062 sec
Running org.apache.jempbox.xmp.XMPSchemaTest
Tests run: 8, Failures: 0, Errors: 0, Skipped: 0, Time elapsed: 0.039 sec

Results :

Tests run: 11, Failures: 0, Errors: 0, Skipped: 0

[JENKINS] Recording test results
[INFO] 
[INFO] --- maven-bundle-plugin:2.0.0:bundle (default-bundle) @ jempbox ---
[INFO] [INFO] Exclude: release.properties

[INFO] --- apache-rat-plugin:0.6:check (default) @ jempbox ---
[INFO] [INFO] Installing <https://builds.apache.org/hudson/job/PDFBox-trunk/ws/trunk/jempbox/target/jempbox-1.6.0-SNAPSHOT.jar> to /home/hudson/.m2/repository/org/apache/pdfbox/jempbox/1.6.0-SNAPSHOT/jempbox-1.6.0-SNAPSHOT.jar
[INFO] Installing <https://builds.apache.org/hudson/job/PDFBox-trunk/ws/trunk/jempbox/pom.xml> to /home/hudson/.m2/repository/org/apache/pdfbox/jempbox/1.6.0-SNAPSHOT/jempbox-1.6.0-SNAPSHOT.pom

[INFO] --- maven-install-plugin:2.2:install (default-install) @ jempbox ---
[INFO] [INFO] Parsing file:/home/hudson/.m2/repository/repository.xml

[INFO] --- maven-bundle-plugin:2.0.0:install (default-install) @ jempbox ---
[INFO] Installing org/apache/pdfbox/jempbox/1.6.0-SNAPSHOT/jempbox-1.6.0-SNAPSHOT.jar
[INFO] Writing OBR metadata
Downloading: https://repository.apache.org/content/repositories/snapshots/org/apache/pdfbox/jempbox/1.6.0-SNAPSHOT/maven-metadata.xml
[INFO] 
[INFO] --- maven-deploy-plugin:2.4:deploy (default-deploy) @ jempbox ---
Downloaded: https://repository.apache.org/content/repositories/snapshots/org/apache/pdfbox/jempbox/1.6.0-SNAPSHOT/maven-metadata.xml (777 B at 3.4 KB/sec)
Uploading: https://repository.apache.org/content/repositories/snapshots/org/apache/pdfbox/jempbox/1.6.0-SNAPSHOT/jempbox-1.6.0-20110429.190158-19.jar
Uploaded: https://repository.apache.org/content/repositories/snapshots/org/apache/pdfbox/jempbox/1.6.0-SNAPSHOT/jempbox-1.6.0-20110429.190158-19.jar (51 KB at 218.3 KB/sec)
Uploading: https://repository.apache.org/content/repositories/snapshots/org/apache/pdfbox/jempbox/1.6.0-SNAPSHOT/jempbox-1.6.0-20110429.190158-19.pom
Uploaded: https://repository.apache.org/content/repositories/snapshots/org/apache/pdfbox/jempbox/1.6.0-SNAPSHOT/jempbox-1.6.0-20110429.190158-19.pom (4 KB at 18.9 KB/sec)
Downloading: https://repository.apache.org/content/repositories/snapshots/org/apache/pdfbox/jempbox/maven-metadata.xml
Downloaded: https://repository.apache.org/content/repositories/snapshots/org/apache/pdfbox/jempbox/maven-metadata.xml (424 B at 2.4 KB/sec)
Uploading: https://repository.apache.org/content/repositories/snapshots/org/apache/pdfbox/jempbox/1.6.0-SNAPSHOT/maven-metadata.xml
Uploaded: https://repository.apache.org/content/repositories/snapshots/org/apache/pdfbox/jempbox/1.6.0-SNAPSHOT/maven-metadata.xml (777 B at 4.6 KB/sec)
Uploading: https://repository.apache.org/content/repositories/snapshots/org/apache/pdfbox/jempbox/maven-metadata.xml
Uploaded: https://repository.apache.org/content/repositories/snapshots/org/apache/pdfbox/jempbox/maven-metadata.xml (424 B at 2.5 KB/sec)
[INFO] [INFO] Remote OBR update disabled (enable with -DremoteOBR)

[INFO] --- maven-bundle-plugin:2.0.0:deploy (default-deploy) @ jempbox ---
projectSucceeded org.apache.pdfbox:jempbox:1.6.0-SNAPSHOT
[JENKINS] Archiving <https://builds.apache.org/hudson/job/PDFBox-trunk/ws/trunk/jempbox/pom.xml> to /home/hudson/hudson/jobs/PDFBox-trunk/modules/org.apache.pdfbox$jempbox/builds/2011-04-29_19-01-10/archive/org.apache.pdfbox/jempbox/1.6.0-SNAPSHOT/jempbox-1.6.0-SNAPSHOT.pom
[JENKINS] Archiving <https://builds.apache.org/hudson/job/PDFBox-trunk/ws/trunk/jempbox/target/jempbox-1.6.0-SNAPSHOT.jar> to /home/hudson/hudson/jobs/PDFBox-trunk/modules/org.apache.pdfbox$jempbox/builds/2011-04-29_19-01-10/archive/org.apache.pdfbox/jempbox/1.6.0-20110429.190158-19/jempbox-1.6.0-20110429.190158-19.jar
[INFO]                                                                         
[INFO] ------------------------------------------------------------------------
Downloading: http://repo1.maven.org/maven2/org/bouncycastle/bcmail-jdk15/1.44/bcmail-jdk15-1.44.pom
[INFO] Building Apache PDFBox 1.6.0-SNAPSHOT
[INFO] ------------------------------------------------------------------------
Downloaded: http://repo1.maven.org/maven2/org/bouncycastle/bcmail-jdk15/1.44/bcmail-jdk15-1.44.pom (2 KB at 1.3 KB/sec)
Downloading: http://repo1.maven.org/maven2/org/bouncycastle/bcmail-jdk15/1.44/bcmail-jdk15-1.44.jar
Downloaded: http://repo1.maven.org/maven2/org/bouncycastle/bcmail-jdk15/1.44/bcmail-jdk15-1.44.jar (221 KB at 534.3 KB/sec)
[INFO] 
[INFO] --- maven-clean-plugin:2.3:clean (default-clean) @ pdfbox ---
[INFO] 
[INFO] --- maven-remote-resources-plugin:1.0:process (default) @ pdfbox ---
[INFO] Setting property: classpath.resource.loader.class => 'org.codehaus.plexus.velocity.ContextClassLoaderResourceLoader'.
[INFO] Setting property: velocimacro.messages.on => 'false'.
[INFO] Setting property: resource.loader => 'classpath'.
[INFO] Setting property: resource.manager.logwhenfound => 'false'.
[INFO] 
[INFO] --- maven-antrun-plugin:1.3:run (default) @ pdfbox ---
[INFO] Executing tasks

find.adobefiles:

get.adobefiles:

testexist:

downloadfile:
    [mkdir] Created dir: <https://builds.apache.org/hudson/job/PDFBox-trunk/ws/trunk/pdfbox/download>
      [get] Getting: http://repo2.maven.org/maven2/com/adobe/pdf/pcfi/2010.08.09/pcfi-2010.08.09.jar
      [get] To: <https://builds.apache.org/hudson/job/PDFBox-trunk/ws/trunk/pdfbox/download/pcfi-2010.08.09.jar>
    [unjar] Expanding: <https://builds.apache.org/hudson/job/PDFBox-trunk/ws/trunk/pdfbox/download/pcfi-2010.08.09.jar> into <https://builds.apache.org/hudson/job/PDFBox-trunk/ws/trunk/pdfbox/target/classes/org/apache/pdfbox/resources/afm>
    [unjar] Expanding: <https://builds.apache.org/hudson/job/PDFBox-trunk/ws/trunk/pdfbox/download/pcfi-2010.08.09.jar> into <https://builds.apache.org/hudson/job/PDFBox-trunk/ws/trunk/pdfbox/target/classes/org/apache/pdfbox/resources>
[INFO] Executed tasks
[INFO] [INFO] Using 'ISO-8859-1' encoding to copy filtered resources.

[INFO] --- maven-resources-plugin:2.3:resources (default-resources) @ pdfbox ---
[INFO] Copying 191 resources
[INFO] Copying 3 resources
[INFO] 
[INFO] --- maven-compiler-plugin:2.0.2:compile (default-compile) @ pdfbox ---
[INFO] Compiling 482 source files to <https://builds.apache.org/hudson/job/PDFBox-trunk/ws/trunk/pdfbox/target/classes>
mojoFailed org.apache.maven.plugins:maven-compiler-plugin:2.0.2(default-compile)
projectFailed org.apache.pdfbox:pdfbox:1.6.0-SNAPSHOT
[JENKINS] Archiving <https://builds.apache.org/hudson/job/PDFBox-trunk/ws/trunk/pdfbox/pom.xml> to /home/hudson/hudson/jobs/PDFBox-trunk/modules/org.apache.pdfbox$pdfbox/builds/2011-04-29_19-01-10/archive/org.apache.pdfbox/pdfbox/1.6.0-SNAPSHOT/pdfbox-1.6.0-SNAPSHOT.pom
sessionEnded
[INFO] ------------------------------------------------------------------------
[INFO] Reactor Summary:
[INFO] 
[INFO] PDFBox parent ..................................... SUCCESS [10.052s]
[INFO] Apache FontBox .................................... SUCCESS [18.575s]
[INFO] Apache JempBox .................................... SUCCESS [5.354s]
[INFO] Apache PDFBox ..................................... FAILURE [10.071s]
[INFO] Apache PDFBox for Lucene .......................... SKIPPED
[INFO] Apache PDFBox for Ant ............................. SKIPPED
[INFO] Apache PDFBox webapp .............................. SKIPPED
[INFO] Apache PDFBox application ......................... SKIPPED
[INFO] PDFBox reactor .................................... SKIPPED
[INFO] ------------------------------------------------------------------------
[INFO] BUILD FAILURE
[INFO] ------------------------------------------------------------------------
[INFO] Total time: 49.495s
[INFO] Finished at: Fri Apr 29 11:02:10 GMT-08:00 2011
[INFO] Final Memory: 26M/202M
[INFO] ------------------------------------------------------------------------
maven builder waiting
mavenExecutionResult exceptions not empty
org.apache.maven.lifecycle.LifecycleExecutionException: Failed to execute goal org.apache.maven.plugins:maven-compiler-plugin:2.0.2:compile (default-compile) on project pdfbox: Compilation failure
	at org.apache.maven.lifecycle.internal.MojoExecutor.execute(MojoExecutor.java:213)
	at org.apache.maven.lifecycle.internal.MojoExecutor.execute(MojoExecutor.java:153)
	at org.apache.maven.lifecycle.internal.MojoExecutor.execute(MojoExecutor.java:145)
	at org.apache.maven.lifecycle.internal.LifecycleModuleBuilder.buildProject(LifecycleModuleBuilder.java:84)
	at org.apache.maven.lifecycle.internal.LifecycleModuleBuilder.buildProject(LifecycleModuleBuilder.java:59)
	at org.apache.maven.lifecycle.internal.LifecycleStarter.singleThreadedBuild(LifecycleStarter.java:183)
	at org.apache.maven.lifecycle.internal.LifecycleStarter.execute(LifecycleStarter.java:161)
	at org.apache.maven.DefaultMaven.doExecute(DefaultMaven.java:319)
	at org.apache.maven.DefaultMaven.execute(DefaultMaven.java:156)
	at org.jvnet.hudson.maven3.launcher.Maven3Launcher.main(Maven3Launcher.java:79)
	at sun.reflect.NativeMethodAccessorImpl.invoke0(Native Method)
	at sun.reflect.NativeMethodAccessorImpl.invoke(NativeMethodAccessorImpl.java:39)
	at sun.reflect.DelegatingMethodAccessorImpl.invoke(DelegatingMethodAccessorImpl.java:25)
	at java.lang.reflect.Method.invoke(Method.java:592)
	at org.codehaus.plexus.classworlds.launcher.Launcher.launchStandard(Launcher.java:329)
	at org.codehaus.plexus.classworlds.launcher.Launcher.launch(Launcher.java:239)
	at org.jvnet.hudson.maven3.agent.Maven3Main.launch(Maven3Main.java:146)
	at hudson.maven.Maven3Builder.call(Maven3Builder.java:126)
	at hudson.maven.Maven3Builder.call(Maven3Builder.java:73)
	at hudson.remoting.UserRequest.perform(UserRequest.java:118)
	at hudson.remoting.UserRequest.perform(UserRequest.java:48)
	at hudson.remoting.Request$2.run(Request.java:270)
	at java.util.concurrent.Executors$RunnableAdapter.call(Executors.java:417)
	at java.util.concurrent.FutureTask$Sync.innerRun(FutureTask.java:269)
	at java.util.concurrent.FutureTask.run(FutureTask.java:123)
	at java.util.concurrent.ThreadPoolExecutor$Worker.runTask(ThreadPoolExecutor.java:651)
	at java.util.concurrent.ThreadPoolExecutor$Worker.run(ThreadPoolExecutor.java:676)
	at java.lang.Thread.run(Thread.java:595)
Caused by: org.apache.maven.plugin.CompilationFailureException: Compilation failure
	at org.apache.maven.plugin.AbstractCompilerMojo.execute(AbstractCompilerMojo.java:516)
	at org.apache.maven.plugin.CompilerMojo.execute(CompilerMojo.java:114)
	at org.apache.maven.plugin.DefaultBuildPluginManager.executeMojo(DefaultBuildPluginManager.java:101)
	at org.apache.maven.lifecycle.internal.MojoExecutor.execute(MojoExecutor.java:209)
	... 27 more
Sending e-mails to: dev@pdfbox.apache.org
channel stopped
Archiving artifacts


Jenkins build is back to normal : PDFBox-trunk #268

Posted by Apache Jenkins Server <hu...@hudson.apache.org>.
See <https://builds.apache.org/hudson/job/PDFBox-trunk/268/changes>



Build failed in Jenkins: PDFBox-trunk #267

Posted by Apache Jenkins Server <hu...@hudson.apache.org>.
See <https://builds.apache.org/hudson/job/PDFBox-trunk/267/changes>

Changes:

[lehmi] PDFBOX-821: fixed an issue introduced in the last revision. Thanks to Kevin Jackson for the hint.

------------------------------------------
[...truncated 1303 lines...]
	at java.lang.reflect.Method.invoke(Method.java:592)
	at org.codehaus.plexus.classworlds.launcher.Launcher.launchStandard(Launcher.java:329)
	at org.codehaus.plexus.classworlds.launcher.Launcher.launch(Launcher.java:239)
	at org.jvnet.hudson.maven3.agent.Maven3Main.launch(Maven3Main.java:146)
	at hudson.maven.Maven3Builder.call(Maven3Builder.java:126)
	at hudson.maven.Maven3Builder.call(Maven3Builder.java:73)
	at hudson.remoting.UserRequest.perform(UserRequest.java:118)
	at hudson.remoting.UserRequest.perform(UserRequest.java:48)
	at hudson.remoting.Request$2.run(Request.java:270)
	at java.util.concurrent.Executors$RunnableAdapter.call(Executors.java:417)
	at java.util.concurrent.FutureTask$Sync.innerRun(FutureTask.java:269)
	at java.util.concurrent.FutureTask.run(FutureTask.java:123)
	at java.util.concurrent.ThreadPoolExecutor$Worker.runTask(ThreadPoolExecutor.java:651)
	at java.util.concurrent.ThreadPoolExecutor$Worker.run(ThreadPoolExecutor.java:676)
	at java.lang.Thread.run(Thread.java:595)
[INFO] Writing OBR metadata

[INFO] --- maven-bundle-plugin:2.0.0:install (default-install) @ fontbox ---
[INFO] 
[INFO] --- maven-deploy-plugin:2.4:deploy (default-deploy) @ fontbox ---
Downloading: https://repository.apache.org/content/repositories/snapshots/org/apache/pdfbox/fontbox/1.6.0-SNAPSHOT/maven-metadata.xml
Downloaded: https://repository.apache.org/content/repositories/snapshots/org/apache/pdfbox/fontbox/1.6.0-SNAPSHOT/maven-metadata.xml (777 B at 5.3 KB/sec)
Uploading: https://repository.apache.org/content/repositories/snapshots/org/apache/pdfbox/fontbox/1.6.0-SNAPSHOT/fontbox-1.6.0-20110501.160306-21.jar
Uploaded: https://repository.apache.org/content/repositories/snapshots/org/apache/pdfbox/fontbox/1.6.0-SNAPSHOT/fontbox-1.6.0-20110501.160306-21.jar (171 KB at 212.0 KB/sec)
Uploading: https://repository.apache.org/content/repositories/snapshots/org/apache/pdfbox/fontbox/1.6.0-SNAPSHOT/fontbox-1.6.0-20110501.160306-21.pom
Uploaded: https://repository.apache.org/content/repositories/snapshots/org/apache/pdfbox/fontbox/1.6.0-SNAPSHOT/fontbox-1.6.0-20110501.160306-21.pom (4 KB at 20.1 KB/sec)
Downloading: https://repository.apache.org/content/repositories/snapshots/org/apache/pdfbox/fontbox/maven-metadata.xml
Downloaded: https://repository.apache.org/content/repositories/snapshots/org/apache/pdfbox/fontbox/maven-metadata.xml (582 B at 5.9 KB/sec)
Uploading: https://repository.apache.org/content/repositories/snapshots/org/apache/pdfbox/fontbox/1.6.0-SNAPSHOT/maven-metadata.xml
Uploaded: https://repository.apache.org/content/repositories/snapshots/org/apache/pdfbox/fontbox/1.6.0-SNAPSHOT/maven-metadata.xml (777 B at 5.4 KB/sec)
Uploading: https://repository.apache.org/content/repositories/snapshots/org/apache/pdfbox/fontbox/maven-metadata.xml
Uploaded: https://repository.apache.org/content/repositories/snapshots/org/apache/pdfbox/fontbox/maven-metadata.xml (582 B at 4.0 KB/sec)
[INFO] [INFO] Remote OBR update disabled (enable with -DremoteOBR)

[INFO] --- maven-bundle-plugin:2.0.0:deploy (default-deploy) @ fontbox ---
projectSucceeded org.apache.pdfbox:fontbox:1.6.0-SNAPSHOT
[JENKINS] Archiving <https://builds.apache.org/hudson/job/PDFBox-trunk/ws/trunk/fontbox/pom.xml> to /home/hudson/hudson/jobs/PDFBox-trunk/modules/org.apache.pdfbox$fontbox/builds/2011-05-01_16-02-23/archive/org.apache.pdfbox/fontbox/1.6.0-SNAPSHOT/fontbox-1.6.0-SNAPSHOT.pom
[JENKINS] Archiving <https://builds.apache.org/hudson/job/PDFBox-trunk/ws/trunk/fontbox/target/fontbox-1.6.0-SNAPSHOT.jar> to /home/hudson/hudson/jobs/PDFBox-trunk/modules/org.apache.pdfbox$fontbox/builds/2011-05-01_16-02-23/archive/org.apache.pdfbox/fontbox/1.6.0-20110501.160306-21/fontbox-1.6.0-20110501.160306-21.jar
[INFO]                                                                         
[INFO] ------------------------------------------------------------------------
[INFO] Building Apache JempBox 1.6.0-SNAPSHOT
[INFO] ------------------------------------------------------------------------
[INFO] 
[INFO] --- maven-clean-plugin:2.3:clean (default-clean) @ jempbox ---
[INFO] 
[INFO] --- maven-remote-resources-plugin:1.0:process (default) @ jempbox ---
[INFO] [INFO] Using 'ISO-8859-1' encoding to copy filtered resources.
[INFO] skip non existing resourceDirectory <https://builds.apache.org/hudson/job/PDFBox-trunk/ws/trunk/jempbox/src/main/resources>
[INFO] Copying 3 resources

[INFO] --- maven-resources-plugin:2.3:resources (default-resources) @ jempbox ---
[INFO] [INFO] Compiling 24 source files to <https://builds.apache.org/hudson/job/PDFBox-trunk/ws/trunk/jempbox/target/classes>

[INFO] --- maven-compiler-plugin:2.0.2:compile (default-compile) @ jempbox ---
[INFO] [INFO] Using 'ISO-8859-1' encoding to copy filtered resources.
[INFO] skip non existing resourceDirectory <https://builds.apache.org/hudson/job/PDFBox-trunk/ws/trunk/jempbox/src/test/resources>
[INFO] Copying 3 resources

[INFO] --- maven-resources-plugin:2.3:testResources (default-testResources) @ jempbox ---
[INFO] [INFO] Compiling 3 source files to <https://builds.apache.org/hudson/job/PDFBox-trunk/ws/trunk/jempbox/target/test-classes>

[INFO] --- maven-compiler-plugin:2.0.2:testCompile (default-testCompile) @ jempbox ---
[INFO] Surefire report directory: <https://builds.apache.org/hudson/job/PDFBox-trunk/ws/trunk/jempbox/target/surefire-reports>
[INFO] 
[INFO] --- maven-surefire-plugin:2.4.3:test (default-test) @ jempbox ---

-------------------------------------------------------
 T E S T S
-------------------------------------------------------
Running org.apache.jempbox.xmp.XMPMetadataTest
Tests run: 3, Failures: 0, Errors: 0, Skipped: 0, Time elapsed: 0.062 sec
Running org.apache.jempbox.xmp.XMPSchemaTest
Tests run: 8, Failures: 0, Errors: 0, Skipped: 0, Time elapsed: 0.047 sec

Results :

Tests run: 11, Failures: 0, Errors: 0, Skipped: 0

[JENKINS] Recording test results
[INFO] 
[INFO] --- maven-bundle-plugin:2.0.0:bundle (default-bundle) @ jempbox ---
[INFO] [INFO] Exclude: release.properties

[INFO] --- apache-rat-plugin:0.6:check (default) @ jempbox ---
[INFO] [INFO] Installing <https://builds.apache.org/hudson/job/PDFBox-trunk/ws/trunk/jempbox/target/jempbox-1.6.0-SNAPSHOT.jar> to /home/hudson/.m2/repository/org/apache/pdfbox/jempbox/1.6.0-SNAPSHOT/jempbox-1.6.0-SNAPSHOT.jar
[INFO] Installing <https://builds.apache.org/hudson/job/PDFBox-trunk/ws/trunk/jempbox/pom.xml> to /home/hudson/.m2/repository/org/apache/pdfbox/jempbox/1.6.0-SNAPSHOT/jempbox-1.6.0-SNAPSHOT.pom

[INFO] --- maven-install-plugin:2.2:install (default-install) @ jempbox ---
[INFO] [INFO] Parsing file:/home/hudson/.m2/repository/repository.xml
[Fatal Error] :-1:-1: Premature end of file.
org.xml.sax.SAXParseException: Premature end of file.
	at com.sun.org.apache.xerces.internal.parsers.DOMParser.parse(DOMParser.java:264)
	at com.sun.org.apache.xerces.internal.jaxp.DocumentBuilderImpl.parse(DocumentBuilderImpl.java:292)
	at javax.xml.parsers.DocumentBuilder.parse(DocumentBuilder.java:172)
	at org.apache.felix.obrplugin.ObrUpdate.parseFile(ObrUpdate.java:347)
	at org.apache.felix.obrplugin.ObrUpdate.parseRepositoryXml(ObrUpdate.java:324)
	at org.apache.felix.obrplugin.ObrInstall.execute(ObrInstall.java:140)
	at org.apache.maven.plugin.DefaultBuildPluginManager.executeMojo(DefaultBuildPluginManager.java:101)
	at org.apache.maven.lifecycle.internal.MojoExecutor.execute(MojoExecutor.java:209)
	at org.apache.maven.lifecycle.internal.MojoExecutor.execute(MojoExecutor.java:153)
	at org.apache.maven.lifecycle.internal.MojoExecutor.execute(MojoExecutor.java:145)
	at org.apache.maven.lifecycle.internal.LifecycleModuleBuilder.buildProject(LifecycleModuleBuilder.java:84)
	at org.apache.maven.lifecycle.internal.LifecycleModuleBuilder.buildProject(LifecycleModuleBuilder.java:59)
	at org.apache.maven.lifecycle.internal.LifecycleStarter.singleThreadedBuild(LifecycleStarter.java:183)
	at org.apache.maven.lifecycle.internal.LifecycleStarter.execute(LifecycleStarter.java:161)
	at org.apache.maven.DefaultMaven.doExecute(DefaultMaven.java:319)
	at org.apache.maven.DefaultMaven.execute(DefaultMaven.java:156)
	at org.jvnet.hudson.maven3.launcher.Maven3Launcher.main(Maven3Launcher.java:79)
	at sun.reflect.NativeMethodAccessorImpl.invoke0(Native Method)
	at sun.reflect.NativeMethodAccessorImpl.invoke(NativeMethodAccessorImpl.java:39)
	at sun.reflect.DelegatingMethodAccessorImpl.invoke(DelegatingMethodAccessorImpl.java:25)
	at java.lang.reflect.Method.invoke(Method.java:592)
	at org.codehaus.plexus.classworlds.launcher.Launcher.launchStandard(Launcher.java:329)
	at org.codehaus.plexus.classworlds.launcher.Launcher.launch(Launcher.java:239)
	at org.jvnet.hudson.maven3.agent.Maven3Main.launch(Maven3Main.java:146)
	at hudson.maven.Maven3Builder.call(Maven3Builder.java:126)
	at hudson.maven.Maven3Builder.call(Maven3Builder.java:73)
	at hudson.remoting.UserRequest.perform(UserRequest.java:118)

	at hudson.remoting.UserRequest.perform(UserRequest.java:48)
[INFO] --- maven-bundle-plugin:2.0.0:install (default-install) @ jempbox ---
	at hudson.remoting.Request$2.run(Request.java:270)
	at java.util.concurrent.Executors$RunnableAdapter.call(Executors.java:417)
	at java.util.concurrent.FutureTask$Sync.innerRun(FutureTask.java:269)
	at java.util.concurrent.FutureTask.run(FutureTask.java:123)
	at java.util.concurrent.ThreadPoolExecutor$Worker.runTask(ThreadPoolExecutor.java:651)
	at java.util.concurrent.ThreadPoolExecutor$Worker.run(ThreadPoolExecutor.java:676)
	at java.lang.Thread.run(Thread.java:595)
[INFO] Writing OBR metadata
[INFO] Downloading: https://repository.apache.org/content/repositories/snapshots/org/apache/pdfbox/jempbox/1.6.0-SNAPSHOT/maven-metadata.xml
Downloaded: https://repository.apache.org/content/repositories/snapshots/org/apache/pdfbox/jempbox/1.6.0-SNAPSHOT/maven-metadata.xml (777 B at 8.9 KB/sec)
Uploading: https://repository.apache.org/content/repositories/snapshots/org/apache/pdfbox/jempbox/1.6.0-SNAPSHOT/jempbox-1.6.0-20110501.160313-21.jar

[INFO] --- maven-deploy-plugin:2.4:deploy (default-deploy) @ jempbox ---
Uploaded: https://repository.apache.org/content/repositories/snapshots/org/apache/pdfbox/jempbox/1.6.0-SNAPSHOT/jempbox-1.6.0-20110501.160313-21.jar (51 KB at 200.8 KB/sec)
Uploading: https://repository.apache.org/content/repositories/snapshots/org/apache/pdfbox/jempbox/1.6.0-SNAPSHOT/jempbox-1.6.0-20110501.160313-21.pom
Uploaded: https://repository.apache.org/content/repositories/snapshots/org/apache/pdfbox/jempbox/1.6.0-SNAPSHOT/jempbox-1.6.0-20110501.160313-21.pom (4 KB at 23.4 KB/sec)
Downloading: https://repository.apache.org/content/repositories/snapshots/org/apache/pdfbox/jempbox/maven-metadata.xml
Downloaded: https://repository.apache.org/content/repositories/snapshots/org/apache/pdfbox/jempbox/maven-metadata.xml (424 B at 5.1 KB/sec)
Uploading: https://repository.apache.org/content/repositories/snapshots/org/apache/pdfbox/jempbox/1.6.0-SNAPSHOT/maven-metadata.xml
Uploaded: https://repository.apache.org/content/repositories/snapshots/org/apache/pdfbox/jempbox/1.6.0-SNAPSHOT/maven-metadata.xml (777 B at 5.4 KB/sec)
Uploading: https://repository.apache.org/content/repositories/snapshots/org/apache/pdfbox/jempbox/maven-metadata.xml
Uploaded: https://repository.apache.org/content/repositories/snapshots/org/apache/pdfbox/jempbox/maven-metadata.xml (424 B at 2.6 KB/sec)
[INFO] [INFO] Remote OBR update disabled (enable with -DremoteOBR)

[INFO] --- maven-bundle-plugin:2.0.0:deploy (default-deploy) @ jempbox ---
projectSucceeded org.apache.pdfbox:jempbox:1.6.0-SNAPSHOT
[JENKINS] Archiving <https://builds.apache.org/hudson/job/PDFBox-trunk/ws/trunk/jempbox/pom.xml> to /home/hudson/hudson/jobs/PDFBox-trunk/modules/org.apache.pdfbox$jempbox/builds/2011-05-01_16-02-23/archive/org.apache.pdfbox/jempbox/1.6.0-SNAPSHOT/jempbox-1.6.0-SNAPSHOT.pom
[JENKINS] Archiving <https://builds.apache.org/hudson/job/PDFBox-trunk/ws/trunk/jempbox/target/jempbox-1.6.0-SNAPSHOT.jar> to /home/hudson/hudson/jobs/PDFBox-trunk/modules/org.apache.pdfbox$jempbox/builds/2011-05-01_16-02-23/archive/org.apache.pdfbox/jempbox/1.6.0-20110501.160313-21/jempbox-1.6.0-20110501.160313-21.jar
[INFO]                                                                         
[INFO] ------------------------------------------------------------------------
[INFO] Building Apache PDFBox 1.6.0-SNAPSHOT
[INFO] ------------------------------------------------------------------------
[INFO] 
[INFO] --- maven-clean-plugin:2.3:clean (default-clean) @ pdfbox ---
[INFO] 
[INFO] --- maven-remote-resources-plugin:1.0:process (default) @ pdfbox ---
[INFO] Setting property: classpath.resource.loader.class => 'org.codehaus.plexus.velocity.ContextClassLoaderResourceLoader'.
[INFO] Setting property: velocimacro.messages.on => 'false'.
[INFO] Setting property: resource.loader => 'classpath'.
[INFO] Setting property: resource.manager.logwhenfound => 'false'.
[INFO] 
[INFO] --- maven-antrun-plugin:1.3:run (default) @ pdfbox ---
[INFO] Executing tasks

find.adobefiles:

get.adobefiles:

testexist:

downloadfile:
    [mkdir] Created dir: <https://builds.apache.org/hudson/job/PDFBox-trunk/ws/trunk/pdfbox/download>
      [get] Getting: http://repo2.maven.org/maven2/com/adobe/pdf/pcfi/2010.08.09/pcfi-2010.08.09.jar
      [get] To: <https://builds.apache.org/hudson/job/PDFBox-trunk/ws/trunk/pdfbox/download/pcfi-2010.08.09.jar>
    [unjar] Expanding: <https://builds.apache.org/hudson/job/PDFBox-trunk/ws/trunk/pdfbox/download/pcfi-2010.08.09.jar> into <https://builds.apache.org/hudson/job/PDFBox-trunk/ws/trunk/pdfbox/target/classes/org/apache/pdfbox/resources/afm>
    [unjar] Expanding: <https://builds.apache.org/hudson/job/PDFBox-trunk/ws/trunk/pdfbox/download/pcfi-2010.08.09.jar> into <https://builds.apache.org/hudson/job/PDFBox-trunk/ws/trunk/pdfbox/target/classes/org/apache/pdfbox/resources>
[INFO] Executed tasks
[INFO] 
[INFO] Using 'ISO-8859-1' encoding to copy filtered resources.
[INFO] --- maven-resources-plugin:2.3:resources (default-resources) @ pdfbox ---
[INFO] Copying 191 resources
[INFO] Copying 3 resources
[INFO] 
[INFO] --- maven-compiler-plugin:2.0.2:compile (default-compile) @ pdfbox ---
[INFO] Compiling 482 source files to <https://builds.apache.org/hudson/job/PDFBox-trunk/ws/trunk/pdfbox/target/classes>
mojoFailed org.apache.maven.plugins:maven-compiler-plugin:2.0.2(default-compile)
projectFailed org.apache.pdfbox:pdfbox:1.6.0-SNAPSHOT
[JENKINS] Archiving <https://builds.apache.org/hudson/job/PDFBox-trunk/ws/trunk/pdfbox/pom.xml> to /home/hudson/hudson/jobs/PDFBox-trunk/modules/org.apache.pdfbox$pdfbox/builds/2011-05-01_16-02-23/archive/org.apache.pdfbox/pdfbox/1.6.0-SNAPSHOT/pdfbox-1.6.0-SNAPSHOT.pom
sessionEnded
[INFO] ------------------------------------------------------------------------
[INFO] Reactor Summary:
[INFO] 
[INFO] PDFBox parent ..................................... SUCCESS [10.441s]
[INFO] Apache FontBox .................................... SUCCESS [16.704s]
[INFO] Apache JempBox .................................... SUCCESS [4.406s]
[INFO] Apache PDFBox ..................................... FAILURE [8.319s]
[INFO] Apache PDFBox for Lucene .......................... SKIPPED
[INFO] Apache PDFBox for Ant ............................. SKIPPED
[INFO] Apache PDFBox webapp .............................. SKIPPED
[INFO] Apache PDFBox application ......................... SKIPPED
[INFO] PDFBox reactor .................................... SKIPPED
[INFO] ------------------------------------------------------------------------
[INFO] BUILD FAILURE
[INFO] ------------------------------------------------------------------------
[INFO] Total time: 45.980s
[INFO] Finished at: Sun May 01 16:03:24 UTC 2011
[INFO] Final Memory: 26M/168M
[INFO] ------------------------------------------------------------------------
maven builder waiting
mavenExecutionResult exceptions not empty
org.apache.maven.lifecycle.LifecycleExecutionException: Failed to execute goal org.apache.maven.plugins:maven-compiler-plugin:2.0.2:compile (default-compile) on project pdfbox: Compilation failure
	at org.apache.maven.lifecycle.internal.MojoExecutor.execute(MojoExecutor.java:213)
	at org.apache.maven.lifecycle.internal.MojoExecutor.execute(MojoExecutor.java:153)
	at org.apache.maven.lifecycle.internal.MojoExecutor.execute(MojoExecutor.java:145)
	at org.apache.maven.lifecycle.internal.LifecycleModuleBuilder.buildProject(LifecycleModuleBuilder.java:84)
	at org.apache.maven.lifecycle.internal.LifecycleModuleBuilder.buildProject(LifecycleModuleBuilder.java:59)
	at org.apache.maven.lifecycle.internal.LifecycleStarter.singleThreadedBuild(LifecycleStarter.java:183)
	at org.apache.maven.lifecycle.internal.LifecycleStarter.execute(LifecycleStarter.java:161)
	at org.apache.maven.DefaultMaven.doExecute(DefaultMaven.java:319)
	at org.apache.maven.DefaultMaven.execute(DefaultMaven.java:156)
	at org.jvnet.hudson.maven3.launcher.Maven3Launcher.main(Maven3Launcher.java:79)
	at sun.reflect.NativeMethodAccessorImpl.invoke0(Native Method)
	at sun.reflect.NativeMethodAccessorImpl.invoke(NativeMethodAccessorImpl.java:39)
	at sun.reflect.DelegatingMethodAccessorImpl.invoke(DelegatingMethodAccessorImpl.java:25)
	at java.lang.reflect.Method.invoke(Method.java:592)
	at org.codehaus.plexus.classworlds.launcher.Launcher.launchStandard(Launcher.java:329)
	at org.codehaus.plexus.classworlds.launcher.Launcher.launch(Launcher.java:239)
	at org.jvnet.hudson.maven3.agent.Maven3Main.launch(Maven3Main.java:146)
	at hudson.maven.Maven3Builder.call(Maven3Builder.java:126)
	at hudson.maven.Maven3Builder.call(Maven3Builder.java:73)
	at hudson.remoting.UserRequest.perform(UserRequest.java:118)
	at hudson.remoting.UserRequest.perform(UserRequest.java:48)
	at hudson.remoting.Request$2.run(Request.java:270)
	at java.util.concurrent.Executors$RunnableAdapter.call(Executors.java:417)
	at java.util.concurrent.FutureTask$Sync.innerRun(FutureTask.java:269)
	at java.util.concurrent.FutureTask.run(FutureTask.java:123)
	at java.util.concurrent.ThreadPoolExecutor$Worker.runTask(ThreadPoolExecutor.java:651)
	at java.util.concurrent.ThreadPoolExecutor$Worker.run(ThreadPoolExecutor.java:676)
	at java.lang.Thread.run(Thread.java:595)
Caused by: org.apache.maven.plugin.CompilationFailureException: Compilation failure
	at org.apache.maven.plugin.AbstractCompilerMojo.execute(AbstractCompilerMojo.java:516)
	at org.apache.maven.plugin.CompilerMojo.execute(CompilerMojo.java:114)
	at org.apache.maven.plugin.DefaultBuildPluginManager.executeMojo(DefaultBuildPluginManager.java:101)
	at org.apache.maven.lifecycle.internal.MojoExecutor.execute(MojoExecutor.java:209)
	... 27 more
Sending e-mails to: dev@pdfbox.apache.org
channel stopped
Archiving artifacts


Build failed in Jenkins: PDFBox-trunk #266

Posted by Apache Jenkins Server <hu...@hudson.apache.org>.
See <https://builds.apache.org/hudson/job/PDFBox-trunk/266/changes>

Changes:

[lehmi] PDFBOX-821: read returns unsigned values as proposed by Timo Boehme

------------------------------------------
[...truncated 136 lines...]
	at org.jvnet.hudson.maven3.launcher.Maven3Launcher.main(Maven3Launcher.java:79)
	at sun.reflect.NativeMethodAccessorImpl.invoke0(Native Method)
	at sun.reflect.NativeMethodAccessorImpl.invoke(NativeMethodAccessorImpl.java:39)
	at sun.reflect.DelegatingMethodAccessorImpl.invoke(DelegatingMethodAccessorImpl.java:25)
	at java.lang.reflect.Method.invoke(Method.java:592)
	at org.codehaus.plexus.classworlds.launcher.Launcher.launchStandard(Launcher.java:329)
	at org.codehaus.plexus.classworlds.launcher.Launcher.launch(Launcher.java:239)
	at org.jvnet.hudson.maven3.agent.Maven3Main.launch(Maven3Main.java:146)
	at hudson.maven.Maven3Builder.call(Maven3Builder.java:126)
	at hudson.maven.Maven3Builder.call(Maven3Builder.java:73)
	at hudson.remoting.UserRequest.perform(UserRequest.java:118)
	at hudson.remoting.UserRequest.perform(UserRequest.java:48)
	at hudson.remoting.Request$2.run(Request.java:270)
	at java.util.concurrent.Executors$RunnableAdapter.call(Executors.java:417)
	at java.util.concurrent.FutureTask$Sync.innerRun(FutureTask.java:269)
	at java.util.concurrent.FutureTask.run(FutureTask.java:123)
	at java.util.concurrent.ThreadPoolExecutor$Worker.runTask(ThreadPoolExecutor.java:651)
	at java.util.concurrent.ThreadPoolExecutor$Worker.run(ThreadPoolExecutor.java:676)
	at java.lang.Thread.run(Thread.java:595)
[INFO] Writing OBR metadata
[INFO] 
[INFO] --- maven-deploy-plugin:2.4:deploy (default-deploy) @ fontbox ---
Downloading: https://repository.apache.org/content/repositories/snapshots/org/apache/pdfbox/fontbox/1.6.0-SNAPSHOT/maven-metadata.xml
Downloaded: https://repository.apache.org/content/repositories/snapshots/org/apache/pdfbox/fontbox/1.6.0-SNAPSHOT/maven-metadata.xml (777 B at 11.2 KB/sec)
Uploading: https://repository.apache.org/content/repositories/snapshots/org/apache/pdfbox/fontbox/1.6.0-SNAPSHOT/fontbox-1.6.0-20110501.150353-20.jar
Uploaded: https://repository.apache.org/content/repositories/snapshots/org/apache/pdfbox/fontbox/1.6.0-SNAPSHOT/fontbox-1.6.0-20110501.150353-20.jar (171 KB at 1495.0 KB/sec)
Uploading: https://repository.apache.org/content/repositories/snapshots/org/apache/pdfbox/fontbox/1.6.0-SNAPSHOT/fontbox-1.6.0-20110501.150353-20.pom
Uploaded: https://repository.apache.org/content/repositories/snapshots/org/apache/pdfbox/fontbox/1.6.0-SNAPSHOT/fontbox-1.6.0-20110501.150353-20.pom (4 KB at 15.1 KB/sec)
Downloading: https://repository.apache.org/content/repositories/snapshots/org/apache/pdfbox/fontbox/maven-metadata.xml
Downloaded: https://repository.apache.org/content/repositories/snapshots/org/apache/pdfbox/fontbox/maven-metadata.xml (582 B at 3.7 KB/sec)
Uploading: https://repository.apache.org/content/repositories/snapshots/org/apache/pdfbox/fontbox/1.6.0-SNAPSHOT/maven-metadata.xml
Uploaded: https://repository.apache.org/content/repositories/snapshots/org/apache/pdfbox/fontbox/1.6.0-SNAPSHOT/maven-metadata.xml (777 B at 8.3 KB/sec)
Uploading: https://repository.apache.org/content/repositories/snapshots/org/apache/pdfbox/fontbox/maven-metadata.xml
Uploaded: https://repository.apache.org/content/repositories/snapshots/org/apache/pdfbox/fontbox/maven-metadata.xml (582 B at 5.9 KB/sec)
[INFO] 
[INFO] --- maven-bundle-plugin:2.0.0:deploy (default-deploy) @ fontbox ---
[INFO] Remote OBR update disabled (enable with -DremoteOBR)
projectSucceeded org.apache.pdfbox:fontbox:1.6.0-SNAPSHOT
[JENKINS] Archiving <https://builds.apache.org/hudson/job/PDFBox-trunk/ws/trunk/fontbox/pom.xml> to /home/hudson/hudson/jobs/PDFBox-trunk/modules/org.apache.pdfbox$fontbox/builds/2011-05-01_15-03-18/archive/org.apache.pdfbox/fontbox/1.6.0-SNAPSHOT/fontbox-1.6.0-SNAPSHOT.pom
[JENKINS] Archiving <https://builds.apache.org/hudson/job/PDFBox-trunk/ws/trunk/fontbox/target/fontbox-1.6.0-SNAPSHOT.jar> to /home/hudson/hudson/jobs/PDFBox-trunk/modules/org.apache.pdfbox$fontbox/builds/2011-05-01_15-03-18/archive/org.apache.pdfbox/fontbox/1.6.0-20110501.150353-20/fontbox-1.6.0-20110501.150353-20.jar
[INFO]                                                                         
[INFO] ------------------------------------------------------------------------
[INFO] Building Apache JempBox 1.6.0-SNAPSHOT
[INFO] ------------------------------------------------------------------------
[INFO] Deleting file set: <https://builds.apache.org/hudson/job/PDFBox-trunk/ws/trunk/jempbox/target> (included: [**], excluded: [])
[INFO] 
[INFO] --- maven-clean-plugin:2.3:clean (default-clean) @ jempbox ---
[INFO] 
[INFO] --- maven-remote-resources-plugin:1.0:process (default) @ jempbox ---
[INFO] [INFO] Using 'ISO-8859-1' encoding to copy filtered resources.
[INFO] skip non existing resourceDirectory <https://builds.apache.org/hudson/job/PDFBox-trunk/ws/trunk/jempbox/src/main/resources>
[INFO] Copying 3 resources

[INFO] --- maven-resources-plugin:2.3:resources (default-resources) @ jempbox ---
[INFO] 
[INFO] --- maven-compiler-plugin:2.0.2:compile (default-compile) @ jempbox ---
[INFO] Compiling 24 source files to <https://builds.apache.org/hudson/job/PDFBox-trunk/ws/trunk/jempbox/target/classes>
[INFO] [INFO] Using 'ISO-8859-1' encoding to copy filtered resources.
[INFO] skip non existing resourceDirectory <https://builds.apache.org/hudson/job/PDFBox-trunk/ws/trunk/jempbox/src/test/resources>
[INFO] Copying 3 resources

[INFO] --- maven-resources-plugin:2.3:testResources (default-testResources) @ jempbox ---
[INFO] 
[INFO] --- maven-compiler-plugin:2.0.2:testCompile (default-testCompile) @ jempbox ---
[INFO] Compiling 3 source files to <https://builds.apache.org/hudson/job/PDFBox-trunk/ws/trunk/jempbox/target/test-classes>
[INFO] 
[INFO] --- maven-surefire-plugin:2.4.3:test (default-test) @ jempbox ---
[INFO] Surefire report directory: <https://builds.apache.org/hudson/job/PDFBox-trunk/ws/trunk/jempbox/target/surefire-reports>

-------------------------------------------------------
 T E S T S
-------------------------------------------------------
Running org.apache.jempbox.xmp.XMPMetadataTest
Tests run: 3, Failures: 0, Errors: 0, Skipped: 0, Time elapsed: 0.103 sec
Running org.apache.jempbox.xmp.XMPSchemaTest
Tests run: 8, Failures: 0, Errors: 0, Skipped: 0, Time elapsed: 0.152 sec

Results :

Tests run: 11, Failures: 0, Errors: 0, Skipped: 0

[JENKINS] Recording test results
[INFO] 
[INFO] --- maven-bundle-plugin:2.0.0:bundle (default-bundle) @ jempbox ---
[INFO] Exclude: release.properties
[INFO] 
[INFO] --- apache-rat-plugin:0.6:check (default) @ jempbox ---
[INFO] 
[INFO] --- maven-install-plugin:2.2:install (default-install) @ jempbox ---
[INFO] Installing <https://builds.apache.org/hudson/job/PDFBox-trunk/ws/trunk/jempbox/target/jempbox-1.6.0-SNAPSHOT.jar> to /export/home/hudson/.m2/repository/org/apache/pdfbox/jempbox/1.6.0-SNAPSHOT/jempbox-1.6.0-SNAPSHOT.jar
[INFO] Installing <https://builds.apache.org/hudson/job/PDFBox-trunk/ws/trunk/jempbox/pom.xml> to /export/home/hudson/.m2/repository/org/apache/pdfbox/jempbox/1.6.0-SNAPSHOT/jempbox-1.6.0-SNAPSHOT.pom
[INFO] 
[INFO] --- maven-bundle-plugin:2.0.0:install (default-install) @ jempbox ---
[INFO] Parsing file:/export/home/hudson/.m2/repository/repository.xml
[Fatal Error] :-1:-1: Premature end of file.
org.xml.sax.SAXParseException: Premature end of file.
	at com.sun.org.apache.xerces.internal.parsers.DOMParser.parse(DOMParser.java:264)
	at com.sun.org.apache.xerces.internal.jaxp.DocumentBuilderImpl.parse(DocumentBuilderImpl.java:292)
	at javax.xml.parsers.DocumentBuilder.parse(DocumentBuilder.java:172)
	at org.apache.felix.obrplugin.ObrUpdate.parseFile(ObrUpdate.java:347)
	at org.apache.felix.obrplugin.ObrUpdate.parseRepositoryXml(ObrUpdate.java:324)
	at org.apache.felix.obrplugin.ObrInstall.execute(ObrInstall.java:140)
	at org.apache.maven.plugin.DefaultBuildPluginManager.executeMojo(DefaultBuildPluginManager.java:101)
	at org.apache.maven.lifecycle.internal.MojoExecutor.execute(MojoExecutor.java:209)
	at org.apache.maven.lifecycle.internal.MojoExecutor.execute(MojoExecutor.java:153)
	at org.apache.maven.lifecycle.internal.MojoExecutor.execute(MojoExecutor.java:145)
	at org.apache.maven.lifecycle.internal.LifecycleModuleBuilder.buildProject(LifecycleModuleBuilder.java:84)
	at org.apache.maven.lifecycle.internal.LifecycleModuleBuilder.buildProject(LifecycleModuleBuilder.java:59)
	at org.apache.maven.lifecycle.internal.LifecycleStarter.singleThreadedBuild(LifecycleStarter.java:183)
	at org.apache.maven.lifecycle.internal.LifecycleStarter.execute(LifecycleStarter.java:161)
	at org.apache.maven.DefaultMaven.doExecute(DefaultMaven.java:319)
	at org.apache.maven.DefaultMaven.execute(DefaultMaven.java:156)
	at org.jvnet.hudson.maven3.launcher.Maven3Launcher.main(Maven3Launcher.java:79)
	at sun.reflect.NativeMethodAccessorImpl.invoke0(Native Method)
	at sun.reflect.NativeMethodAccessorImpl.invoke(NativeMethodAccessorImpl.java:39)
	at sun.reflect.DelegatingMethodAccessorImpl.invoke(DelegatingMethodAccessorImpl.java:25)
	at java.lang.reflect.Method.invoke(Method.java:592)
	at org.codehaus.plexus.classworlds.launcher.Launcher.launchStandard(Launcher.java:329)
	at org.codehaus.plexus.classworlds.launcher.Launcher.launch(Launcher.java:239)
	at org.jvnet.hudson.maven3.agent.Maven3Main.launch(Maven3Main.java:146)
	at hudson.maven.Maven3Builder.call(Maven3Builder.java:126)
	at hudson.maven.Maven3Builder.call(Maven3Builder.java:73)
	at hudson.remoting.UserRequest.perform(UserRequest.java:118)
	at hudson.remoting.UserRequest.perform(UserRequest.java:48)
	at hudson.remoting.Request$2.run(Request.java:270)
	at java.util.concurrent.Executors$RunnableAdapter.call(Executors.java:417)
	at java.util.concurrent.FutureTask$Sync.innerRun(FutureTask.java:269)
	at java.util.concurrent.FutureTask.run(FutureTask.java:123)
	at java.util.concurrent.ThreadPoolExecutor$Worker.runTask(ThreadPoolExecutor.java:651)
	at java.util.concurrent.ThreadPoolExecutor$Worker.run(ThreadPoolExecutor.java:676)
	at java.lang.Thread.run(Thread.java:595)
[INFO] Writing OBR metadata
[INFO] 
[INFO] --- maven-deploy-plugin:2.4:deploy (default-deploy) @ jempbox ---
Downloading: https://repository.apache.org/content/repositories/snapshots/org/apache/pdfbox/jempbox/1.6.0-SNAPSHOT/maven-metadata.xml
Downloaded: https://repository.apache.org/content/repositories/snapshots/org/apache/pdfbox/jempbox/1.6.0-SNAPSHOT/maven-metadata.xml (777 B at 8.5 KB/sec)
Uploading: https://repository.apache.org/content/repositories/snapshots/org/apache/pdfbox/jempbox/1.6.0-SNAPSHOT/jempbox-1.6.0-20110501.150400-20.jar
Uploaded: https://repository.apache.org/content/repositories/snapshots/org/apache/pdfbox/jempbox/1.6.0-SNAPSHOT/jempbox-1.6.0-20110501.150400-20.jar (51 KB at 492.1 KB/sec)
Uploading: https://repository.apache.org/content/repositories/snapshots/org/apache/pdfbox/jempbox/1.6.0-SNAPSHOT/jempbox-1.6.0-20110501.150400-20.pom
Uploaded: https://repository.apache.org/content/repositories/snapshots/org/apache/pdfbox/jempbox/1.6.0-SNAPSHOT/jempbox-1.6.0-20110501.150400-20.pom (4 KB at 59.2 KB/sec)
Downloading: https://repository.apache.org/content/repositories/snapshots/org/apache/pdfbox/jempbox/maven-metadata.xml
Downloaded: https://repository.apache.org/content/repositories/snapshots/org/apache/pdfbox/jempbox/maven-metadata.xml (424 B at 4.1 KB/sec)
Uploading: https://repository.apache.org/content/repositories/snapshots/org/apache/pdfbox/jempbox/1.6.0-SNAPSHOT/maven-metadata.xml
Uploaded: https://repository.apache.org/content/repositories/snapshots/org/apache/pdfbox/jempbox/1.6.0-SNAPSHOT/maven-metadata.xml (777 B at 11.0 KB/sec)
Uploading: https://repository.apache.org/content/repositories/snapshots/org/apache/pdfbox/jempbox/maven-metadata.xml
Uploaded: https://repository.apache.org/content/repositories/snapshots/org/apache/pdfbox/jempbox/maven-metadata.xml (424 B at 4.5 KB/sec)
[INFO] [INFO] Remote OBR update disabled (enable with -DremoteOBR)

[INFO] --- maven-bundle-plugin:2.0.0:deploy (default-deploy) @ jempbox ---
projectSucceeded org.apache.pdfbox:jempbox:1.6.0-SNAPSHOT
[JENKINS] Archiving <https://builds.apache.org/hudson/job/PDFBox-trunk/ws/trunk/jempbox/pom.xml> to /home/hudson/hudson/jobs/PDFBox-trunk/modules/org.apache.pdfbox$jempbox/builds/2011-05-01_15-03-18/archive/org.apache.pdfbox/jempbox/1.6.0-SNAPSHOT/jempbox-1.6.0-SNAPSHOT.pom
[JENKINS] Archiving <https://builds.apache.org/hudson/job/PDFBox-trunk/ws/trunk/jempbox/target/jempbox-1.6.0-SNAPSHOT.jar> to /home/hudson/hudson/jobs/PDFBox-trunk/modules/org.apache.pdfbox$jempbox/builds/2011-05-01_15-03-18/archive/org.apache.pdfbox/jempbox/1.6.0-20110501.150400-20/jempbox-1.6.0-20110501.150400-20.jar
[INFO]                                                                         
[INFO] ------------------------------------------------------------------------
[INFO] Building Apache PDFBox 1.6.0-SNAPSHOT
[INFO] ------------------------------------------------------------------------
[INFO] 
[INFO] --- maven-clean-plugin:2.3:clean (default-clean) @ pdfbox ---
[INFO] Deleting file set: <https://builds.apache.org/hudson/job/PDFBox-trunk/ws/trunk/pdfbox/target> (included: [**], excluded: [])
[INFO] 
[INFO] --- maven-remote-resources-plugin:1.0:process (default) @ pdfbox ---
[INFO] Setting property: classpath.resource.loader.class => 'org.codehaus.plexus.velocity.ContextClassLoaderResourceLoader'.
[INFO] Setting property: velocimacro.messages.on => 'false'.
[INFO] Setting property: resource.loader => 'classpath'.
[INFO] Setting property: resource.manager.logwhenfound => 'false'.
[INFO] 
[INFO] --- maven-antrun-plugin:1.3:run (default) @ pdfbox ---
[INFO] Executing tasks

find.adobefiles:

get.adobefiles:

testexist:

downloadfile:
    [unjar] Expanding: <https://builds.apache.org/hudson/job/PDFBox-trunk/ws/trunk/pdfbox/download/pcfi-2010.08.09.jar> into <https://builds.apache.org/hudson/job/PDFBox-trunk/ws/trunk/pdfbox/target/classes/org/apache/pdfbox/resources/afm>
    [unjar] Expanding: <https://builds.apache.org/hudson/job/PDFBox-trunk/ws/trunk/pdfbox/download/pcfi-2010.08.09.jar> into <https://builds.apache.org/hudson/job/PDFBox-trunk/ws/trunk/pdfbox/target/classes/org/apache/pdfbox/resources>
[INFO] Executed tasks
[INFO] 
[INFO] --- maven-resources-plugin:2.3:resources (default-resources) @ pdfbox ---
[INFO] Using 'ISO-8859-1' encoding to copy filtered resources.
[INFO] Copying 191 resources
[INFO] Copying 3 resources
[INFO] 
[INFO] --- maven-compiler-plugin:2.0.2:compile (default-compile) @ pdfbox ---
[INFO] Compiling 482 source files to <https://builds.apache.org/hudson/job/PDFBox-trunk/ws/trunk/pdfbox/target/classes>
mojoFailed org.apache.maven.plugins:maven-compiler-plugin:2.0.2(default-compile)
projectFailed org.apache.pdfbox:pdfbox:1.6.0-SNAPSHOT
[JENKINS] Archiving <https://builds.apache.org/hudson/job/PDFBox-trunk/ws/trunk/pdfbox/pom.xml> to /home/hudson/hudson/jobs/PDFBox-trunk/modules/org.apache.pdfbox$pdfbox/builds/2011-05-01_15-03-18/archive/org.apache.pdfbox/pdfbox/1.6.0-SNAPSHOT/pdfbox-1.6.0-SNAPSHOT.pom
sessionEnded
[INFO] ------------------------------------------------------------------------
[INFO] Reactor Summary:
[INFO] 
[INFO] PDFBox parent ..................................... SUCCESS [8.463s]
[INFO] Apache FontBox .................................... SUCCESS [16.948s]
[INFO] Apache JempBox .................................... SUCCESS [6.520s]
[INFO] Apache PDFBox ..................................... FAILURE [32.600s]
[INFO] Apache PDFBox for Lucene .......................... SKIPPED
[INFO] Apache PDFBox for Ant ............................. SKIPPED
[INFO] Apache PDFBox webapp .............................. SKIPPED
[INFO] Apache PDFBox application ......................... SKIPPED
[INFO] PDFBox reactor .................................... SKIPPED
[INFO] ------------------------------------------------------------------------
[INFO] BUILD FAILURE
[INFO] ------------------------------------------------------------------------
[INFO] Total time: 1:08.811s
[INFO] Finished at: Sun May 01 11:04:33 EDT 2011
[INFO] Final Memory: 24M/188M
[INFO] ------------------------------------------------------------------------
mavenExecutionResult exceptions not empty
org.apache.maven.lifecycle.LifecycleExecutionException: Failed to execute goal org.apache.maven.plugins:maven-compiler-plugin:2.0.2:compile (default-compile) on project pdfbox: Compilation failure
	at org.apache.maven.lifecycle.internal.MojoExecutor.execute(MojoExecutor.java:213)
	at org.apache.maven.lifecycle.internal.MojoExecutor.execute(MojoExecutor.java:153)
	at org.apache.maven.lifecycle.internal.MojoExecutor.execute(MojoExecutor.java:145)
	at org.apache.maven.lifecycle.internal.LifecycleModuleBuilder.buildProject(LifecycleModuleBuilder.java:84)
	at org.apache.maven.lifecycle.internal.LifecycleModuleBuilder.buildProject(LifecycleModuleBuilder.java:59)
	at org.apache.maven.lifecycle.internal.LifecycleStarter.singleThreadedBuild(LifecycleStarter.java:183)
	at org.apache.maven.lifecycle.internal.LifecycleStarter.execute(LifecycleStarter.java:161)
	at org.apache.maven.DefaultMaven.doExecute(DefaultMaven.java:319)
	at org.apache.maven.DefaultMaven.execute(DefaultMaven.java:156)
	at org.jvnet.hudson.maven3.launcher.Maven3Launcher.main(Maven3Launcher.java:79)
	at sun.reflect.NativeMethodAccessorImpl.invoke0(Native Method)
	at sun.reflect.NativeMethodAccessorImpl.invoke(NativeMethodAccessorImpl.java:39)
	at sun.reflect.DelegatingMethodAccessorImpl.invoke(DelegatingMethodAccessorImpl.java:25)
	at java.lang.reflect.Method.invoke(Method.java:592)
	at org.codehaus.plexus.classworlds.launcher.Launcher.launchStandard(Launcher.java:329)
	at org.codehaus.plexus.classworlds.launcher.Launcher.launch(Launcher.java:239)
	at org.jvnet.hudson.maven3.agent.Maven3Main.launch(Maven3Main.java:146)
	at hudson.maven.Maven3Builder.call(Maven3Builder.java:126)
	at hudson.maven.Maven3Builder.call(Maven3Builder.java:73)
	at hudson.remoting.UserRequest.perform(UserRequest.java:118)
	at hudson.remoting.UserRequest.perform(UserRequest.java:48)
	at hudson.remoting.Request$2.run(Request.java:270)
	at java.util.concurrent.Executors$RunnableAdapter.call(Executors.java:417)
	at java.util.concurrent.FutureTask$Sync.innerRun(FutureTask.java:269)
	at java.util.concurrent.FutureTask.run(FutureTask.java:123)
	at java.util.concurrent.ThreadPoolExecutor$Worker.runTask(ThreadPoolExecutor.java:651)
	at java.util.concurrent.ThreadPoolExecutor$Worker.run(ThreadPoolExecutor.java:676)
	at java.lang.Thread.run(Thread.java:595)
Caused by: org.apache.maven.plugin.CompilationFailureException: Compilation failure
	at org.apache.maven.plugin.AbstractCompilerMojo.execute(AbstractCompilerMojo.java:516)
	at org.apache.maven.plugin.CompilerMojo.execute(CompilerMojo.java:114)
	at org.apache.maven.plugin.DefaultBuildPluginManager.executeMojo(DefaultBuildPluginManager.java:101)
	at org.apache.maven.lifecycle.internal.MojoExecutor.execute(MojoExecutor.java:209)
	... 27 more
Sending e-mails to: dev@pdfbox.apache.org
channel stopped
Archiving artifacts