You are viewing a plain text version of this content. The canonical link for it is here.
Posted to builds@beam.apache.org by Apache Jenkins Server <je...@builds.apache.org> on 2023/02/11 23:41:34 UTC

Build failed in Jenkins: beam_PostCommit_Python38 #3729

See <https://ci-beam.apache.org/job/beam_PostCommit_Python38/3729/display/redirect?page=changes>

Changes:

[noreply] Add support for loading torchscript models (#25321)

[noreply] [#24971] Add a retry policy for JmsIO #24971 (#24973)


------------------------------------------
[...truncated 10.46 MB...]
../../build/gradleenv/-1734967051/lib/python3.8/site-packages/tenacity/_asyncio.py:42
../../build/gradleenv/-1734967051/lib/python3.8/site-packages/tenacity/_asyncio.py:42
../../build/gradleenv/-1734967051/lib/python3.8/site-packages/tenacity/_asyncio.py:42
../../build/gradleenv/-1734967051/lib/python3.8/site-packages/tenacity/_asyncio.py:42
../../build/gradleenv/-1734967051/lib/python3.8/site-packages/tenacity/_asyncio.py:42
../../build/gradleenv/-1734967051/lib/python3.8/site-packages/tenacity/_asyncio.py:42
  <https://ci-beam.apache.org/job/beam_PostCommit_Python38/ws/src/build/gradleenv/-1734967051/lib/python3.8/site-packages/tenacity/_asyncio.py>:42: DeprecationWarning: "@coroutine" decorator is deprecated since Python 3.8, use "async def" instead
    def call(self, fn, *args, **kwargs):

apache_beam/typehints/pandas_type_compatibility_test.py:67
apache_beam/typehints/pandas_type_compatibility_test.py:67
apache_beam/typehints/pandas_type_compatibility_test.py:67
apache_beam/typehints/pandas_type_compatibility_test.py:67
apache_beam/typehints/pandas_type_compatibility_test.py:67
apache_beam/typehints/pandas_type_compatibility_test.py:67
apache_beam/typehints/pandas_type_compatibility_test.py:67
apache_beam/typehints/pandas_type_compatibility_test.py:67
  <https://ci-beam.apache.org/job/beam_PostCommit_Python38/ws/src/sdks/python/apache_beam/typehints/pandas_type_compatibility_test.py>:67: FutureWarning: pandas.Int64Index is deprecated and will be removed from pandas in a future version. Use pandas.Index with the appropriate dtype instead.
    }).set_index(pd.Int64Index(range(123, 223), name='an_index')),

apache_beam/typehints/pandas_type_compatibility_test.py:90
apache_beam/typehints/pandas_type_compatibility_test.py:90
apache_beam/typehints/pandas_type_compatibility_test.py:90
apache_beam/typehints/pandas_type_compatibility_test.py:90
apache_beam/typehints/pandas_type_compatibility_test.py:90
apache_beam/typehints/pandas_type_compatibility_test.py:90
apache_beam/typehints/pandas_type_compatibility_test.py:90
apache_beam/typehints/pandas_type_compatibility_test.py:90
  <https://ci-beam.apache.org/job/beam_PostCommit_Python38/ws/src/sdks/python/apache_beam/typehints/pandas_type_compatibility_test.py>:90: FutureWarning: pandas.Int64Index is deprecated and will be removed from pandas in a future version. Use pandas.Index with the appropriate dtype instead.
    pd.Int64Index(range(123, 223), name='an_index'),

apache_beam/typehints/pandas_type_compatibility_test.py:91
apache_beam/typehints/pandas_type_compatibility_test.py:91
apache_beam/typehints/pandas_type_compatibility_test.py:91
apache_beam/typehints/pandas_type_compatibility_test.py:91
apache_beam/typehints/pandas_type_compatibility_test.py:91
apache_beam/typehints/pandas_type_compatibility_test.py:91
apache_beam/typehints/pandas_type_compatibility_test.py:91
apache_beam/typehints/pandas_type_compatibility_test.py:91
  <https://ci-beam.apache.org/job/beam_PostCommit_Python38/ws/src/sdks/python/apache_beam/typehints/pandas_type_compatibility_test.py>:91: FutureWarning: pandas.Int64Index is deprecated and will be removed from pandas in a future version. Use pandas.Index with the appropriate dtype instead.
    pd.Int64Index(range(475, 575), name='another_index'),

apache_beam/dataframe/io_it_test.py: 3 warnings
apache_beam/examples/cookbook/bigquery_tornadoes_it_test.py: 1 warning
apache_beam/examples/dataframe/flight_delays_it_test.py: 1 warning
apache_beam/io/gcp/bigquery_io_read_it_test.py: 2 warnings
apache_beam/io/gcp/bigquery_read_it_test.py: 7 warnings
apache_beam/io/gcp/bigquery_json_it_test.py: 3 warnings
apache_beam/io/gcp/big_query_query_to_table_it_test.py: 4 warnings
  <https://ci-beam.apache.org/job/beam_PostCommit_Python38/ws/src/sdks/python/apache_beam/io/gcp/bigquery.py>:2485: BeamDeprecationWarning: options is deprecated since First stable release. References to <pipeline>.options will not be supported
    temp_location = pcoll.pipeline.options.view_as(

apache_beam/dataframe/io_it_test.py: 3 warnings
apache_beam/examples/cookbook/bigquery_tornadoes_it_test.py: 1 warning
apache_beam/examples/dataframe/flight_delays_it_test.py: 1 warning
apache_beam/io/gcp/bigquery_io_read_it_test.py: 2 warnings
apache_beam/io/gcp/bigquery_read_it_test.py: 7 warnings
apache_beam/io/gcp/bigquery_json_it_test.py: 3 warnings
apache_beam/io/gcp/big_query_query_to_table_it_test.py: 4 warnings
  <https://ci-beam.apache.org/job/beam_PostCommit_Python38/ws/src/sdks/python/apache_beam/io/gcp/bigquery.py>:2487: BeamDeprecationWarning: options is deprecated since First stable release. References to <pipeline>.options will not be supported
    job_name = pcoll.pipeline.options.view_as(GoogleCloudOptions).job_name

apache_beam/dataframe/io_it_test.py: 3 warnings
apache_beam/examples/cookbook/bigquery_tornadoes_it_test.py: 1 warning
apache_beam/examples/dataframe/flight_delays_it_test.py: 1 warning
apache_beam/io/gcp/bigquery_io_read_it_test.py: 2 warnings
apache_beam/io/gcp/bigquery_read_it_test.py: 7 warnings
apache_beam/io/gcp/bigquery_json_it_test.py: 3 warnings
apache_beam/io/gcp/big_query_query_to_table_it_test.py: 4 warnings
  <https://ci-beam.apache.org/job/beam_PostCommit_Python38/ws/src/sdks/python/apache_beam/io/gcp/bigquery.py>:2511: BeamDeprecationWarning: options is deprecated since First stable release. References to <pipeline>.options will not be supported
    pipeline_options=pcoll.pipeline.options,

apache_beam/examples/complete/game/game_stats_it_test.py::GameStatsIT::test_game_stats_it
apache_beam/examples/complete/game/hourly_team_score_it_test.py::HourlyTeamScoreIT::test_hourly_team_score_it
apache_beam/examples/complete/game/leader_board_it_test.py::LeaderBoardIT::test_leader_board_it
apache_beam/io/gcp/bigquery_test.py::PubSubBigQueryIT::test_file_loads
apache_beam/io/gcp/bigquery_test.py::PubSubBigQueryIT::test_streaming_inserts
  <https://ci-beam.apache.org/job/beam_PostCommit_Python38/ws/src/sdks/python/apache_beam/io/gcp/tests/utils.py>:63: PendingDeprecationWarning: Client.dataset is deprecated and will be removed in a future version. Use a string like 'my_project.my_dataset' or a cloud.google.bigquery.DatasetReference object, instead.
    dataset_ref = client.dataset(unique_dataset_name, project=project)

apache_beam/examples/complete/game/game_stats_it_test.py: 2 warnings
apache_beam/examples/cookbook/bigquery_tornadoes_it_test.py: 1 warning
apache_beam/examples/complete/game/hourly_team_score_it_test.py: 1 warning
apache_beam/examples/complete/game/leader_board_it_test.py: 2 warnings
apache_beam/io/gcp/bigquery_file_loads_test.py: 3 warnings
apache_beam/io/gcp/bigquery_test.py: 6 warnings
apache_beam/io/gcp/bigquery_write_it_test.py: 4 warnings
apache_beam/io/gcp/bigquery_json_it_test.py: 2 warnings
apache_beam/io/gcp/big_query_query_to_table_it_test.py: 4 warnings
  <https://ci-beam.apache.org/job/beam_PostCommit_Python38/ws/src/sdks/python/apache_beam/io/gcp/bigquery.py>:1992: BeamDeprecationWarning: options is deprecated since First stable release. References to <pipeline>.options will not be supported
    is_streaming_pipeline = p.options.view_as(StandardOptions).streaming

apache_beam/examples/complete/game/game_stats_it_test.py: 2 warnings
apache_beam/examples/cookbook/bigquery_tornadoes_it_test.py: 1 warning
apache_beam/examples/complete/game/hourly_team_score_it_test.py: 1 warning
apache_beam/examples/complete/game/leader_board_it_test.py: 2 warnings
apache_beam/io/gcp/bigquery_file_loads_test.py: 3 warnings
apache_beam/io/gcp/bigquery_test.py: 6 warnings
apache_beam/io/gcp/bigquery_write_it_test.py: 4 warnings
apache_beam/io/gcp/bigquery_json_it_test.py: 2 warnings
apache_beam/io/gcp/big_query_query_to_table_it_test.py: 4 warnings
  <https://ci-beam.apache.org/job/beam_PostCommit_Python38/ws/src/sdks/python/apache_beam/io/gcp/bigquery.py>:1998: BeamDeprecationWarning: options is deprecated since First stable release. References to <pipeline>.options will not be supported
    experiments = p.options.view_as(DebugOptions).experiments or []

apache_beam/examples/cookbook/bigquery_tornadoes_it_test.py: 1 warning
apache_beam/io/gcp/bigquery_write_it_test.py: 4 warnings
apache_beam/io/gcp/bigquery_test.py: 2 warnings
apache_beam/io/gcp/big_query_query_to_table_it_test.py: 4 warnings
  <https://ci-beam.apache.org/job/beam_PostCommit_Python38/ws/src/sdks/python/apache_beam/io/gcp/bigquery.py>:1988: BeamDeprecationWarning: options is deprecated since First stable release. References to <pipeline>.options will not be supported
    self.table_reference.projectId = pcoll.pipeline.options.view_as(

apache_beam/examples/cookbook/bigquery_tornadoes_it_test.py: 1 warning
apache_beam/io/gcp/bigquery_file_loads_test.py: 3 warnings
apache_beam/io/gcp/bigquery_write_it_test.py: 3 warnings
apache_beam/io/gcp/bigquery_test.py: 3 warnings
apache_beam/io/gcp/big_query_query_to_table_it_test.py: 4 warnings
  <https://ci-beam.apache.org/job/beam_PostCommit_Python38/ws/src/sdks/python/apache_beam/io/gcp/bigquery_file_loads.py>:1166: BeamDeprecationWarning: options is deprecated since First stable release. References to <pipeline>.options will not be supported
    self.project = self.project or p.options.view_as(GoogleCloudOptions).project

apache_beam/examples/cookbook/bigquery_tornadoes_it_test.py: 1 warning
apache_beam/examples/complete/game/hourly_team_score_it_test.py: 1 warning
apache_beam/io/gcp/bigquery_file_loads_test.py: 3 warnings
apache_beam/io/gcp/bigquery_write_it_test.py: 3 warnings
apache_beam/io/gcp/bigquery_test.py: 3 warnings
apache_beam/io/gcp/big_query_query_to_table_it_test.py: 4 warnings
  <https://ci-beam.apache.org/job/beam_PostCommit_Python38/ws/src/sdks/python/apache_beam/io/gcp/bigquery_file_loads.py>:1173: BeamDeprecationWarning: options is deprecated since First stable release. References to <pipeline>.options will not be supported
    temp_location = p.options.view_as(GoogleCloudOptions).temp_location

apache_beam/examples/cookbook/bigquery_tornadoes_it_test.py: 1 warning
apache_beam/examples/complete/game/hourly_team_score_it_test.py: 1 warning
apache_beam/io/gcp/bigquery_file_loads_test.py: 3 warnings
apache_beam/io/gcp/bigquery_write_it_test.py: 3 warnings
apache_beam/io/gcp/bigquery_test.py: 3 warnings
apache_beam/io/gcp/big_query_query_to_table_it_test.py: 4 warnings
  <https://ci-beam.apache.org/job/beam_PostCommit_Python38/ws/src/sdks/python/apache_beam/io/gcp/bigquery_file_loads.py>:1175: BeamDeprecationWarning: options is deprecated since First stable release. References to <pipeline>.options will not be supported
    p.options.view_as(GoogleCloudOptions).job_name or 'AUTOMATIC_JOB_NAME')

apache_beam/examples/cookbook/bigquery_tornadoes_it_test.py::BigqueryTornadoesIT::test_bigquery_tornadoes_it
  <https://ci-beam.apache.org/job/beam_PostCommit_Python38/ws/src/sdks/python/apache_beam/io/gcp/tests/utils.py>:100: PendingDeprecationWarning: Client.dataset is deprecated and will be removed in a future version. Use a string like 'my_project.my_dataset' or a cloud.google.bigquery.DatasetReference object, instead.
    table_ref = client.dataset(dataset_id).table(table_id)

apache_beam/dataframe/io_it_test.py: 2 warnings
apache_beam/io/gcp/bigquery_json_it_test.py: 1 warning
apache_beam/io/gcp/bigquery_read_it_test.py: 9 warnings
  <https://ci-beam.apache.org/job/beam_PostCommit_Python38/ws/src/sdks/python/apache_beam/io/gcp/bigquery.py>:2529: BeamDeprecationWarning: options is deprecated since First stable release. References to <pipeline>.options will not be supported
    project_id = pcoll.pipeline.options.view_as(GoogleCloudOptions).project

apache_beam/dataframe/io_it_test.py: 2 warnings
apache_beam/io/gcp/bigquery_json_it_test.py: 1 warning
apache_beam/io/gcp/bigquery_read_it_test.py: 9 warnings
  <https://ci-beam.apache.org/job/beam_PostCommit_Python38/ws/src/sdks/python/apache_beam/io/gcp/bigquery.py>:2550: BeamDeprecationWarning: options is deprecated since First stable release. References to <pipeline>.options will not be supported
    pipeline_options=pcoll.pipeline.options,

apache_beam/examples/dataframe/flight_delays_it_test.py::FlightDelaysTest::test_flight_delays
  <https://ci-beam.apache.org/job/beam_PostCommit_Python38/ws/src/sdks/python/apache_beam/examples/dataframe/flight_delays.py>:47: FutureWarning: The default value of numeric_only in DataFrame.mean is deprecated. In a future version, it will default to False. In addition, specifying 'numeric_only=None' is deprecated. Select only valid columns or specify the value of numeric_only to silence this warning.
    return airline_df[at_top_airports].mean()

apache_beam/examples/dataframe/flight_delays_it_test.py::FlightDelaysTest::test_flight_delays
apache_beam/examples/dataframe/taxiride_it_test.py::TaxirideIT::test_aggregation
apache_beam/examples/dataframe/taxiride_it_test.py::TaxirideIT::test_enrich
  <https://ci-beam.apache.org/job/beam_PostCommit_Python38/ws/src/sdks/python/apache_beam/dataframe/io.py>:659: FutureWarning: WriteToFiles is experimental.
    return pcoll | fileio.WriteToFiles(

apache_beam/examples/dataframe/flight_delays_it_test.py::FlightDelaysTest::test_flight_delays
apache_beam/examples/dataframe/taxiride_it_test.py::TaxirideIT::test_aggregation
apache_beam/examples/dataframe/taxiride_it_test.py::TaxirideIT::test_enrich
  <https://ci-beam.apache.org/job/beam_PostCommit_Python38/ws/src/sdks/python/apache_beam/io/fileio.py>:591: BeamDeprecationWarning: options is deprecated since First stable release. References to <pipeline>.options will not be supported
    p.options.view_as(GoogleCloudOptions).temp_location or

apache_beam/io/gcp/bigquery_test.py::BigQueryStreamingInsertTransformIntegrationTests::test_multiple_destinations_transform
  <https://ci-beam.apache.org/job/beam_PostCommit_Python38/ws/src/sdks/python/apache_beam/io/gcp/bigquery_test.py>:1690: BeamDeprecationWarning: options is deprecated since First stable release. References to <pipeline>.options will not be supported
    streaming = self.test_pipeline.options.view_as(StandardOptions).streaming

apache_beam/io/gcp/bigquery_read_it_test.py::ReadTests::test_native_source
  <https://ci-beam.apache.org/job/beam_PostCommit_Python38/ws/src/sdks/python/apache_beam/io/gcp/bigquery_read_it_test.py>:170: BeamDeprecationWarning: BigQuerySource is deprecated since 2.25.0. Use ReadFromBigQuery instead.
    beam.io.BigQuerySource(query=self.query, use_standard_sql=True)))

apache_beam/ml/gcp/cloud_dlp_it_test.py::CloudDLPIT::test_deidentification
  <https://ci-beam.apache.org/job/beam_PostCommit_Python38/ws/src/sdks/python/apache_beam/ml/gcp/cloud_dlp_it_test.py>:74: FutureWarning: MaskDetectedDetails is experimental.
    | MaskDetectedDetails(

apache_beam/ml/gcp/cloud_dlp_it_test.py::CloudDLPIT::test_inspection
  <https://ci-beam.apache.org/job/beam_PostCommit_Python38/ws/src/sdks/python/apache_beam/ml/gcp/cloud_dlp_it_test.py>:85: FutureWarning: InspectForDetails is experimental.
    | InspectForDetails(

apache_beam/ml/inference/sklearn_inference_it_test.py::SklearnInference::test_sklearn_regression
  <https://ci-beam.apache.org/job/beam_PostCommit_Python38/ws/src/sdks/python/apache_beam/examples/inference/sklearn_japanese_housing_regression.py>:128: FutureWarning: SklearnModelHandlerPandas is experimental. No backwards-compatibility guarantees.
    model_loader = SklearnModelHandlerPandas(

apache_beam/ml/inference/sklearn_inference_it_test.py::SklearnInference::test_sklearn_regression
  <https://ci-beam.apache.org/job/beam_PostCommit_Python38/ws/src/build/gradleenv/-1734967051/lib/python3.8/site-packages/dill/_dill.py>:472: FutureWarning: SklearnModelHandlerPandas is experimental. No backwards-compatibility guarantees.
    obj = StockUnpickler.load(self)

apache_beam/io/gcp/bigquery_read_it_test.py::ReadNewTypesTests::test_native_source
  <https://ci-beam.apache.org/job/beam_PostCommit_Python38/ws/src/sdks/python/apache_beam/io/gcp/bigquery_read_it_test.py>:693: BeamDeprecationWarning: BigQuerySource is deprecated since 2.25.0. Use ReadFromBigQuery instead.
    beam.io.BigQuerySource(query=self.query, use_standard_sql=True)))

apache_beam/io/gcp/bigquery_read_it_test.py::ReadAllBQTests::test_read_queries
  <https://ci-beam.apache.org/job/beam_PostCommit_Python38/ws/src/sdks/python/apache_beam/io/gcp/bigquery_read_it_test.py>:808: FutureWarning: ReadAllFromBigQuery is experimental.
    | beam.io.ReadAllFromBigQuery())

apache_beam/io/gcp/bigquery_read_it_test.py::ReadAllBQTests::test_read_queries
  <https://ci-beam.apache.org/job/beam_PostCommit_Python38/ws/src/sdks/python/apache_beam/io/gcp/bigquery.py>:2658: BeamDeprecationWarning: options is deprecated since First stable release. References to <pipeline>.options will not be supported
    job_name = pcoll.pipeline.options.view_as(GoogleCloudOptions).job_name

apache_beam/io/gcp/bigquery_read_it_test.py::ReadAllBQTests::test_read_queries
  <https://ci-beam.apache.org/job/beam_PostCommit_Python38/ws/src/sdks/python/apache_beam/io/gcp/bigquery.py>:2659: BeamDeprecationWarning: options is deprecated since First stable release. References to <pipeline>.options will not be supported
    project = pcoll.pipeline.options.view_as(GoogleCloudOptions).project

apache_beam/io/gcp/bigquery_read_it_test.py::ReadAllBQTests::test_read_queries
  <https://ci-beam.apache.org/job/beam_PostCommit_Python38/ws/src/sdks/python/apache_beam/io/gcp/bigquery.py>:2672: BeamDeprecationWarning: options is deprecated since First stable release. References to <pipeline>.options will not be supported
    options=pcoll.pipeline.options,

-- Docs: https://docs.pytest.org/en/stable/how-to/capture-warnings.html
- generated xml file: <https://ci-beam.apache.org/job/beam_PostCommit_Python38/ws/src/sdks/python/pytest_postCommitIT-df-py38.xml> -
========== 85 passed, 24 skipped, 257 warnings in 11315.49s (3:08:35) ==========

FAILURE: Build failed with an exception.

* Where:
Script '<https://ci-beam.apache.org/job/beam_PostCommit_Python38/ws/src/sdks/python/test-suites/direct/common.gradle'> line: 185

* What went wrong:
Execution failed for task ':sdks:python:test-suites:direct:py38:hdfsIntegrationTest'.
> Process 'command 'sh'' finished with non-zero exit value 1

* Try:
> Run with --stacktrace option to get the stack trace.
> Run with --info or --debug option to get more log output.

* Get more help at https://help.gradle.org

Deprecated Gradle features were used in this build, making it incompatible with Gradle 8.0.

You can use '--warning-mode all' to show the individual deprecation warnings and determine if they come from your own scripts or plugins.

See https://docs.gradle.org/7.5.1/userguide/command_line_interface.html#sec:command_line_warnings

Execution optimizations have been disabled for 1 invalid unit(s) of work during this build to ensure correctness.
Please consult deprecation warnings for more details.

BUILD FAILED in 3h 25m 59s
205 actionable tasks: 141 executed, 58 from cache, 6 up-to-date

Publishing build scan...
https://gradle.com/s/qpiwvgi6wyeba

Build step 'Invoke Gradle script' changed build result to FAILURE
Build step 'Invoke Gradle script' marked build as failure

---------------------------------------------------------------------
To unsubscribe, e-mail: builds-unsubscribe@beam.apache.org
For additional commands, e-mail: builds-help@beam.apache.org


Jenkins build is back to normal : beam_PostCommit_Python38 #3741

Posted by Apache Jenkins Server <je...@builds.apache.org>.
See <https://ci-beam.apache.org/job/beam_PostCommit_Python38/3741/display/redirect?page=changes>


---------------------------------------------------------------------
To unsubscribe, e-mail: builds-unsubscribe@beam.apache.org
For additional commands, e-mail: builds-help@beam.apache.org


Build failed in Jenkins: beam_PostCommit_Python38 #3740

Posted by Apache Jenkins Server <je...@builds.apache.org>.
See <https://ci-beam.apache.org/job/beam_PostCommit_Python38/3740/display/redirect>

Changes:


------------------------------------------
[...truncated 879.65 KB...]

../../build/gradleenv/-1734967051/lib/python3.8/site-packages/tenacity/_asyncio.py:42
../../build/gradleenv/-1734967051/lib/python3.8/site-packages/tenacity/_asyncio.py:42
../../build/gradleenv/-1734967051/lib/python3.8/site-packages/tenacity/_asyncio.py:42
../../build/gradleenv/-1734967051/lib/python3.8/site-packages/tenacity/_asyncio.py:42
../../build/gradleenv/-1734967051/lib/python3.8/site-packages/tenacity/_asyncio.py:42
../../build/gradleenv/-1734967051/lib/python3.8/site-packages/tenacity/_asyncio.py:42
../../build/gradleenv/-1734967051/lib/python3.8/site-packages/tenacity/_asyncio.py:42
../../build/gradleenv/-1734967051/lib/python3.8/site-packages/tenacity/_asyncio.py:42
  <https://ci-beam.apache.org/job/beam_PostCommit_Python38/ws/src/build/gradleenv/-1734967051/lib/python3.8/site-packages/tenacity/_asyncio.py>:42: DeprecationWarning: "@coroutine" decorator is deprecated since Python 3.8, use "async def" instead
    def call(self, fn, *args, **kwargs):

apache_beam/typehints/pandas_type_compatibility_test.py:67
apache_beam/typehints/pandas_type_compatibility_test.py:67
apache_beam/typehints/pandas_type_compatibility_test.py:67
apache_beam/typehints/pandas_type_compatibility_test.py:67
apache_beam/typehints/pandas_type_compatibility_test.py:67
apache_beam/typehints/pandas_type_compatibility_test.py:67
apache_beam/typehints/pandas_type_compatibility_test.py:67
apache_beam/typehints/pandas_type_compatibility_test.py:67
  <https://ci-beam.apache.org/job/beam_PostCommit_Python38/ws/src/sdks/python/apache_beam/typehints/pandas_type_compatibility_test.py>:67: FutureWarning: pandas.Int64Index is deprecated and will be removed from pandas in a future version. Use pandas.Index with the appropriate dtype instead.
    }).set_index(pd.Int64Index(range(123, 223), name='an_index')),

apache_beam/typehints/pandas_type_compatibility_test.py:90
apache_beam/typehints/pandas_type_compatibility_test.py:90
apache_beam/typehints/pandas_type_compatibility_test.py:90
apache_beam/typehints/pandas_type_compatibility_test.py:90
apache_beam/typehints/pandas_type_compatibility_test.py:90
apache_beam/typehints/pandas_type_compatibility_test.py:90
apache_beam/typehints/pandas_type_compatibility_test.py:90
apache_beam/typehints/pandas_type_compatibility_test.py:90
  <https://ci-beam.apache.org/job/beam_PostCommit_Python38/ws/src/sdks/python/apache_beam/typehints/pandas_type_compatibility_test.py>:90: FutureWarning: pandas.Int64Index is deprecated and will be removed from pandas in a future version. Use pandas.Index with the appropriate dtype instead.
    pd.Int64Index(range(123, 223), name='an_index'),

apache_beam/typehints/pandas_type_compatibility_test.py:91
apache_beam/typehints/pandas_type_compatibility_test.py:91
apache_beam/typehints/pandas_type_compatibility_test.py:91
apache_beam/typehints/pandas_type_compatibility_test.py:91
apache_beam/typehints/pandas_type_compatibility_test.py:91
apache_beam/typehints/pandas_type_compatibility_test.py:91
apache_beam/typehints/pandas_type_compatibility_test.py:91
apache_beam/typehints/pandas_type_compatibility_test.py:91
  <https://ci-beam.apache.org/job/beam_PostCommit_Python38/ws/src/sdks/python/apache_beam/typehints/pandas_type_compatibility_test.py>:91: FutureWarning: pandas.Int64Index is deprecated and will be removed from pandas in a future version. Use pandas.Index with the appropriate dtype instead.
    pd.Int64Index(range(475, 575), name='another_index'),

apache_beam/dataframe/io_it_test.py: 3 warnings
apache_beam/examples/cookbook/bigquery_tornadoes_it_test.py: 1 warning
apache_beam/examples/dataframe/flight_delays_it_test.py: 1 warning
apache_beam/io/gcp/bigquery_io_read_it_test.py: 2 warnings
apache_beam/io/gcp/bigquery_read_it_test.py: 7 warnings
apache_beam/io/gcp/big_query_query_to_table_it_test.py: 4 warnings
apache_beam/io/gcp/bigquery_json_it_test.py: 3 warnings
  <https://ci-beam.apache.org/job/beam_PostCommit_Python38/ws/src/sdks/python/apache_beam/io/gcp/bigquery.py>:2485: BeamDeprecationWarning: options is deprecated since First stable release. References to <pipeline>.options will not be supported
    temp_location = pcoll.pipeline.options.view_as(

apache_beam/dataframe/io_it_test.py: 3 warnings
apache_beam/examples/cookbook/bigquery_tornadoes_it_test.py: 1 warning
apache_beam/examples/dataframe/flight_delays_it_test.py: 1 warning
apache_beam/io/gcp/bigquery_io_read_it_test.py: 2 warnings
apache_beam/io/gcp/bigquery_read_it_test.py: 7 warnings
apache_beam/io/gcp/big_query_query_to_table_it_test.py: 4 warnings
apache_beam/io/gcp/bigquery_json_it_test.py: 3 warnings
  <https://ci-beam.apache.org/job/beam_PostCommit_Python38/ws/src/sdks/python/apache_beam/io/gcp/bigquery.py>:2487: BeamDeprecationWarning: options is deprecated since First stable release. References to <pipeline>.options will not be supported
    job_name = pcoll.pipeline.options.view_as(GoogleCloudOptions).job_name

apache_beam/dataframe/io_it_test.py: 3 warnings
apache_beam/examples/cookbook/bigquery_tornadoes_it_test.py: 1 warning
apache_beam/examples/dataframe/flight_delays_it_test.py: 1 warning
apache_beam/io/gcp/bigquery_io_read_it_test.py: 2 warnings
apache_beam/io/gcp/bigquery_read_it_test.py: 7 warnings
apache_beam/io/gcp/big_query_query_to_table_it_test.py: 4 warnings
apache_beam/io/gcp/bigquery_json_it_test.py: 3 warnings
  <https://ci-beam.apache.org/job/beam_PostCommit_Python38/ws/src/sdks/python/apache_beam/io/gcp/bigquery.py>:2511: BeamDeprecationWarning: options is deprecated since First stable release. References to <pipeline>.options will not be supported
    pipeline_options=pcoll.pipeline.options,

apache_beam/examples/complete/game/game_stats_it_test.py::GameStatsIT::test_game_stats_it
apache_beam/examples/complete/game/hourly_team_score_it_test.py::HourlyTeamScoreIT::test_hourly_team_score_it
apache_beam/examples/complete/game/leader_board_it_test.py::LeaderBoardIT::test_leader_board_it
apache_beam/io/gcp/bigquery_test.py::PubSubBigQueryIT::test_file_loads
apache_beam/io/gcp/bigquery_test.py::PubSubBigQueryIT::test_streaming_inserts
  <https://ci-beam.apache.org/job/beam_PostCommit_Python38/ws/src/sdks/python/apache_beam/io/gcp/tests/utils.py>:63: PendingDeprecationWarning: Client.dataset is deprecated and will be removed in a future version. Use a string like 'my_project.my_dataset' or a cloud.google.bigquery.DatasetReference object, instead.
    dataset_ref = client.dataset(unique_dataset_name, project=project)

apache_beam/examples/complete/game/game_stats_it_test.py: 2 warnings
apache_beam/examples/cookbook/bigquery_tornadoes_it_test.py: 1 warning
apache_beam/examples/complete/game/hourly_team_score_it_test.py: 1 warning
apache_beam/examples/complete/game/leader_board_it_test.py: 2 warnings
apache_beam/io/gcp/big_query_query_to_table_it_test.py: 4 warnings
apache_beam/io/gcp/bigquery_test.py: 6 warnings
apache_beam/io/gcp/bigquery_write_it_test.py: 4 warnings
apache_beam/io/gcp/bigquery_json_it_test.py: 2 warnings
apache_beam/io/gcp/bigquery_file_loads_test.py: 3 warnings
  <https://ci-beam.apache.org/job/beam_PostCommit_Python38/ws/src/sdks/python/apache_beam/io/gcp/bigquery.py>:1992: BeamDeprecationWarning: options is deprecated since First stable release. References to <pipeline>.options will not be supported
    is_streaming_pipeline = p.options.view_as(StandardOptions).streaming

apache_beam/examples/complete/game/game_stats_it_test.py: 2 warnings
apache_beam/examples/cookbook/bigquery_tornadoes_it_test.py: 1 warning
apache_beam/examples/complete/game/hourly_team_score_it_test.py: 1 warning
apache_beam/examples/complete/game/leader_board_it_test.py: 2 warnings
apache_beam/io/gcp/big_query_query_to_table_it_test.py: 4 warnings
apache_beam/io/gcp/bigquery_test.py: 6 warnings
apache_beam/io/gcp/bigquery_write_it_test.py: 4 warnings
apache_beam/io/gcp/bigquery_json_it_test.py: 2 warnings
apache_beam/io/gcp/bigquery_file_loads_test.py: 3 warnings
  <https://ci-beam.apache.org/job/beam_PostCommit_Python38/ws/src/sdks/python/apache_beam/io/gcp/bigquery.py>:1998: BeamDeprecationWarning: options is deprecated since First stable release. References to <pipeline>.options will not be supported
    experiments = p.options.view_as(DebugOptions).experiments or []

apache_beam/dataframe/io_it_test.py: 2 warnings
apache_beam/io/gcp/bigquery_json_it_test.py: 1 warning
apache_beam/io/gcp/bigquery_read_it_test.py: 9 warnings
  <https://ci-beam.apache.org/job/beam_PostCommit_Python38/ws/src/sdks/python/apache_beam/io/gcp/bigquery.py>:2529: BeamDeprecationWarning: options is deprecated since First stable release. References to <pipeline>.options will not be supported
    project_id = pcoll.pipeline.options.view_as(GoogleCloudOptions).project

apache_beam/dataframe/io_it_test.py: 2 warnings
apache_beam/io/gcp/bigquery_json_it_test.py: 1 warning
apache_beam/io/gcp/bigquery_read_it_test.py: 9 warnings
  <https://ci-beam.apache.org/job/beam_PostCommit_Python38/ws/src/sdks/python/apache_beam/io/gcp/bigquery.py>:2550: BeamDeprecationWarning: options is deprecated since First stable release. References to <pipeline>.options will not be supported
    pipeline_options=pcoll.pipeline.options,

apache_beam/examples/cookbook/bigquery_tornadoes_it_test.py: 1 warning
apache_beam/io/gcp/big_query_query_to_table_it_test.py: 4 warnings
apache_beam/io/gcp/bigquery_write_it_test.py: 4 warnings
apache_beam/io/gcp/bigquery_test.py: 2 warnings
  <https://ci-beam.apache.org/job/beam_PostCommit_Python38/ws/src/sdks/python/apache_beam/io/gcp/bigquery.py>:1988: BeamDeprecationWarning: options is deprecated since First stable release. References to <pipeline>.options will not be supported
    self.table_reference.projectId = pcoll.pipeline.options.view_as(

apache_beam/examples/cookbook/bigquery_tornadoes_it_test.py: 1 warning
apache_beam/io/gcp/big_query_query_to_table_it_test.py: 4 warnings
apache_beam/io/gcp/bigquery_write_it_test.py: 3 warnings
apache_beam/io/gcp/bigquery_test.py: 3 warnings
apache_beam/io/gcp/bigquery_file_loads_test.py: 3 warnings
  <https://ci-beam.apache.org/job/beam_PostCommit_Python38/ws/src/sdks/python/apache_beam/io/gcp/bigquery_file_loads.py>:1166: BeamDeprecationWarning: options is deprecated since First stable release. References to <pipeline>.options will not be supported
    self.project = self.project or p.options.view_as(GoogleCloudOptions).project

apache_beam/examples/cookbook/bigquery_tornadoes_it_test.py: 1 warning
apache_beam/examples/complete/game/hourly_team_score_it_test.py: 1 warning
apache_beam/io/gcp/big_query_query_to_table_it_test.py: 4 warnings
apache_beam/io/gcp/bigquery_write_it_test.py: 3 warnings
apache_beam/io/gcp/bigquery_test.py: 3 warnings
apache_beam/io/gcp/bigquery_file_loads_test.py: 3 warnings
  <https://ci-beam.apache.org/job/beam_PostCommit_Python38/ws/src/sdks/python/apache_beam/io/gcp/bigquery_file_loads.py>:1173: BeamDeprecationWarning: options is deprecated since First stable release. References to <pipeline>.options will not be supported
    temp_location = p.options.view_as(GoogleCloudOptions).temp_location

apache_beam/examples/cookbook/bigquery_tornadoes_it_test.py: 1 warning
apache_beam/examples/complete/game/hourly_team_score_it_test.py: 1 warning
apache_beam/io/gcp/big_query_query_to_table_it_test.py: 4 warnings
apache_beam/io/gcp/bigquery_write_it_test.py: 3 warnings
apache_beam/io/gcp/bigquery_test.py: 3 warnings
apache_beam/io/gcp/bigquery_file_loads_test.py: 3 warnings
  <https://ci-beam.apache.org/job/beam_PostCommit_Python38/ws/src/sdks/python/apache_beam/io/gcp/bigquery_file_loads.py>:1175: BeamDeprecationWarning: options is deprecated since First stable release. References to <pipeline>.options will not be supported
    p.options.view_as(GoogleCloudOptions).job_name or 'AUTOMATIC_JOB_NAME')

apache_beam/examples/cookbook/bigquery_tornadoes_it_test.py::BigqueryTornadoesIT::test_bigquery_tornadoes_it
  <https://ci-beam.apache.org/job/beam_PostCommit_Python38/ws/src/sdks/python/apache_beam/io/gcp/tests/utils.py>:100: PendingDeprecationWarning: Client.dataset is deprecated and will be removed in a future version. Use a string like 'my_project.my_dataset' or a cloud.google.bigquery.DatasetReference object, instead.
    table_ref = client.dataset(dataset_id).table(table_id)

apache_beam/examples/dataframe/flight_delays_it_test.py::FlightDelaysTest::test_flight_delays
  <https://ci-beam.apache.org/job/beam_PostCommit_Python38/ws/src/sdks/python/apache_beam/examples/dataframe/flight_delays.py>:47: FutureWarning: The default value of numeric_only in DataFrame.mean is deprecated. In a future version, it will default to False. In addition, specifying 'numeric_only=None' is deprecated. Select only valid columns or specify the value of numeric_only to silence this warning.
    return airline_df[at_top_airports].mean()

apache_beam/examples/dataframe/flight_delays_it_test.py::FlightDelaysTest::test_flight_delays
apache_beam/examples/dataframe/taxiride_it_test.py::TaxirideIT::test_aggregation
apache_beam/examples/dataframe/taxiride_it_test.py::TaxirideIT::test_enrich
  <https://ci-beam.apache.org/job/beam_PostCommit_Python38/ws/src/sdks/python/apache_beam/dataframe/io.py>:659: FutureWarning: WriteToFiles is experimental.
    return pcoll | fileio.WriteToFiles(

apache_beam/examples/dataframe/flight_delays_it_test.py::FlightDelaysTest::test_flight_delays
apache_beam/examples/dataframe/taxiride_it_test.py::TaxirideIT::test_aggregation
apache_beam/examples/dataframe/taxiride_it_test.py::TaxirideIT::test_enrich
  <https://ci-beam.apache.org/job/beam_PostCommit_Python38/ws/src/sdks/python/apache_beam/io/fileio.py>:593: BeamDeprecationWarning: options is deprecated since First stable release. References to <pipeline>.options will not be supported
    p.options.view_as(GoogleCloudOptions).temp_location or

apache_beam/io/gcp/bigquery_test.py::BigQueryStreamingInsertTransformIntegrationTests::test_multiple_destinations_transform
  <https://ci-beam.apache.org/job/beam_PostCommit_Python38/ws/src/sdks/python/apache_beam/io/gcp/bigquery_test.py>:1690: BeamDeprecationWarning: options is deprecated since First stable release. References to <pipeline>.options will not be supported
    streaming = self.test_pipeline.options.view_as(StandardOptions).streaming

apache_beam/io/gcp/bigquery_read_it_test.py::ReadTests::test_native_source
  <https://ci-beam.apache.org/job/beam_PostCommit_Python38/ws/src/sdks/python/apache_beam/io/gcp/bigquery_read_it_test.py>:170: BeamDeprecationWarning: BigQuerySource is deprecated since 2.25.0. Use ReadFromBigQuery instead.
    beam.io.BigQuerySource(query=self.query, use_standard_sql=True)))

apache_beam/ml/gcp/cloud_dlp_it_test.py::CloudDLPIT::test_deidentification
  <https://ci-beam.apache.org/job/beam_PostCommit_Python38/ws/src/sdks/python/apache_beam/ml/gcp/cloud_dlp_it_test.py>:74: FutureWarning: MaskDetectedDetails is experimental.
    | MaskDetectedDetails(

apache_beam/ml/inference/sklearn_inference_it_test.py::SklearnInference::test_sklearn_regression
  <https://ci-beam.apache.org/job/beam_PostCommit_Python38/ws/src/sdks/python/apache_beam/examples/inference/sklearn_japanese_housing_regression.py>:128: FutureWarning: SklearnModelHandlerPandas is experimental. No backwards-compatibility guarantees.
    model_loader = SklearnModelHandlerPandas(

apache_beam/ml/inference/sklearn_inference_it_test.py::SklearnInference::test_sklearn_regression
  <https://ci-beam.apache.org/job/beam_PostCommit_Python38/ws/src/build/gradleenv/-1734967051/lib/python3.8/site-packages/dill/_dill.py>:472: FutureWarning: SklearnModelHandlerPandas is experimental. No backwards-compatibility guarantees.
    obj = StockUnpickler.load(self)

apache_beam/ml/gcp/cloud_dlp_it_test.py::CloudDLPIT::test_inspection
  <https://ci-beam.apache.org/job/beam_PostCommit_Python38/ws/src/sdks/python/apache_beam/ml/gcp/cloud_dlp_it_test.py>:85: FutureWarning: InspectForDetails is experimental.
    | InspectForDetails(

apache_beam/io/gcp/bigquery_read_it_test.py::ReadNewTypesTests::test_native_source
  <https://ci-beam.apache.org/job/beam_PostCommit_Python38/ws/src/sdks/python/apache_beam/io/gcp/bigquery_read_it_test.py>:693: BeamDeprecationWarning: BigQuerySource is deprecated since 2.25.0. Use ReadFromBigQuery instead.
    beam.io.BigQuerySource(query=self.query, use_standard_sql=True)))

apache_beam/io/gcp/bigquery_read_it_test.py::ReadAllBQTests::test_read_queries
  <https://ci-beam.apache.org/job/beam_PostCommit_Python38/ws/src/sdks/python/apache_beam/io/gcp/bigquery_read_it_test.py>:808: FutureWarning: ReadAllFromBigQuery is experimental.
    | beam.io.ReadAllFromBigQuery())

apache_beam/io/gcp/bigquery_read_it_test.py::ReadAllBQTests::test_read_queries
  <https://ci-beam.apache.org/job/beam_PostCommit_Python38/ws/src/sdks/python/apache_beam/io/gcp/bigquery.py>:2658: BeamDeprecationWarning: options is deprecated since First stable release. References to <pipeline>.options will not be supported
    job_name = pcoll.pipeline.options.view_as(GoogleCloudOptions).job_name

apache_beam/io/gcp/bigquery_read_it_test.py::ReadAllBQTests::test_read_queries
  <https://ci-beam.apache.org/job/beam_PostCommit_Python38/ws/src/sdks/python/apache_beam/io/gcp/bigquery.py>:2659: BeamDeprecationWarning: options is deprecated since First stable release. References to <pipeline>.options will not be supported
    project = pcoll.pipeline.options.view_as(GoogleCloudOptions).project

apache_beam/io/gcp/bigquery_read_it_test.py::ReadAllBQTests::test_read_queries
  <https://ci-beam.apache.org/job/beam_PostCommit_Python38/ws/src/sdks/python/apache_beam/io/gcp/bigquery.py>:2672: BeamDeprecationWarning: options is deprecated since First stable release. References to <pipeline>.options will not be supported
    options=pcoll.pipeline.options,

-- Docs: https://docs.pytest.org/en/stable/how-to/capture-warnings.html
- generated xml file: <https://ci-beam.apache.org/job/beam_PostCommit_Python38/ws/src/sdks/python/pytest_postCommitIT-df-py38.xml> -
========== 85 passed, 24 skipped, 608 warnings in 11915.21s (3:18:35) ==========

FAILURE: Build failed with an exception.

* What went wrong:
Execution failed for task ':sdks:java:container:pullLicenses'.
> Process 'command './license_scripts/license_script.sh'' finished with non-zero exit value 1

* Try:
> Run with --stacktrace option to get the stack trace.
> Run with --info or --debug option to get more log output.

* Get more help at https://help.gradle.org

Deprecated Gradle features were used in this build, making it incompatible with Gradle 8.0.

You can use '--warning-mode all' to show the individual deprecation warnings and determine if they come from your own scripts or plugins.

See https://docs.gradle.org/7.5.1/userguide/command_line_interface.html#sec:command_line_warnings

Execution optimizations have been disabled for 1 invalid unit(s) of work during this build to ensure correctness.
Please consult deprecation warnings for more details.

BUILD FAILED in 3h 33m 5s
201 actionable tasks: 137 executed, 58 from cache, 6 up-to-date

Publishing build scan...
https://gradle.com/s/3dbji2nhtj2aq

Build step 'Invoke Gradle script' changed build result to FAILURE
Build step 'Invoke Gradle script' marked build as failure

---------------------------------------------------------------------
To unsubscribe, e-mail: builds-unsubscribe@beam.apache.org
For additional commands, e-mail: builds-help@beam.apache.org


Build failed in Jenkins: beam_PostCommit_Python38 #3739

Posted by Apache Jenkins Server <je...@builds.apache.org>.
See <https://ci-beam.apache.org/job/beam_PostCommit_Python38/3739/display/redirect?page=changes>

Changes:

[noreply] Remove python 3.6 references (#25445)


------------------------------------------
[...truncated 749.29 KB...]

../../build/gradleenv/-1734967051/lib/python3.8/site-packages/tenacity/_asyncio.py:42
../../build/gradleenv/-1734967051/lib/python3.8/site-packages/tenacity/_asyncio.py:42
../../build/gradleenv/-1734967051/lib/python3.8/site-packages/tenacity/_asyncio.py:42
../../build/gradleenv/-1734967051/lib/python3.8/site-packages/tenacity/_asyncio.py:42
../../build/gradleenv/-1734967051/lib/python3.8/site-packages/tenacity/_asyncio.py:42
../../build/gradleenv/-1734967051/lib/python3.8/site-packages/tenacity/_asyncio.py:42
../../build/gradleenv/-1734967051/lib/python3.8/site-packages/tenacity/_asyncio.py:42
../../build/gradleenv/-1734967051/lib/python3.8/site-packages/tenacity/_asyncio.py:42
  <https://ci-beam.apache.org/job/beam_PostCommit_Python38/ws/src/build/gradleenv/-1734967051/lib/python3.8/site-packages/tenacity/_asyncio.py>:42: DeprecationWarning: "@coroutine" decorator is deprecated since Python 3.8, use "async def" instead
    def call(self, fn, *args, **kwargs):

apache_beam/typehints/pandas_type_compatibility_test.py:67
apache_beam/typehints/pandas_type_compatibility_test.py:67
apache_beam/typehints/pandas_type_compatibility_test.py:67
apache_beam/typehints/pandas_type_compatibility_test.py:67
apache_beam/typehints/pandas_type_compatibility_test.py:67
apache_beam/typehints/pandas_type_compatibility_test.py:67
apache_beam/typehints/pandas_type_compatibility_test.py:67
apache_beam/typehints/pandas_type_compatibility_test.py:67
  <https://ci-beam.apache.org/job/beam_PostCommit_Python38/ws/src/sdks/python/apache_beam/typehints/pandas_type_compatibility_test.py>:67: FutureWarning: pandas.Int64Index is deprecated and will be removed from pandas in a future version. Use pandas.Index with the appropriate dtype instead.
    }).set_index(pd.Int64Index(range(123, 223), name='an_index')),

apache_beam/typehints/pandas_type_compatibility_test.py:90
apache_beam/typehints/pandas_type_compatibility_test.py:90
apache_beam/typehints/pandas_type_compatibility_test.py:90
apache_beam/typehints/pandas_type_compatibility_test.py:90
apache_beam/typehints/pandas_type_compatibility_test.py:90
apache_beam/typehints/pandas_type_compatibility_test.py:90
apache_beam/typehints/pandas_type_compatibility_test.py:90
apache_beam/typehints/pandas_type_compatibility_test.py:90
  <https://ci-beam.apache.org/job/beam_PostCommit_Python38/ws/src/sdks/python/apache_beam/typehints/pandas_type_compatibility_test.py>:90: FutureWarning: pandas.Int64Index is deprecated and will be removed from pandas in a future version. Use pandas.Index with the appropriate dtype instead.
    pd.Int64Index(range(123, 223), name='an_index'),

apache_beam/typehints/pandas_type_compatibility_test.py:91
apache_beam/typehints/pandas_type_compatibility_test.py:91
apache_beam/typehints/pandas_type_compatibility_test.py:91
apache_beam/typehints/pandas_type_compatibility_test.py:91
apache_beam/typehints/pandas_type_compatibility_test.py:91
apache_beam/typehints/pandas_type_compatibility_test.py:91
apache_beam/typehints/pandas_type_compatibility_test.py:91
apache_beam/typehints/pandas_type_compatibility_test.py:91
  <https://ci-beam.apache.org/job/beam_PostCommit_Python38/ws/src/sdks/python/apache_beam/typehints/pandas_type_compatibility_test.py>:91: FutureWarning: pandas.Int64Index is deprecated and will be removed from pandas in a future version. Use pandas.Index with the appropriate dtype instead.
    pd.Int64Index(range(475, 575), name='another_index'),

apache_beam/dataframe/io_it_test.py: 3 warnings
apache_beam/examples/cookbook/bigquery_tornadoes_it_test.py: 1 warning
apache_beam/examples/dataframe/flight_delays_it_test.py: 1 warning
apache_beam/io/gcp/bigquery_read_it_test.py: 7 warnings
apache_beam/io/gcp/big_query_query_to_table_it_test.py: 4 warnings
apache_beam/io/gcp/bigquery_json_it_test.py: 3 warnings
apache_beam/io/gcp/bigquery_io_read_it_test.py: 2 warnings
  <https://ci-beam.apache.org/job/beam_PostCommit_Python38/ws/src/sdks/python/apache_beam/io/gcp/bigquery.py>:2485: BeamDeprecationWarning: options is deprecated since First stable release. References to <pipeline>.options will not be supported
    temp_location = pcoll.pipeline.options.view_as(

apache_beam/dataframe/io_it_test.py: 3 warnings
apache_beam/examples/cookbook/bigquery_tornadoes_it_test.py: 1 warning
apache_beam/examples/dataframe/flight_delays_it_test.py: 1 warning
apache_beam/io/gcp/bigquery_read_it_test.py: 7 warnings
apache_beam/io/gcp/big_query_query_to_table_it_test.py: 4 warnings
apache_beam/io/gcp/bigquery_json_it_test.py: 3 warnings
apache_beam/io/gcp/bigquery_io_read_it_test.py: 2 warnings
  <https://ci-beam.apache.org/job/beam_PostCommit_Python38/ws/src/sdks/python/apache_beam/io/gcp/bigquery.py>:2487: BeamDeprecationWarning: options is deprecated since First stable release. References to <pipeline>.options will not be supported
    job_name = pcoll.pipeline.options.view_as(GoogleCloudOptions).job_name

apache_beam/dataframe/io_it_test.py: 3 warnings
apache_beam/examples/cookbook/bigquery_tornadoes_it_test.py: 1 warning
apache_beam/examples/dataframe/flight_delays_it_test.py: 1 warning
apache_beam/io/gcp/bigquery_read_it_test.py: 7 warnings
apache_beam/io/gcp/big_query_query_to_table_it_test.py: 4 warnings
apache_beam/io/gcp/bigquery_json_it_test.py: 3 warnings
apache_beam/io/gcp/bigquery_io_read_it_test.py: 2 warnings
  <https://ci-beam.apache.org/job/beam_PostCommit_Python38/ws/src/sdks/python/apache_beam/io/gcp/bigquery.py>:2511: BeamDeprecationWarning: options is deprecated since First stable release. References to <pipeline>.options will not be supported
    pipeline_options=pcoll.pipeline.options,

apache_beam/examples/complete/game/game_stats_it_test.py::GameStatsIT::test_game_stats_it
apache_beam/examples/complete/game/hourly_team_score_it_test.py::HourlyTeamScoreIT::test_hourly_team_score_it
apache_beam/examples/complete/game/leader_board_it_test.py::LeaderBoardIT::test_leader_board_it
apache_beam/io/gcp/bigquery_test.py::PubSubBigQueryIT::test_file_loads
apache_beam/io/gcp/bigquery_test.py::PubSubBigQueryIT::test_streaming_inserts
  <https://ci-beam.apache.org/job/beam_PostCommit_Python38/ws/src/sdks/python/apache_beam/io/gcp/tests/utils.py>:63: PendingDeprecationWarning: Client.dataset is deprecated and will be removed in a future version. Use a string like 'my_project.my_dataset' or a cloud.google.bigquery.DatasetReference object, instead.
    dataset_ref = client.dataset(unique_dataset_name, project=project)

apache_beam/examples/complete/game/game_stats_it_test.py: 2 warnings
apache_beam/examples/cookbook/bigquery_tornadoes_it_test.py: 1 warning
apache_beam/examples/complete/game/hourly_team_score_it_test.py: 1 warning
apache_beam/examples/complete/game/leader_board_it_test.py: 2 warnings
apache_beam/io/gcp/big_query_query_to_table_it_test.py: 4 warnings
apache_beam/io/gcp/bigquery_test.py: 6 warnings
apache_beam/io/gcp/bigquery_file_loads_test.py: 3 warnings
apache_beam/io/gcp/bigquery_write_it_test.py: 4 warnings
apache_beam/io/gcp/bigquery_json_it_test.py: 2 warnings
  <https://ci-beam.apache.org/job/beam_PostCommit_Python38/ws/src/sdks/python/apache_beam/io/gcp/bigquery.py>:1992: BeamDeprecationWarning: options is deprecated since First stable release. References to <pipeline>.options will not be supported
    is_streaming_pipeline = p.options.view_as(StandardOptions).streaming

apache_beam/examples/complete/game/game_stats_it_test.py: 2 warnings
apache_beam/examples/cookbook/bigquery_tornadoes_it_test.py: 1 warning
apache_beam/examples/complete/game/hourly_team_score_it_test.py: 1 warning
apache_beam/examples/complete/game/leader_board_it_test.py: 2 warnings
apache_beam/io/gcp/big_query_query_to_table_it_test.py: 4 warnings
apache_beam/io/gcp/bigquery_test.py: 6 warnings
apache_beam/io/gcp/bigquery_file_loads_test.py: 3 warnings
apache_beam/io/gcp/bigquery_write_it_test.py: 4 warnings
apache_beam/io/gcp/bigquery_json_it_test.py: 2 warnings
  <https://ci-beam.apache.org/job/beam_PostCommit_Python38/ws/src/sdks/python/apache_beam/io/gcp/bigquery.py>:1998: BeamDeprecationWarning: options is deprecated since First stable release. References to <pipeline>.options will not be supported
    experiments = p.options.view_as(DebugOptions).experiments or []

apache_beam/dataframe/io_it_test.py: 2 warnings
apache_beam/io/gcp/bigquery_json_it_test.py: 1 warning
apache_beam/io/gcp/bigquery_read_it_test.py: 9 warnings
  <https://ci-beam.apache.org/job/beam_PostCommit_Python38/ws/src/sdks/python/apache_beam/io/gcp/bigquery.py>:2529: BeamDeprecationWarning: options is deprecated since First stable release. References to <pipeline>.options will not be supported
    project_id = pcoll.pipeline.options.view_as(GoogleCloudOptions).project

apache_beam/dataframe/io_it_test.py: 2 warnings
apache_beam/io/gcp/bigquery_json_it_test.py: 1 warning
apache_beam/io/gcp/bigquery_read_it_test.py: 9 warnings
  <https://ci-beam.apache.org/job/beam_PostCommit_Python38/ws/src/sdks/python/apache_beam/io/gcp/bigquery.py>:2550: BeamDeprecationWarning: options is deprecated since First stable release. References to <pipeline>.options will not be supported
    pipeline_options=pcoll.pipeline.options,

apache_beam/examples/cookbook/bigquery_tornadoes_it_test.py: 1 warning
apache_beam/io/gcp/big_query_query_to_table_it_test.py: 4 warnings
apache_beam/io/gcp/bigquery_write_it_test.py: 4 warnings
apache_beam/io/gcp/bigquery_test.py: 2 warnings
  <https://ci-beam.apache.org/job/beam_PostCommit_Python38/ws/src/sdks/python/apache_beam/io/gcp/bigquery.py>:1988: BeamDeprecationWarning: options is deprecated since First stable release. References to <pipeline>.options will not be supported
    self.table_reference.projectId = pcoll.pipeline.options.view_as(

apache_beam/examples/cookbook/bigquery_tornadoes_it_test.py: 1 warning
apache_beam/io/gcp/big_query_query_to_table_it_test.py: 4 warnings
apache_beam/io/gcp/bigquery_file_loads_test.py: 3 warnings
apache_beam/io/gcp/bigquery_write_it_test.py: 3 warnings
apache_beam/io/gcp/bigquery_test.py: 3 warnings
  <https://ci-beam.apache.org/job/beam_PostCommit_Python38/ws/src/sdks/python/apache_beam/io/gcp/bigquery_file_loads.py>:1166: BeamDeprecationWarning: options is deprecated since First stable release. References to <pipeline>.options will not be supported
    self.project = self.project or p.options.view_as(GoogleCloudOptions).project

apache_beam/examples/cookbook/bigquery_tornadoes_it_test.py: 1 warning
apache_beam/examples/complete/game/hourly_team_score_it_test.py: 1 warning
apache_beam/io/gcp/big_query_query_to_table_it_test.py: 4 warnings
apache_beam/io/gcp/bigquery_file_loads_test.py: 3 warnings
apache_beam/io/gcp/bigquery_write_it_test.py: 3 warnings
apache_beam/io/gcp/bigquery_test.py: 3 warnings
  <https://ci-beam.apache.org/job/beam_PostCommit_Python38/ws/src/sdks/python/apache_beam/io/gcp/bigquery_file_loads.py>:1173: BeamDeprecationWarning: options is deprecated since First stable release. References to <pipeline>.options will not be supported
    temp_location = p.options.view_as(GoogleCloudOptions).temp_location

apache_beam/examples/cookbook/bigquery_tornadoes_it_test.py: 1 warning
apache_beam/examples/complete/game/hourly_team_score_it_test.py: 1 warning
apache_beam/io/gcp/big_query_query_to_table_it_test.py: 4 warnings
apache_beam/io/gcp/bigquery_file_loads_test.py: 3 warnings
apache_beam/io/gcp/bigquery_write_it_test.py: 3 warnings
apache_beam/io/gcp/bigquery_test.py: 3 warnings
  <https://ci-beam.apache.org/job/beam_PostCommit_Python38/ws/src/sdks/python/apache_beam/io/gcp/bigquery_file_loads.py>:1175: BeamDeprecationWarning: options is deprecated since First stable release. References to <pipeline>.options will not be supported
    p.options.view_as(GoogleCloudOptions).job_name or 'AUTOMATIC_JOB_NAME')

apache_beam/examples/cookbook/bigquery_tornadoes_it_test.py::BigqueryTornadoesIT::test_bigquery_tornadoes_it
  <https://ci-beam.apache.org/job/beam_PostCommit_Python38/ws/src/sdks/python/apache_beam/io/gcp/tests/utils.py>:100: PendingDeprecationWarning: Client.dataset is deprecated and will be removed in a future version. Use a string like 'my_project.my_dataset' or a cloud.google.bigquery.DatasetReference object, instead.
    table_ref = client.dataset(dataset_id).table(table_id)

apache_beam/examples/dataframe/flight_delays_it_test.py::FlightDelaysTest::test_flight_delays
  <https://ci-beam.apache.org/job/beam_PostCommit_Python38/ws/src/sdks/python/apache_beam/examples/dataframe/flight_delays.py>:47: FutureWarning: The default value of numeric_only in DataFrame.mean is deprecated. In a future version, it will default to False. In addition, specifying 'numeric_only=None' is deprecated. Select only valid columns or specify the value of numeric_only to silence this warning.
    return airline_df[at_top_airports].mean()

apache_beam/examples/dataframe/flight_delays_it_test.py::FlightDelaysTest::test_flight_delays
apache_beam/examples/dataframe/taxiride_it_test.py::TaxirideIT::test_aggregation
apache_beam/examples/dataframe/taxiride_it_test.py::TaxirideIT::test_enrich
  <https://ci-beam.apache.org/job/beam_PostCommit_Python38/ws/src/sdks/python/apache_beam/dataframe/io.py>:659: FutureWarning: WriteToFiles is experimental.
    return pcoll | fileio.WriteToFiles(

apache_beam/examples/dataframe/flight_delays_it_test.py::FlightDelaysTest::test_flight_delays
apache_beam/examples/dataframe/taxiride_it_test.py::TaxirideIT::test_aggregation
apache_beam/examples/dataframe/taxiride_it_test.py::TaxirideIT::test_enrich
  <https://ci-beam.apache.org/job/beam_PostCommit_Python38/ws/src/sdks/python/apache_beam/io/fileio.py>:593: BeamDeprecationWarning: options is deprecated since First stable release. References to <pipeline>.options will not be supported
    p.options.view_as(GoogleCloudOptions).temp_location or

apache_beam/io/gcp/bigquery_test.py::BigQueryStreamingInsertTransformIntegrationTests::test_multiple_destinations_transform
  <https://ci-beam.apache.org/job/beam_PostCommit_Python38/ws/src/sdks/python/apache_beam/io/gcp/bigquery_test.py>:1690: BeamDeprecationWarning: options is deprecated since First stable release. References to <pipeline>.options will not be supported
    streaming = self.test_pipeline.options.view_as(StandardOptions).streaming

apache_beam/io/gcp/bigquery_read_it_test.py::ReadTests::test_native_source
  <https://ci-beam.apache.org/job/beam_PostCommit_Python38/ws/src/sdks/python/apache_beam/io/gcp/bigquery_read_it_test.py>:170: BeamDeprecationWarning: BigQuerySource is deprecated since 2.25.0. Use ReadFromBigQuery instead.
    beam.io.BigQuerySource(query=self.query, use_standard_sql=True)))

apache_beam/ml/gcp/cloud_dlp_it_test.py::CloudDLPIT::test_deidentification
  <https://ci-beam.apache.org/job/beam_PostCommit_Python38/ws/src/sdks/python/apache_beam/ml/gcp/cloud_dlp_it_test.py>:74: FutureWarning: MaskDetectedDetails is experimental.
    | MaskDetectedDetails(

apache_beam/ml/gcp/cloud_dlp_it_test.py::CloudDLPIT::test_inspection
  <https://ci-beam.apache.org/job/beam_PostCommit_Python38/ws/src/sdks/python/apache_beam/ml/gcp/cloud_dlp_it_test.py>:85: FutureWarning: InspectForDetails is experimental.
    | InspectForDetails(

apache_beam/ml/inference/sklearn_inference_it_test.py::SklearnInference::test_sklearn_regression
  <https://ci-beam.apache.org/job/beam_PostCommit_Python38/ws/src/sdks/python/apache_beam/examples/inference/sklearn_japanese_housing_regression.py>:128: FutureWarning: SklearnModelHandlerPandas is experimental. No backwards-compatibility guarantees.
    model_loader = SklearnModelHandlerPandas(

apache_beam/ml/inference/sklearn_inference_it_test.py::SklearnInference::test_sklearn_regression
  <https://ci-beam.apache.org/job/beam_PostCommit_Python38/ws/src/build/gradleenv/-1734967051/lib/python3.8/site-packages/dill/_dill.py>:472: FutureWarning: SklearnModelHandlerPandas is experimental. No backwards-compatibility guarantees.
    obj = StockUnpickler.load(self)

apache_beam/io/gcp/bigquery_read_it_test.py::ReadNewTypesTests::test_native_source
  <https://ci-beam.apache.org/job/beam_PostCommit_Python38/ws/src/sdks/python/apache_beam/io/gcp/bigquery_read_it_test.py>:693: BeamDeprecationWarning: BigQuerySource is deprecated since 2.25.0. Use ReadFromBigQuery instead.
    beam.io.BigQuerySource(query=self.query, use_standard_sql=True)))

apache_beam/io/gcp/bigquery_read_it_test.py::ReadAllBQTests::test_read_queries
  <https://ci-beam.apache.org/job/beam_PostCommit_Python38/ws/src/sdks/python/apache_beam/io/gcp/bigquery_read_it_test.py>:808: FutureWarning: ReadAllFromBigQuery is experimental.
    | beam.io.ReadAllFromBigQuery())

apache_beam/io/gcp/bigquery_read_it_test.py::ReadAllBQTests::test_read_queries
  <https://ci-beam.apache.org/job/beam_PostCommit_Python38/ws/src/sdks/python/apache_beam/io/gcp/bigquery.py>:2658: BeamDeprecationWarning: options is deprecated since First stable release. References to <pipeline>.options will not be supported
    job_name = pcoll.pipeline.options.view_as(GoogleCloudOptions).job_name

apache_beam/io/gcp/bigquery_read_it_test.py::ReadAllBQTests::test_read_queries
  <https://ci-beam.apache.org/job/beam_PostCommit_Python38/ws/src/sdks/python/apache_beam/io/gcp/bigquery.py>:2659: BeamDeprecationWarning: options is deprecated since First stable release. References to <pipeline>.options will not be supported
    project = pcoll.pipeline.options.view_as(GoogleCloudOptions).project

apache_beam/io/gcp/bigquery_read_it_test.py::ReadAllBQTests::test_read_queries
  <https://ci-beam.apache.org/job/beam_PostCommit_Python38/ws/src/sdks/python/apache_beam/io/gcp/bigquery.py>:2672: BeamDeprecationWarning: options is deprecated since First stable release. References to <pipeline>.options will not be supported
    options=pcoll.pipeline.options,

-- Docs: https://docs.pytest.org/en/stable/how-to/capture-warnings.html
- generated xml file: <https://ci-beam.apache.org/job/beam_PostCommit_Python38/ws/src/sdks/python/pytest_postCommitIT-df-py38.xml> -
========== 85 passed, 24 skipped, 257 warnings in 11449.51s (3:10:49) ==========

FAILURE: Build failed with an exception.

* What went wrong:
Execution failed for task ':sdks:java:container:pullLicenses'.
> Process 'command './license_scripts/license_script.sh'' finished with non-zero exit value 1

* Try:
> Run with --stacktrace option to get the stack trace.
> Run with --info or --debug option to get more log output.

* Get more help at https://help.gradle.org

Deprecated Gradle features were used in this build, making it incompatible with Gradle 8.0.

You can use '--warning-mode all' to show the individual deprecation warnings and determine if they come from your own scripts or plugins.

See https://docs.gradle.org/7.5.1/userguide/command_line_interface.html#sec:command_line_warnings

Execution optimizations have been disabled for 1 invalid unit(s) of work during this build to ensure correctness.
Please consult deprecation warnings for more details.

BUILD FAILED in 3h 25m 51s
201 actionable tasks: 137 executed, 58 from cache, 6 up-to-date

Publishing build scan...
https://gradle.com/s/mvjt3hs3esysa

Build step 'Invoke Gradle script' changed build result to FAILURE
Build step 'Invoke Gradle script' marked build as failure

---------------------------------------------------------------------
To unsubscribe, e-mail: builds-unsubscribe@beam.apache.org
For additional commands, e-mail: builds-help@beam.apache.org


Build failed in Jenkins: beam_PostCommit_Python38 #3738

Posted by Apache Jenkins Server <je...@builds.apache.org>.
See <https://ci-beam.apache.org/job/beam_PostCommit_Python38/3738/display/redirect?page=changes>

Changes:

[xqhu] Ignore flags for beam_sql magic

[xqhu] Raise the error when some functions are misused

[xqhu] change how to import

[noreply] Validate that GBK coders are always set correctly. (#25394)

[noreply] Fix tox error running hdfsIntegrationTest (#25446)

[noreply] Adding support for DLQ for ZetaSQL (#25426)


------------------------------------------
[...truncated 765.16 KB...]

../../build/gradleenv/-1734967051/lib/python3.8/site-packages/tenacity/_asyncio.py:42
../../build/gradleenv/-1734967051/lib/python3.8/site-packages/tenacity/_asyncio.py:42
../../build/gradleenv/-1734967051/lib/python3.8/site-packages/tenacity/_asyncio.py:42
../../build/gradleenv/-1734967051/lib/python3.8/site-packages/tenacity/_asyncio.py:42
../../build/gradleenv/-1734967051/lib/python3.8/site-packages/tenacity/_asyncio.py:42
../../build/gradleenv/-1734967051/lib/python3.8/site-packages/tenacity/_asyncio.py:42
../../build/gradleenv/-1734967051/lib/python3.8/site-packages/tenacity/_asyncio.py:42
../../build/gradleenv/-1734967051/lib/python3.8/site-packages/tenacity/_asyncio.py:42
  <https://ci-beam.apache.org/job/beam_PostCommit_Python38/ws/src/build/gradleenv/-1734967051/lib/python3.8/site-packages/tenacity/_asyncio.py>:42: DeprecationWarning: "@coroutine" decorator is deprecated since Python 3.8, use "async def" instead
    def call(self, fn, *args, **kwargs):

apache_beam/typehints/pandas_type_compatibility_test.py:67
apache_beam/typehints/pandas_type_compatibility_test.py:67
apache_beam/typehints/pandas_type_compatibility_test.py:67
apache_beam/typehints/pandas_type_compatibility_test.py:67
apache_beam/typehints/pandas_type_compatibility_test.py:67
apache_beam/typehints/pandas_type_compatibility_test.py:67
apache_beam/typehints/pandas_type_compatibility_test.py:67
apache_beam/typehints/pandas_type_compatibility_test.py:67
  <https://ci-beam.apache.org/job/beam_PostCommit_Python38/ws/src/sdks/python/apache_beam/typehints/pandas_type_compatibility_test.py>:67: FutureWarning: pandas.Int64Index is deprecated and will be removed from pandas in a future version. Use pandas.Index with the appropriate dtype instead.
    }).set_index(pd.Int64Index(range(123, 223), name='an_index')),

apache_beam/typehints/pandas_type_compatibility_test.py:90
apache_beam/typehints/pandas_type_compatibility_test.py:90
apache_beam/typehints/pandas_type_compatibility_test.py:90
apache_beam/typehints/pandas_type_compatibility_test.py:90
apache_beam/typehints/pandas_type_compatibility_test.py:90
apache_beam/typehints/pandas_type_compatibility_test.py:90
apache_beam/typehints/pandas_type_compatibility_test.py:90
apache_beam/typehints/pandas_type_compatibility_test.py:90
  <https://ci-beam.apache.org/job/beam_PostCommit_Python38/ws/src/sdks/python/apache_beam/typehints/pandas_type_compatibility_test.py>:90: FutureWarning: pandas.Int64Index is deprecated and will be removed from pandas in a future version. Use pandas.Index with the appropriate dtype instead.
    pd.Int64Index(range(123, 223), name='an_index'),

apache_beam/typehints/pandas_type_compatibility_test.py:91
apache_beam/typehints/pandas_type_compatibility_test.py:91
apache_beam/typehints/pandas_type_compatibility_test.py:91
apache_beam/typehints/pandas_type_compatibility_test.py:91
apache_beam/typehints/pandas_type_compatibility_test.py:91
apache_beam/typehints/pandas_type_compatibility_test.py:91
apache_beam/typehints/pandas_type_compatibility_test.py:91
apache_beam/typehints/pandas_type_compatibility_test.py:91
  <https://ci-beam.apache.org/job/beam_PostCommit_Python38/ws/src/sdks/python/apache_beam/typehints/pandas_type_compatibility_test.py>:91: FutureWarning: pandas.Int64Index is deprecated and will be removed from pandas in a future version. Use pandas.Index with the appropriate dtype instead.
    pd.Int64Index(range(475, 575), name='another_index'),

apache_beam/dataframe/io_it_test.py: 3 warnings
apache_beam/examples/cookbook/bigquery_tornadoes_it_test.py: 1 warning
apache_beam/examples/dataframe/flight_delays_it_test.py: 1 warning
apache_beam/io/gcp/bigquery_io_read_it_test.py: 2 warnings
apache_beam/io/gcp/bigquery_read_it_test.py: 7 warnings
apache_beam/io/gcp/bigquery_json_it_test.py: 3 warnings
apache_beam/io/gcp/big_query_query_to_table_it_test.py: 4 warnings
  <https://ci-beam.apache.org/job/beam_PostCommit_Python38/ws/src/sdks/python/apache_beam/io/gcp/bigquery.py>:2485: BeamDeprecationWarning: options is deprecated since First stable release. References to <pipeline>.options will not be supported
    temp_location = pcoll.pipeline.options.view_as(

apache_beam/dataframe/io_it_test.py: 3 warnings
apache_beam/examples/cookbook/bigquery_tornadoes_it_test.py: 1 warning
apache_beam/examples/dataframe/flight_delays_it_test.py: 1 warning
apache_beam/io/gcp/bigquery_io_read_it_test.py: 2 warnings
apache_beam/io/gcp/bigquery_read_it_test.py: 7 warnings
apache_beam/io/gcp/bigquery_json_it_test.py: 3 warnings
apache_beam/io/gcp/big_query_query_to_table_it_test.py: 4 warnings
  <https://ci-beam.apache.org/job/beam_PostCommit_Python38/ws/src/sdks/python/apache_beam/io/gcp/bigquery.py>:2487: BeamDeprecationWarning: options is deprecated since First stable release. References to <pipeline>.options will not be supported
    job_name = pcoll.pipeline.options.view_as(GoogleCloudOptions).job_name

apache_beam/dataframe/io_it_test.py: 3 warnings
apache_beam/examples/cookbook/bigquery_tornadoes_it_test.py: 1 warning
apache_beam/examples/dataframe/flight_delays_it_test.py: 1 warning
apache_beam/io/gcp/bigquery_io_read_it_test.py: 2 warnings
apache_beam/io/gcp/bigquery_read_it_test.py: 7 warnings
apache_beam/io/gcp/bigquery_json_it_test.py: 3 warnings
apache_beam/io/gcp/big_query_query_to_table_it_test.py: 4 warnings
  <https://ci-beam.apache.org/job/beam_PostCommit_Python38/ws/src/sdks/python/apache_beam/io/gcp/bigquery.py>:2511: BeamDeprecationWarning: options is deprecated since First stable release. References to <pipeline>.options will not be supported
    pipeline_options=pcoll.pipeline.options,

apache_beam/examples/complete/game/game_stats_it_test.py::GameStatsIT::test_game_stats_it
apache_beam/examples/complete/game/hourly_team_score_it_test.py::HourlyTeamScoreIT::test_hourly_team_score_it
apache_beam/examples/complete/game/leader_board_it_test.py::LeaderBoardIT::test_leader_board_it
apache_beam/io/gcp/bigquery_test.py::PubSubBigQueryIT::test_file_loads
apache_beam/io/gcp/bigquery_test.py::PubSubBigQueryIT::test_streaming_inserts
  <https://ci-beam.apache.org/job/beam_PostCommit_Python38/ws/src/sdks/python/apache_beam/io/gcp/tests/utils.py>:63: PendingDeprecationWarning: Client.dataset is deprecated and will be removed in a future version. Use a string like 'my_project.my_dataset' or a cloud.google.bigquery.DatasetReference object, instead.
    dataset_ref = client.dataset(unique_dataset_name, project=project)

apache_beam/examples/complete/game/game_stats_it_test.py: 2 warnings
apache_beam/examples/cookbook/bigquery_tornadoes_it_test.py: 1 warning
apache_beam/examples/complete/game/hourly_team_score_it_test.py: 1 warning
apache_beam/examples/complete/game/leader_board_it_test.py: 2 warnings
apache_beam/io/gcp/bigquery_file_loads_test.py: 3 warnings
apache_beam/io/gcp/bigquery_write_it_test.py: 4 warnings
apache_beam/io/gcp/bigquery_test.py: 6 warnings
apache_beam/io/gcp/bigquery_json_it_test.py: 2 warnings
apache_beam/io/gcp/big_query_query_to_table_it_test.py: 4 warnings
  <https://ci-beam.apache.org/job/beam_PostCommit_Python38/ws/src/sdks/python/apache_beam/io/gcp/bigquery.py>:1992: BeamDeprecationWarning: options is deprecated since First stable release. References to <pipeline>.options will not be supported
    is_streaming_pipeline = p.options.view_as(StandardOptions).streaming

apache_beam/examples/complete/game/game_stats_it_test.py: 2 warnings
apache_beam/examples/cookbook/bigquery_tornadoes_it_test.py: 1 warning
apache_beam/examples/complete/game/hourly_team_score_it_test.py: 1 warning
apache_beam/examples/complete/game/leader_board_it_test.py: 2 warnings
apache_beam/io/gcp/bigquery_file_loads_test.py: 3 warnings
apache_beam/io/gcp/bigquery_write_it_test.py: 4 warnings
apache_beam/io/gcp/bigquery_test.py: 6 warnings
apache_beam/io/gcp/bigquery_json_it_test.py: 2 warnings
apache_beam/io/gcp/big_query_query_to_table_it_test.py: 4 warnings
  <https://ci-beam.apache.org/job/beam_PostCommit_Python38/ws/src/sdks/python/apache_beam/io/gcp/bigquery.py>:1998: BeamDeprecationWarning: options is deprecated since First stable release. References to <pipeline>.options will not be supported
    experiments = p.options.view_as(DebugOptions).experiments or []

apache_beam/examples/cookbook/bigquery_tornadoes_it_test.py: 1 warning
apache_beam/io/gcp/bigquery_write_it_test.py: 4 warnings
apache_beam/io/gcp/big_query_query_to_table_it_test.py: 4 warnings
apache_beam/io/gcp/bigquery_test.py: 2 warnings
  <https://ci-beam.apache.org/job/beam_PostCommit_Python38/ws/src/sdks/python/apache_beam/io/gcp/bigquery.py>:1988: BeamDeprecationWarning: options is deprecated since First stable release. References to <pipeline>.options will not be supported
    self.table_reference.projectId = pcoll.pipeline.options.view_as(

apache_beam/examples/cookbook/bigquery_tornadoes_it_test.py: 1 warning
apache_beam/io/gcp/bigquery_file_loads_test.py: 3 warnings
apache_beam/io/gcp/bigquery_write_it_test.py: 3 warnings
apache_beam/io/gcp/bigquery_test.py: 3 warnings
apache_beam/io/gcp/big_query_query_to_table_it_test.py: 4 warnings
  <https://ci-beam.apache.org/job/beam_PostCommit_Python38/ws/src/sdks/python/apache_beam/io/gcp/bigquery_file_loads.py>:1166: BeamDeprecationWarning: options is deprecated since First stable release. References to <pipeline>.options will not be supported
    self.project = self.project or p.options.view_as(GoogleCloudOptions).project

apache_beam/examples/cookbook/bigquery_tornadoes_it_test.py: 1 warning
apache_beam/examples/complete/game/hourly_team_score_it_test.py: 1 warning
apache_beam/io/gcp/bigquery_file_loads_test.py: 3 warnings
apache_beam/io/gcp/bigquery_write_it_test.py: 3 warnings
apache_beam/io/gcp/bigquery_test.py: 3 warnings
apache_beam/io/gcp/big_query_query_to_table_it_test.py: 4 warnings
  <https://ci-beam.apache.org/job/beam_PostCommit_Python38/ws/src/sdks/python/apache_beam/io/gcp/bigquery_file_loads.py>:1173: BeamDeprecationWarning: options is deprecated since First stable release. References to <pipeline>.options will not be supported
    temp_location = p.options.view_as(GoogleCloudOptions).temp_location

apache_beam/examples/cookbook/bigquery_tornadoes_it_test.py: 1 warning
apache_beam/examples/complete/game/hourly_team_score_it_test.py: 1 warning
apache_beam/io/gcp/bigquery_file_loads_test.py: 3 warnings
apache_beam/io/gcp/bigquery_write_it_test.py: 3 warnings
apache_beam/io/gcp/bigquery_test.py: 3 warnings
apache_beam/io/gcp/big_query_query_to_table_it_test.py: 4 warnings
  <https://ci-beam.apache.org/job/beam_PostCommit_Python38/ws/src/sdks/python/apache_beam/io/gcp/bigquery_file_loads.py>:1175: BeamDeprecationWarning: options is deprecated since First stable release. References to <pipeline>.options will not be supported
    p.options.view_as(GoogleCloudOptions).job_name or 'AUTOMATIC_JOB_NAME')

apache_beam/examples/cookbook/bigquery_tornadoes_it_test.py::BigqueryTornadoesIT::test_bigquery_tornadoes_it
  <https://ci-beam.apache.org/job/beam_PostCommit_Python38/ws/src/sdks/python/apache_beam/io/gcp/tests/utils.py>:100: PendingDeprecationWarning: Client.dataset is deprecated and will be removed in a future version. Use a string like 'my_project.my_dataset' or a cloud.google.bigquery.DatasetReference object, instead.
    table_ref = client.dataset(dataset_id).table(table_id)

apache_beam/dataframe/io_it_test.py: 2 warnings
apache_beam/io/gcp/bigquery_json_it_test.py: 1 warning
apache_beam/io/gcp/bigquery_read_it_test.py: 9 warnings
  <https://ci-beam.apache.org/job/beam_PostCommit_Python38/ws/src/sdks/python/apache_beam/io/gcp/bigquery.py>:2529: BeamDeprecationWarning: options is deprecated since First stable release. References to <pipeline>.options will not be supported
    project_id = pcoll.pipeline.options.view_as(GoogleCloudOptions).project

apache_beam/dataframe/io_it_test.py: 2 warnings
apache_beam/io/gcp/bigquery_json_it_test.py: 1 warning
apache_beam/io/gcp/bigquery_read_it_test.py: 9 warnings
  <https://ci-beam.apache.org/job/beam_PostCommit_Python38/ws/src/sdks/python/apache_beam/io/gcp/bigquery.py>:2550: BeamDeprecationWarning: options is deprecated since First stable release. References to <pipeline>.options will not be supported
    pipeline_options=pcoll.pipeline.options,

apache_beam/examples/dataframe/flight_delays_it_test.py::FlightDelaysTest::test_flight_delays
  <https://ci-beam.apache.org/job/beam_PostCommit_Python38/ws/src/sdks/python/apache_beam/examples/dataframe/flight_delays.py>:47: FutureWarning: The default value of numeric_only in DataFrame.mean is deprecated. In a future version, it will default to False. In addition, specifying 'numeric_only=None' is deprecated. Select only valid columns or specify the value of numeric_only to silence this warning.
    return airline_df[at_top_airports].mean()

apache_beam/examples/dataframe/flight_delays_it_test.py::FlightDelaysTest::test_flight_delays
apache_beam/examples/dataframe/taxiride_it_test.py::TaxirideIT::test_aggregation
apache_beam/examples/dataframe/taxiride_it_test.py::TaxirideIT::test_enrich
  <https://ci-beam.apache.org/job/beam_PostCommit_Python38/ws/src/sdks/python/apache_beam/dataframe/io.py>:659: FutureWarning: WriteToFiles is experimental.
    return pcoll | fileio.WriteToFiles(

apache_beam/examples/dataframe/flight_delays_it_test.py::FlightDelaysTest::test_flight_delays
apache_beam/examples/dataframe/taxiride_it_test.py::TaxirideIT::test_aggregation
apache_beam/examples/dataframe/taxiride_it_test.py::TaxirideIT::test_enrich
  <https://ci-beam.apache.org/job/beam_PostCommit_Python38/ws/src/sdks/python/apache_beam/io/fileio.py>:593: BeamDeprecationWarning: options is deprecated since First stable release. References to <pipeline>.options will not be supported
    p.options.view_as(GoogleCloudOptions).temp_location or

apache_beam/io/gcp/bigquery_test.py::BigQueryStreamingInsertTransformIntegrationTests::test_multiple_destinations_transform
  <https://ci-beam.apache.org/job/beam_PostCommit_Python38/ws/src/sdks/python/apache_beam/io/gcp/bigquery_test.py>:1690: BeamDeprecationWarning: options is deprecated since First stable release. References to <pipeline>.options will not be supported
    streaming = self.test_pipeline.options.view_as(StandardOptions).streaming

apache_beam/io/gcp/bigquery_read_it_test.py::ReadTests::test_native_source
  <https://ci-beam.apache.org/job/beam_PostCommit_Python38/ws/src/sdks/python/apache_beam/io/gcp/bigquery_read_it_test.py>:170: BeamDeprecationWarning: BigQuerySource is deprecated since 2.25.0. Use ReadFromBigQuery instead.
    beam.io.BigQuerySource(query=self.query, use_standard_sql=True)))

apache_beam/ml/gcp/cloud_dlp_it_test.py::CloudDLPIT::test_deidentification
  <https://ci-beam.apache.org/job/beam_PostCommit_Python38/ws/src/sdks/python/apache_beam/ml/gcp/cloud_dlp_it_test.py>:74: FutureWarning: MaskDetectedDetails is experimental.
    | MaskDetectedDetails(

apache_beam/ml/gcp/cloud_dlp_it_test.py::CloudDLPIT::test_inspection
  <https://ci-beam.apache.org/job/beam_PostCommit_Python38/ws/src/sdks/python/apache_beam/ml/gcp/cloud_dlp_it_test.py>:85: FutureWarning: InspectForDetails is experimental.
    | InspectForDetails(

apache_beam/ml/inference/sklearn_inference_it_test.py::SklearnInference::test_sklearn_regression
  <https://ci-beam.apache.org/job/beam_PostCommit_Python38/ws/src/sdks/python/apache_beam/examples/inference/sklearn_japanese_housing_regression.py>:128: FutureWarning: SklearnModelHandlerPandas is experimental. No backwards-compatibility guarantees.
    model_loader = SklearnModelHandlerPandas(

apache_beam/ml/inference/sklearn_inference_it_test.py::SklearnInference::test_sklearn_regression
  <https://ci-beam.apache.org/job/beam_PostCommit_Python38/ws/src/build/gradleenv/-1734967051/lib/python3.8/site-packages/dill/_dill.py>:472: FutureWarning: SklearnModelHandlerPandas is experimental. No backwards-compatibility guarantees.
    obj = StockUnpickler.load(self)

apache_beam/io/gcp/bigquery_read_it_test.py::ReadNewTypesTests::test_native_source
  <https://ci-beam.apache.org/job/beam_PostCommit_Python38/ws/src/sdks/python/apache_beam/io/gcp/bigquery_read_it_test.py>:693: BeamDeprecationWarning: BigQuerySource is deprecated since 2.25.0. Use ReadFromBigQuery instead.
    beam.io.BigQuerySource(query=self.query, use_standard_sql=True)))

apache_beam/io/gcp/bigquery_read_it_test.py::ReadAllBQTests::test_read_queries
  <https://ci-beam.apache.org/job/beam_PostCommit_Python38/ws/src/sdks/python/apache_beam/io/gcp/bigquery_read_it_test.py>:808: FutureWarning: ReadAllFromBigQuery is experimental.
    | beam.io.ReadAllFromBigQuery())

apache_beam/io/gcp/bigquery_read_it_test.py::ReadAllBQTests::test_read_queries
  <https://ci-beam.apache.org/job/beam_PostCommit_Python38/ws/src/sdks/python/apache_beam/io/gcp/bigquery.py>:2658: BeamDeprecationWarning: options is deprecated since First stable release. References to <pipeline>.options will not be supported
    job_name = pcoll.pipeline.options.view_as(GoogleCloudOptions).job_name

apache_beam/io/gcp/bigquery_read_it_test.py::ReadAllBQTests::test_read_queries
  <https://ci-beam.apache.org/job/beam_PostCommit_Python38/ws/src/sdks/python/apache_beam/io/gcp/bigquery.py>:2659: BeamDeprecationWarning: options is deprecated since First stable release. References to <pipeline>.options will not be supported
    project = pcoll.pipeline.options.view_as(GoogleCloudOptions).project

apache_beam/io/gcp/bigquery_read_it_test.py::ReadAllBQTests::test_read_queries
  <https://ci-beam.apache.org/job/beam_PostCommit_Python38/ws/src/sdks/python/apache_beam/io/gcp/bigquery.py>:2672: BeamDeprecationWarning: options is deprecated since First stable release. References to <pipeline>.options will not be supported
    options=pcoll.pipeline.options,

-- Docs: https://docs.pytest.org/en/stable/how-to/capture-warnings.html
- generated xml file: <https://ci-beam.apache.org/job/beam_PostCommit_Python38/ws/src/sdks/python/pytest_postCommitIT-df-py38.xml> -
========== 85 passed, 24 skipped, 257 warnings in 11849.50s (3:17:29) ==========

FAILURE: Build failed with an exception.

* What went wrong:
Execution failed for task ':sdks:java:container:pullLicenses'.
> Process 'command './license_scripts/license_script.sh'' finished with non-zero exit value 1

* Try:
> Run with --stacktrace option to get the stack trace.
> Run with --info or --debug option to get more log output.

* Get more help at https://help.gradle.org

Deprecated Gradle features were used in this build, making it incompatible with Gradle 8.0.

You can use '--warning-mode all' to show the individual deprecation warnings and determine if they come from your own scripts or plugins.

See https://docs.gradle.org/7.5.1/userguide/command_line_interface.html#sec:command_line_warnings

Execution optimizations have been disabled for 1 invalid unit(s) of work during this build to ensure correctness.
Please consult deprecation warnings for more details.

BUILD FAILED in 3h 32m 2s
201 actionable tasks: 140 executed, 55 from cache, 6 up-to-date

Publishing build scan...
https://gradle.com/s/4qa4k5hsh4koe

Build step 'Invoke Gradle script' changed build result to FAILURE
Build step 'Invoke Gradle script' marked build as failure

---------------------------------------------------------------------
To unsubscribe, e-mail: builds-unsubscribe@beam.apache.org
For additional commands, e-mail: builds-help@beam.apache.org


Build failed in Jenkins: beam_PostCommit_Python38 #3737

Posted by Apache Jenkins Server <je...@builds.apache.org>.
See <https://ci-beam.apache.org/job/beam_PostCommit_Python38/3737/display/redirect?page=changes>

Changes:

[noreply] (#25316) Enable LZMA compression in Python SDK I/O (#25317)

[noreply] Add WatchFilePattern  (#25393)

[noreply] Support gauge metrics in portable mode (#25396)


------------------------------------------
[...truncated 717.14 KB...]
apache_beam/typehints/pandas_type_compatibility_test.py:67
apache_beam/typehints/pandas_type_compatibility_test.py:67
apache_beam/typehints/pandas_type_compatibility_test.py:67
  <https://ci-beam.apache.org/job/beam_PostCommit_Python38/ws/src/sdks/python/apache_beam/typehints/pandas_type_compatibility_test.py>:67: FutureWarning: pandas.Int64Index is deprecated and will be removed from pandas in a future version. Use pandas.Index with the appropriate dtype instead.
    }).set_index(pd.Int64Index(range(123, 223), name='an_index')),

apache_beam/typehints/pandas_type_compatibility_test.py:90
apache_beam/typehints/pandas_type_compatibility_test.py:90
apache_beam/typehints/pandas_type_compatibility_test.py:90
apache_beam/typehints/pandas_type_compatibility_test.py:90
apache_beam/typehints/pandas_type_compatibility_test.py:90
apache_beam/typehints/pandas_type_compatibility_test.py:90
apache_beam/typehints/pandas_type_compatibility_test.py:90
apache_beam/typehints/pandas_type_compatibility_test.py:90
  <https://ci-beam.apache.org/job/beam_PostCommit_Python38/ws/src/sdks/python/apache_beam/typehints/pandas_type_compatibility_test.py>:90: FutureWarning: pandas.Int64Index is deprecated and will be removed from pandas in a future version. Use pandas.Index with the appropriate dtype instead.
    pd.Int64Index(range(123, 223), name='an_index'),

apache_beam/typehints/pandas_type_compatibility_test.py:91
apache_beam/typehints/pandas_type_compatibility_test.py:91
apache_beam/typehints/pandas_type_compatibility_test.py:91
apache_beam/typehints/pandas_type_compatibility_test.py:91
apache_beam/typehints/pandas_type_compatibility_test.py:91
apache_beam/typehints/pandas_type_compatibility_test.py:91
apache_beam/typehints/pandas_type_compatibility_test.py:91
apache_beam/typehints/pandas_type_compatibility_test.py:91
  <https://ci-beam.apache.org/job/beam_PostCommit_Python38/ws/src/sdks/python/apache_beam/typehints/pandas_type_compatibility_test.py>:91: FutureWarning: pandas.Int64Index is deprecated and will be removed from pandas in a future version. Use pandas.Index with the appropriate dtype instead.
    pd.Int64Index(range(475, 575), name='another_index'),

apache_beam/dataframe/io_it_test.py: 3 warnings
apache_beam/examples/cookbook/bigquery_tornadoes_it_test.py: 1 warning
apache_beam/examples/dataframe/flight_delays_it_test.py: 1 warning
apache_beam/io/gcp/bigquery_read_it_test.py: 7 warnings
apache_beam/io/gcp/big_query_query_to_table_it_test.py: 4 warnings
apache_beam/io/gcp/bigquery_json_it_test.py: 3 warnings
apache_beam/io/gcp/bigquery_io_read_it_test.py: 2 warnings
  <https://ci-beam.apache.org/job/beam_PostCommit_Python38/ws/src/sdks/python/apache_beam/io/gcp/bigquery.py>:2485: BeamDeprecationWarning: options is deprecated since First stable release. References to <pipeline>.options will not be supported
    temp_location = pcoll.pipeline.options.view_as(

apache_beam/dataframe/io_it_test.py: 3 warnings
apache_beam/examples/cookbook/bigquery_tornadoes_it_test.py: 1 warning
apache_beam/examples/dataframe/flight_delays_it_test.py: 1 warning
apache_beam/io/gcp/bigquery_read_it_test.py: 7 warnings
apache_beam/io/gcp/big_query_query_to_table_it_test.py: 4 warnings
apache_beam/io/gcp/bigquery_json_it_test.py: 3 warnings
apache_beam/io/gcp/bigquery_io_read_it_test.py: 2 warnings
  <https://ci-beam.apache.org/job/beam_PostCommit_Python38/ws/src/sdks/python/apache_beam/io/gcp/bigquery.py>:2487: BeamDeprecationWarning: options is deprecated since First stable release. References to <pipeline>.options will not be supported
    job_name = pcoll.pipeline.options.view_as(GoogleCloudOptions).job_name

apache_beam/dataframe/io_it_test.py: 3 warnings
apache_beam/examples/cookbook/bigquery_tornadoes_it_test.py: 1 warning
apache_beam/examples/dataframe/flight_delays_it_test.py: 1 warning
apache_beam/io/gcp/bigquery_read_it_test.py: 7 warnings
apache_beam/io/gcp/big_query_query_to_table_it_test.py: 4 warnings
apache_beam/io/gcp/bigquery_json_it_test.py: 3 warnings
apache_beam/io/gcp/bigquery_io_read_it_test.py: 2 warnings
  <https://ci-beam.apache.org/job/beam_PostCommit_Python38/ws/src/sdks/python/apache_beam/io/gcp/bigquery.py>:2511: BeamDeprecationWarning: options is deprecated since First stable release. References to <pipeline>.options will not be supported
    pipeline_options=pcoll.pipeline.options,

apache_beam/examples/complete/game/game_stats_it_test.py::GameStatsIT::test_game_stats_it
apache_beam/examples/complete/game/hourly_team_score_it_test.py::HourlyTeamScoreIT::test_hourly_team_score_it
apache_beam/examples/complete/game/leader_board_it_test.py::LeaderBoardIT::test_leader_board_it
apache_beam/io/gcp/bigquery_test.py::PubSubBigQueryIT::test_file_loads
apache_beam/io/gcp/bigquery_test.py::PubSubBigQueryIT::test_streaming_inserts
  <https://ci-beam.apache.org/job/beam_PostCommit_Python38/ws/src/sdks/python/apache_beam/io/gcp/tests/utils.py>:63: PendingDeprecationWarning: Client.dataset is deprecated and will be removed in a future version. Use a string like 'my_project.my_dataset' or a cloud.google.bigquery.DatasetReference object, instead.
    dataset_ref = client.dataset(unique_dataset_name, project=project)

apache_beam/examples/complete/game/game_stats_it_test.py: 2 warnings
apache_beam/examples/cookbook/bigquery_tornadoes_it_test.py: 1 warning
apache_beam/examples/complete/game/hourly_team_score_it_test.py: 1 warning
apache_beam/io/gcp/bigquery_file_loads_test.py: 3 warnings
apache_beam/examples/complete/game/leader_board_it_test.py: 2 warnings
apache_beam/io/gcp/big_query_query_to_table_it_test.py: 4 warnings
apache_beam/io/gcp/bigquery_test.py: 6 warnings
apache_beam/io/gcp/bigquery_write_it_test.py: 4 warnings
apache_beam/io/gcp/bigquery_json_it_test.py: 2 warnings
  <https://ci-beam.apache.org/job/beam_PostCommit_Python38/ws/src/sdks/python/apache_beam/io/gcp/bigquery.py>:1992: BeamDeprecationWarning: options is deprecated since First stable release. References to <pipeline>.options will not be supported
    is_streaming_pipeline = p.options.view_as(StandardOptions).streaming

apache_beam/examples/complete/game/game_stats_it_test.py: 2 warnings
apache_beam/examples/cookbook/bigquery_tornadoes_it_test.py: 1 warning
apache_beam/examples/complete/game/hourly_team_score_it_test.py: 1 warning
apache_beam/io/gcp/bigquery_file_loads_test.py: 3 warnings
apache_beam/examples/complete/game/leader_board_it_test.py: 2 warnings
apache_beam/io/gcp/big_query_query_to_table_it_test.py: 4 warnings
apache_beam/io/gcp/bigquery_test.py: 6 warnings
apache_beam/io/gcp/bigquery_write_it_test.py: 4 warnings
apache_beam/io/gcp/bigquery_json_it_test.py: 2 warnings
  <https://ci-beam.apache.org/job/beam_PostCommit_Python38/ws/src/sdks/python/apache_beam/io/gcp/bigquery.py>:1998: BeamDeprecationWarning: options is deprecated since First stable release. References to <pipeline>.options will not be supported
    experiments = p.options.view_as(DebugOptions).experiments or []

apache_beam/dataframe/io_it_test.py: 2 warnings
apache_beam/io/gcp/bigquery_json_it_test.py: 1 warning
apache_beam/io/gcp/bigquery_read_it_test.py: 9 warnings
  <https://ci-beam.apache.org/job/beam_PostCommit_Python38/ws/src/sdks/python/apache_beam/io/gcp/bigquery.py>:2529: BeamDeprecationWarning: options is deprecated since First stable release. References to <pipeline>.options will not be supported
    project_id = pcoll.pipeline.options.view_as(GoogleCloudOptions).project

apache_beam/dataframe/io_it_test.py: 2 warnings
apache_beam/io/gcp/bigquery_json_it_test.py: 1 warning
apache_beam/io/gcp/bigquery_read_it_test.py: 9 warnings
  <https://ci-beam.apache.org/job/beam_PostCommit_Python38/ws/src/sdks/python/apache_beam/io/gcp/bigquery.py>:2550: BeamDeprecationWarning: options is deprecated since First stable release. References to <pipeline>.options will not be supported
    pipeline_options=pcoll.pipeline.options,

apache_beam/examples/cookbook/bigquery_tornadoes_it_test.py: 1 warning
apache_beam/io/gcp/big_query_query_to_table_it_test.py: 4 warnings
apache_beam/io/gcp/bigquery_write_it_test.py: 4 warnings
apache_beam/io/gcp/bigquery_test.py: 2 warnings
  <https://ci-beam.apache.org/job/beam_PostCommit_Python38/ws/src/sdks/python/apache_beam/io/gcp/bigquery.py>:1988: BeamDeprecationWarning: options is deprecated since First stable release. References to <pipeline>.options will not be supported
    self.table_reference.projectId = pcoll.pipeline.options.view_as(

apache_beam/examples/cookbook/bigquery_tornadoes_it_test.py: 1 warning
apache_beam/io/gcp/bigquery_file_loads_test.py: 3 warnings
apache_beam/io/gcp/big_query_query_to_table_it_test.py: 4 warnings
apache_beam/io/gcp/bigquery_write_it_test.py: 3 warnings
apache_beam/io/gcp/bigquery_test.py: 3 warnings
  <https://ci-beam.apache.org/job/beam_PostCommit_Python38/ws/src/sdks/python/apache_beam/io/gcp/bigquery_file_loads.py>:1166: BeamDeprecationWarning: options is deprecated since First stable release. References to <pipeline>.options will not be supported
    self.project = self.project or p.options.view_as(GoogleCloudOptions).project

apache_beam/examples/cookbook/bigquery_tornadoes_it_test.py: 1 warning
apache_beam/examples/complete/game/hourly_team_score_it_test.py: 1 warning
apache_beam/io/gcp/bigquery_file_loads_test.py: 3 warnings
apache_beam/io/gcp/big_query_query_to_table_it_test.py: 4 warnings
apache_beam/io/gcp/bigquery_write_it_test.py: 3 warnings
apache_beam/io/gcp/bigquery_test.py: 3 warnings
  <https://ci-beam.apache.org/job/beam_PostCommit_Python38/ws/src/sdks/python/apache_beam/io/gcp/bigquery_file_loads.py>:1173: BeamDeprecationWarning: options is deprecated since First stable release. References to <pipeline>.options will not be supported
    temp_location = p.options.view_as(GoogleCloudOptions).temp_location

apache_beam/examples/cookbook/bigquery_tornadoes_it_test.py: 1 warning
apache_beam/examples/complete/game/hourly_team_score_it_test.py: 1 warning
apache_beam/io/gcp/bigquery_file_loads_test.py: 3 warnings
apache_beam/io/gcp/big_query_query_to_table_it_test.py: 4 warnings
apache_beam/io/gcp/bigquery_write_it_test.py: 3 warnings
apache_beam/io/gcp/bigquery_test.py: 3 warnings
  <https://ci-beam.apache.org/job/beam_PostCommit_Python38/ws/src/sdks/python/apache_beam/io/gcp/bigquery_file_loads.py>:1175: BeamDeprecationWarning: options is deprecated since First stable release. References to <pipeline>.options will not be supported
    p.options.view_as(GoogleCloudOptions).job_name or 'AUTOMATIC_JOB_NAME')

apache_beam/examples/cookbook/bigquery_tornadoes_it_test.py::BigqueryTornadoesIT::test_bigquery_tornadoes_it
  <https://ci-beam.apache.org/job/beam_PostCommit_Python38/ws/src/sdks/python/apache_beam/io/gcp/tests/utils.py>:100: PendingDeprecationWarning: Client.dataset is deprecated and will be removed in a future version. Use a string like 'my_project.my_dataset' or a cloud.google.bigquery.DatasetReference object, instead.
    table_ref = client.dataset(dataset_id).table(table_id)

apache_beam/examples/dataframe/flight_delays_it_test.py::FlightDelaysTest::test_flight_delays
  <https://ci-beam.apache.org/job/beam_PostCommit_Python38/ws/src/sdks/python/apache_beam/examples/dataframe/flight_delays.py>:47: FutureWarning: The default value of numeric_only in DataFrame.mean is deprecated. In a future version, it will default to False. In addition, specifying 'numeric_only=None' is deprecated. Select only valid columns or specify the value of numeric_only to silence this warning.
    return airline_df[at_top_airports].mean()

apache_beam/examples/dataframe/flight_delays_it_test.py::FlightDelaysTest::test_flight_delays
apache_beam/examples/dataframe/taxiride_it_test.py::TaxirideIT::test_aggregation
apache_beam/examples/dataframe/taxiride_it_test.py::TaxirideIT::test_enrich
  <https://ci-beam.apache.org/job/beam_PostCommit_Python38/ws/src/sdks/python/apache_beam/dataframe/io.py>:659: FutureWarning: WriteToFiles is experimental.
    return pcoll | fileio.WriteToFiles(

apache_beam/examples/dataframe/flight_delays_it_test.py::FlightDelaysTest::test_flight_delays
apache_beam/examples/dataframe/taxiride_it_test.py::TaxirideIT::test_aggregation
apache_beam/examples/dataframe/taxiride_it_test.py::TaxirideIT::test_enrich
  <https://ci-beam.apache.org/job/beam_PostCommit_Python38/ws/src/sdks/python/apache_beam/io/fileio.py>:593: BeamDeprecationWarning: options is deprecated since First stable release. References to <pipeline>.options will not be supported
    p.options.view_as(GoogleCloudOptions).temp_location or

apache_beam/io/gcp/bigquery_test.py::BigQueryStreamingInsertTransformIntegrationTests::test_multiple_destinations_transform
  <https://ci-beam.apache.org/job/beam_PostCommit_Python38/ws/src/sdks/python/apache_beam/io/gcp/bigquery_test.py>:1690: BeamDeprecationWarning: options is deprecated since First stable release. References to <pipeline>.options will not be supported
    streaming = self.test_pipeline.options.view_as(StandardOptions).streaming

apache_beam/io/gcp/bigquery_read_it_test.py::ReadTests::test_native_source
  <https://ci-beam.apache.org/job/beam_PostCommit_Python38/ws/src/sdks/python/apache_beam/io/gcp/bigquery_read_it_test.py>:170: BeamDeprecationWarning: BigQuerySource is deprecated since 2.25.0. Use ReadFromBigQuery instead.
    beam.io.BigQuerySource(query=self.query, use_standard_sql=True)))

apache_beam/ml/gcp/cloud_dlp_it_test.py::CloudDLPIT::test_deidentification
  <https://ci-beam.apache.org/job/beam_PostCommit_Python38/ws/src/sdks/python/apache_beam/ml/gcp/cloud_dlp_it_test.py>:74: FutureWarning: MaskDetectedDetails is experimental.
    | MaskDetectedDetails(

apache_beam/ml/gcp/cloud_dlp_it_test.py::CloudDLPIT::test_inspection
  <https://ci-beam.apache.org/job/beam_PostCommit_Python38/ws/src/sdks/python/apache_beam/ml/gcp/cloud_dlp_it_test.py>:85: FutureWarning: InspectForDetails is experimental.
    | InspectForDetails(

apache_beam/ml/inference/sklearn_inference_it_test.py::SklearnInference::test_sklearn_regression
  <https://ci-beam.apache.org/job/beam_PostCommit_Python38/ws/src/sdks/python/apache_beam/examples/inference/sklearn_japanese_housing_regression.py>:128: FutureWarning: SklearnModelHandlerPandas is experimental. No backwards-compatibility guarantees.
    model_loader = SklearnModelHandlerPandas(

apache_beam/ml/inference/sklearn_inference_it_test.py::SklearnInference::test_sklearn_regression
  <https://ci-beam.apache.org/job/beam_PostCommit_Python38/ws/src/build/gradleenv/-1734967051/lib/python3.8/site-packages/dill/_dill.py>:472: FutureWarning: SklearnModelHandlerPandas is experimental. No backwards-compatibility guarantees.
    obj = StockUnpickler.load(self)

apache_beam/io/gcp/bigquery_read_it_test.py::ReadNewTypesTests::test_native_source
  <https://ci-beam.apache.org/job/beam_PostCommit_Python38/ws/src/sdks/python/apache_beam/io/gcp/bigquery_read_it_test.py>:693: BeamDeprecationWarning: BigQuerySource is deprecated since 2.25.0. Use ReadFromBigQuery instead.
    beam.io.BigQuerySource(query=self.query, use_standard_sql=True)))

apache_beam/io/gcp/bigquery_read_it_test.py::ReadAllBQTests::test_read_queries
  <https://ci-beam.apache.org/job/beam_PostCommit_Python38/ws/src/sdks/python/apache_beam/io/gcp/bigquery_read_it_test.py>:808: FutureWarning: ReadAllFromBigQuery is experimental.
    | beam.io.ReadAllFromBigQuery())

apache_beam/io/gcp/bigquery_read_it_test.py::ReadAllBQTests::test_read_queries
  <https://ci-beam.apache.org/job/beam_PostCommit_Python38/ws/src/sdks/python/apache_beam/io/gcp/bigquery.py>:2658: BeamDeprecationWarning: options is deprecated since First stable release. References to <pipeline>.options will not be supported
    job_name = pcoll.pipeline.options.view_as(GoogleCloudOptions).job_name

apache_beam/io/gcp/bigquery_read_it_test.py::ReadAllBQTests::test_read_queries
  <https://ci-beam.apache.org/job/beam_PostCommit_Python38/ws/src/sdks/python/apache_beam/io/gcp/bigquery.py>:2659: BeamDeprecationWarning: options is deprecated since First stable release. References to <pipeline>.options will not be supported
    project = pcoll.pipeline.options.view_as(GoogleCloudOptions).project

apache_beam/io/gcp/bigquery_read_it_test.py::ReadAllBQTests::test_read_queries
  <https://ci-beam.apache.org/job/beam_PostCommit_Python38/ws/src/sdks/python/apache_beam/io/gcp/bigquery.py>:2672: BeamDeprecationWarning: options is deprecated since First stable release. References to <pipeline>.options will not be supported
    options=pcoll.pipeline.options,

-- Docs: https://docs.pytest.org/en/stable/how-to/capture-warnings.html
- generated xml file: <https://ci-beam.apache.org/job/beam_PostCommit_Python38/ws/src/sdks/python/pytest_postCommitIT-df-py38.xml> -
========== 85 passed, 24 skipped, 257 warnings in 10367.48s (2:52:47) ==========

FAILURE: Build completed with 2 failures.

1: Task failed with an exception.
-----------
* What went wrong:
Execution failed for task ':sdks:java:container:pullLicenses'.
> Process 'command './license_scripts/license_script.sh'' finished with non-zero exit value 1

* Try:
> Run with --stacktrace option to get the stack trace.
> Run with --info or --debug option to get more log output.
==============================================================================

2: Task failed with an exception.
-----------
* Where:
Script '<https://ci-beam.apache.org/job/beam_PostCommit_Python38/ws/src/sdks/python/test-suites/direct/common.gradle'> line: 185

* What went wrong:
Execution failed for task ':sdks:python:test-suites:direct:py38:hdfsIntegrationTest'.
> Process 'command 'sh'' finished with non-zero exit value 1

* Try:
> Run with --stacktrace option to get the stack trace.
> Run with --info or --debug option to get more log output.
==============================================================================

* Get more help at https://help.gradle.org

Deprecated Gradle features were used in this build, making it incompatible with Gradle 8.0.

You can use '--warning-mode all' to show the individual deprecation warnings and determine if they come from your own scripts or plugins.

See https://docs.gradle.org/7.5.1/userguide/command_line_interface.html#sec:command_line_warnings

Execution optimizations have been disabled for 1 invalid unit(s) of work during this build to ensure correctness.
Please consult deprecation warnings for more details.

BUILD FAILED in 3h 8m 53s
201 actionable tasks: 144 executed, 51 from cache, 6 up-to-date

Publishing build scan...
https://gradle.com/s/rtpjqkdlkw6qy

Build step 'Invoke Gradle script' changed build result to FAILURE
Build step 'Invoke Gradle script' marked build as failure

---------------------------------------------------------------------
To unsubscribe, e-mail: builds-unsubscribe@beam.apache.org
For additional commands, e-mail: builds-help@beam.apache.org


Build failed in Jenkins: beam_PostCommit_Python38 #3736

Posted by Apache Jenkins Server <je...@builds.apache.org>.
See <https://ci-beam.apache.org/job/beam_PostCommit_Python38/3736/display/redirect>

Changes:


------------------------------------------
[...truncated 10.52 MB...]
../../build/gradleenv/-1734967051/lib/python3.8/site-packages/tenacity/_asyncio.py:42
../../build/gradleenv/-1734967051/lib/python3.8/site-packages/tenacity/_asyncio.py:42
../../build/gradleenv/-1734967051/lib/python3.8/site-packages/tenacity/_asyncio.py:42
../../build/gradleenv/-1734967051/lib/python3.8/site-packages/tenacity/_asyncio.py:42
../../build/gradleenv/-1734967051/lib/python3.8/site-packages/tenacity/_asyncio.py:42
../../build/gradleenv/-1734967051/lib/python3.8/site-packages/tenacity/_asyncio.py:42
  <https://ci-beam.apache.org/job/beam_PostCommit_Python38/ws/src/build/gradleenv/-1734967051/lib/python3.8/site-packages/tenacity/_asyncio.py>:42: DeprecationWarning: "@coroutine" decorator is deprecated since Python 3.8, use "async def" instead
    def call(self, fn, *args, **kwargs):

apache_beam/typehints/pandas_type_compatibility_test.py:67
apache_beam/typehints/pandas_type_compatibility_test.py:67
apache_beam/typehints/pandas_type_compatibility_test.py:67
apache_beam/typehints/pandas_type_compatibility_test.py:67
apache_beam/typehints/pandas_type_compatibility_test.py:67
apache_beam/typehints/pandas_type_compatibility_test.py:67
apache_beam/typehints/pandas_type_compatibility_test.py:67
apache_beam/typehints/pandas_type_compatibility_test.py:67
  <https://ci-beam.apache.org/job/beam_PostCommit_Python38/ws/src/sdks/python/apache_beam/typehints/pandas_type_compatibility_test.py>:67: FutureWarning: pandas.Int64Index is deprecated and will be removed from pandas in a future version. Use pandas.Index with the appropriate dtype instead.
    }).set_index(pd.Int64Index(range(123, 223), name='an_index')),

apache_beam/typehints/pandas_type_compatibility_test.py:90
apache_beam/typehints/pandas_type_compatibility_test.py:90
apache_beam/typehints/pandas_type_compatibility_test.py:90
apache_beam/typehints/pandas_type_compatibility_test.py:90
apache_beam/typehints/pandas_type_compatibility_test.py:90
apache_beam/typehints/pandas_type_compatibility_test.py:90
apache_beam/typehints/pandas_type_compatibility_test.py:90
apache_beam/typehints/pandas_type_compatibility_test.py:90
  <https://ci-beam.apache.org/job/beam_PostCommit_Python38/ws/src/sdks/python/apache_beam/typehints/pandas_type_compatibility_test.py>:90: FutureWarning: pandas.Int64Index is deprecated and will be removed from pandas in a future version. Use pandas.Index with the appropriate dtype instead.
    pd.Int64Index(range(123, 223), name='an_index'),

apache_beam/typehints/pandas_type_compatibility_test.py:91
apache_beam/typehints/pandas_type_compatibility_test.py:91
apache_beam/typehints/pandas_type_compatibility_test.py:91
apache_beam/typehints/pandas_type_compatibility_test.py:91
apache_beam/typehints/pandas_type_compatibility_test.py:91
apache_beam/typehints/pandas_type_compatibility_test.py:91
apache_beam/typehints/pandas_type_compatibility_test.py:91
apache_beam/typehints/pandas_type_compatibility_test.py:91
  <https://ci-beam.apache.org/job/beam_PostCommit_Python38/ws/src/sdks/python/apache_beam/typehints/pandas_type_compatibility_test.py>:91: FutureWarning: pandas.Int64Index is deprecated and will be removed from pandas in a future version. Use pandas.Index with the appropriate dtype instead.
    pd.Int64Index(range(475, 575), name='another_index'),

apache_beam/dataframe/io_it_test.py: 3 warnings
apache_beam/examples/cookbook/bigquery_tornadoes_it_test.py: 1 warning
apache_beam/examples/dataframe/flight_delays_it_test.py: 1 warning
apache_beam/io/gcp/big_query_query_to_table_it_test.py: 4 warnings
apache_beam/io/gcp/bigquery_io_read_it_test.py: 2 warnings
apache_beam/io/gcp/bigquery_read_it_test.py: 7 warnings
apache_beam/io/gcp/bigquery_json_it_test.py: 3 warnings
  <https://ci-beam.apache.org/job/beam_PostCommit_Python38/ws/src/sdks/python/apache_beam/io/gcp/bigquery.py>:2485: BeamDeprecationWarning: options is deprecated since First stable release. References to <pipeline>.options will not be supported
    temp_location = pcoll.pipeline.options.view_as(

apache_beam/dataframe/io_it_test.py: 3 warnings
apache_beam/examples/cookbook/bigquery_tornadoes_it_test.py: 1 warning
apache_beam/examples/dataframe/flight_delays_it_test.py: 1 warning
apache_beam/io/gcp/big_query_query_to_table_it_test.py: 4 warnings
apache_beam/io/gcp/bigquery_io_read_it_test.py: 2 warnings
apache_beam/io/gcp/bigquery_read_it_test.py: 7 warnings
apache_beam/io/gcp/bigquery_json_it_test.py: 3 warnings
  <https://ci-beam.apache.org/job/beam_PostCommit_Python38/ws/src/sdks/python/apache_beam/io/gcp/bigquery.py>:2487: BeamDeprecationWarning: options is deprecated since First stable release. References to <pipeline>.options will not be supported
    job_name = pcoll.pipeline.options.view_as(GoogleCloudOptions).job_name

apache_beam/dataframe/io_it_test.py: 3 warnings
apache_beam/examples/cookbook/bigquery_tornadoes_it_test.py: 1 warning
apache_beam/examples/dataframe/flight_delays_it_test.py: 1 warning
apache_beam/io/gcp/big_query_query_to_table_it_test.py: 4 warnings
apache_beam/io/gcp/bigquery_io_read_it_test.py: 2 warnings
apache_beam/io/gcp/bigquery_read_it_test.py: 7 warnings
apache_beam/io/gcp/bigquery_json_it_test.py: 3 warnings
  <https://ci-beam.apache.org/job/beam_PostCommit_Python38/ws/src/sdks/python/apache_beam/io/gcp/bigquery.py>:2511: BeamDeprecationWarning: options is deprecated since First stable release. References to <pipeline>.options will not be supported
    pipeline_options=pcoll.pipeline.options,

apache_beam/examples/complete/game/game_stats_it_test.py::GameStatsIT::test_game_stats_it
apache_beam/examples/complete/game/hourly_team_score_it_test.py::HourlyTeamScoreIT::test_hourly_team_score_it
apache_beam/examples/complete/game/leader_board_it_test.py::LeaderBoardIT::test_leader_board_it
apache_beam/io/gcp/bigquery_test.py::PubSubBigQueryIT::test_file_loads
apache_beam/io/gcp/bigquery_test.py::PubSubBigQueryIT::test_streaming_inserts
  <https://ci-beam.apache.org/job/beam_PostCommit_Python38/ws/src/sdks/python/apache_beam/io/gcp/tests/utils.py>:63: PendingDeprecationWarning: Client.dataset is deprecated and will be removed in a future version. Use a string like 'my_project.my_dataset' or a cloud.google.bigquery.DatasetReference object, instead.
    dataset_ref = client.dataset(unique_dataset_name, project=project)

apache_beam/examples/complete/game/game_stats_it_test.py: 2 warnings
apache_beam/examples/cookbook/bigquery_tornadoes_it_test.py: 1 warning
apache_beam/examples/complete/game/hourly_team_score_it_test.py: 1 warning
apache_beam/io/gcp/big_query_query_to_table_it_test.py: 4 warnings
apache_beam/examples/complete/game/leader_board_it_test.py: 2 warnings
apache_beam/io/gcp/bigquery_file_loads_test.py: 3 warnings
apache_beam/io/gcp/bigquery_test.py: 6 warnings
apache_beam/io/gcp/bigquery_json_it_test.py: 2 warnings
apache_beam/io/gcp/bigquery_write_it_test.py: 4 warnings
  <https://ci-beam.apache.org/job/beam_PostCommit_Python38/ws/src/sdks/python/apache_beam/io/gcp/bigquery.py>:1992: BeamDeprecationWarning: options is deprecated since First stable release. References to <pipeline>.options will not be supported
    is_streaming_pipeline = p.options.view_as(StandardOptions).streaming

apache_beam/examples/complete/game/game_stats_it_test.py: 2 warnings
apache_beam/examples/cookbook/bigquery_tornadoes_it_test.py: 1 warning
apache_beam/examples/complete/game/hourly_team_score_it_test.py: 1 warning
apache_beam/io/gcp/big_query_query_to_table_it_test.py: 4 warnings
apache_beam/examples/complete/game/leader_board_it_test.py: 2 warnings
apache_beam/io/gcp/bigquery_file_loads_test.py: 3 warnings
apache_beam/io/gcp/bigquery_test.py: 6 warnings
apache_beam/io/gcp/bigquery_json_it_test.py: 2 warnings
apache_beam/io/gcp/bigquery_write_it_test.py: 4 warnings
  <https://ci-beam.apache.org/job/beam_PostCommit_Python38/ws/src/sdks/python/apache_beam/io/gcp/bigquery.py>:1998: BeamDeprecationWarning: options is deprecated since First stable release. References to <pipeline>.options will not be supported
    experiments = p.options.view_as(DebugOptions).experiments or []

apache_beam/dataframe/io_it_test.py: 2 warnings
apache_beam/io/gcp/bigquery_json_it_test.py: 1 warning
apache_beam/io/gcp/bigquery_read_it_test.py: 9 warnings
  <https://ci-beam.apache.org/job/beam_PostCommit_Python38/ws/src/sdks/python/apache_beam/io/gcp/bigquery.py>:2529: BeamDeprecationWarning: options is deprecated since First stable release. References to <pipeline>.options will not be supported
    project_id = pcoll.pipeline.options.view_as(GoogleCloudOptions).project

apache_beam/dataframe/io_it_test.py: 2 warnings
apache_beam/io/gcp/bigquery_json_it_test.py: 1 warning
apache_beam/io/gcp/bigquery_read_it_test.py: 9 warnings
  <https://ci-beam.apache.org/job/beam_PostCommit_Python38/ws/src/sdks/python/apache_beam/io/gcp/bigquery.py>:2550: BeamDeprecationWarning: options is deprecated since First stable release. References to <pipeline>.options will not be supported
    pipeline_options=pcoll.pipeline.options,

apache_beam/examples/cookbook/bigquery_tornadoes_it_test.py: 1 warning
apache_beam/io/gcp/big_query_query_to_table_it_test.py: 4 warnings
apache_beam/io/gcp/bigquery_write_it_test.py: 4 warnings
apache_beam/io/gcp/bigquery_test.py: 2 warnings
  <https://ci-beam.apache.org/job/beam_PostCommit_Python38/ws/src/sdks/python/apache_beam/io/gcp/bigquery.py>:1988: BeamDeprecationWarning: options is deprecated since First stable release. References to <pipeline>.options will not be supported
    self.table_reference.projectId = pcoll.pipeline.options.view_as(

apache_beam/examples/cookbook/bigquery_tornadoes_it_test.py: 1 warning
apache_beam/io/gcp/big_query_query_to_table_it_test.py: 4 warnings
apache_beam/io/gcp/bigquery_file_loads_test.py: 3 warnings
apache_beam/io/gcp/bigquery_test.py: 3 warnings
apache_beam/io/gcp/bigquery_write_it_test.py: 3 warnings
  <https://ci-beam.apache.org/job/beam_PostCommit_Python38/ws/src/sdks/python/apache_beam/io/gcp/bigquery_file_loads.py>:1166: BeamDeprecationWarning: options is deprecated since First stable release. References to <pipeline>.options will not be supported
    self.project = self.project or p.options.view_as(GoogleCloudOptions).project

apache_beam/examples/cookbook/bigquery_tornadoes_it_test.py: 1 warning
apache_beam/examples/complete/game/hourly_team_score_it_test.py: 1 warning
apache_beam/io/gcp/big_query_query_to_table_it_test.py: 4 warnings
apache_beam/io/gcp/bigquery_file_loads_test.py: 3 warnings
apache_beam/io/gcp/bigquery_test.py: 3 warnings
apache_beam/io/gcp/bigquery_write_it_test.py: 3 warnings
  <https://ci-beam.apache.org/job/beam_PostCommit_Python38/ws/src/sdks/python/apache_beam/io/gcp/bigquery_file_loads.py>:1173: BeamDeprecationWarning: options is deprecated since First stable release. References to <pipeline>.options will not be supported
    temp_location = p.options.view_as(GoogleCloudOptions).temp_location

apache_beam/examples/cookbook/bigquery_tornadoes_it_test.py: 1 warning
apache_beam/examples/complete/game/hourly_team_score_it_test.py: 1 warning
apache_beam/io/gcp/big_query_query_to_table_it_test.py: 4 warnings
apache_beam/io/gcp/bigquery_file_loads_test.py: 3 warnings
apache_beam/io/gcp/bigquery_test.py: 3 warnings
apache_beam/io/gcp/bigquery_write_it_test.py: 3 warnings
  <https://ci-beam.apache.org/job/beam_PostCommit_Python38/ws/src/sdks/python/apache_beam/io/gcp/bigquery_file_loads.py>:1175: BeamDeprecationWarning: options is deprecated since First stable release. References to <pipeline>.options will not be supported
    p.options.view_as(GoogleCloudOptions).job_name or 'AUTOMATIC_JOB_NAME')

apache_beam/examples/cookbook/bigquery_tornadoes_it_test.py::BigqueryTornadoesIT::test_bigquery_tornadoes_it
  <https://ci-beam.apache.org/job/beam_PostCommit_Python38/ws/src/sdks/python/apache_beam/io/gcp/tests/utils.py>:100: PendingDeprecationWarning: Client.dataset is deprecated and will be removed in a future version. Use a string like 'my_project.my_dataset' or a cloud.google.bigquery.DatasetReference object, instead.
    table_ref = client.dataset(dataset_id).table(table_id)

apache_beam/examples/dataframe/flight_delays_it_test.py::FlightDelaysTest::test_flight_delays
  <https://ci-beam.apache.org/job/beam_PostCommit_Python38/ws/src/sdks/python/apache_beam/examples/dataframe/flight_delays.py>:47: FutureWarning: The default value of numeric_only in DataFrame.mean is deprecated. In a future version, it will default to False. In addition, specifying 'numeric_only=None' is deprecated. Select only valid columns or specify the value of numeric_only to silence this warning.
    return airline_df[at_top_airports].mean()

apache_beam/examples/dataframe/flight_delays_it_test.py::FlightDelaysTest::test_flight_delays
apache_beam/examples/dataframe/taxiride_it_test.py::TaxirideIT::test_aggregation
apache_beam/examples/dataframe/taxiride_it_test.py::TaxirideIT::test_enrich
  <https://ci-beam.apache.org/job/beam_PostCommit_Python38/ws/src/sdks/python/apache_beam/dataframe/io.py>:659: FutureWarning: WriteToFiles is experimental.
    return pcoll | fileio.WriteToFiles(

apache_beam/examples/dataframe/flight_delays_it_test.py::FlightDelaysTest::test_flight_delays
apache_beam/examples/dataframe/taxiride_it_test.py::TaxirideIT::test_aggregation
apache_beam/examples/dataframe/taxiride_it_test.py::TaxirideIT::test_enrich
  <https://ci-beam.apache.org/job/beam_PostCommit_Python38/ws/src/sdks/python/apache_beam/io/fileio.py>:591: BeamDeprecationWarning: options is deprecated since First stable release. References to <pipeline>.options will not be supported
    p.options.view_as(GoogleCloudOptions).temp_location or

apache_beam/io/gcp/bigquery_test.py::BigQueryStreamingInsertTransformIntegrationTests::test_multiple_destinations_transform
  <https://ci-beam.apache.org/job/beam_PostCommit_Python38/ws/src/sdks/python/apache_beam/io/gcp/bigquery_test.py>:1690: BeamDeprecationWarning: options is deprecated since First stable release. References to <pipeline>.options will not be supported
    streaming = self.test_pipeline.options.view_as(StandardOptions).streaming

apache_beam/io/gcp/bigquery_read_it_test.py::ReadTests::test_native_source
  <https://ci-beam.apache.org/job/beam_PostCommit_Python38/ws/src/sdks/python/apache_beam/io/gcp/bigquery_read_it_test.py>:170: BeamDeprecationWarning: BigQuerySource is deprecated since 2.25.0. Use ReadFromBigQuery instead.
    beam.io.BigQuerySource(query=self.query, use_standard_sql=True)))

apache_beam/ml/inference/sklearn_inference_it_test.py::SklearnInference::test_sklearn_regression
  <https://ci-beam.apache.org/job/beam_PostCommit_Python38/ws/src/sdks/python/apache_beam/examples/inference/sklearn_japanese_housing_regression.py>:128: FutureWarning: SklearnModelHandlerPandas is experimental. No backwards-compatibility guarantees.
    model_loader = SklearnModelHandlerPandas(

apache_beam/ml/inference/sklearn_inference_it_test.py::SklearnInference::test_sklearn_regression
  <https://ci-beam.apache.org/job/beam_PostCommit_Python38/ws/src/build/gradleenv/-1734967051/lib/python3.8/site-packages/dill/_dill.py>:472: FutureWarning: SklearnModelHandlerPandas is experimental. No backwards-compatibility guarantees.
    obj = StockUnpickler.load(self)

apache_beam/ml/gcp/cloud_dlp_it_test.py::CloudDLPIT::test_deidentification
  <https://ci-beam.apache.org/job/beam_PostCommit_Python38/ws/src/sdks/python/apache_beam/ml/gcp/cloud_dlp_it_test.py>:74: FutureWarning: MaskDetectedDetails is experimental.
    | MaskDetectedDetails(

apache_beam/ml/gcp/cloud_dlp_it_test.py::CloudDLPIT::test_inspection
  <https://ci-beam.apache.org/job/beam_PostCommit_Python38/ws/src/sdks/python/apache_beam/ml/gcp/cloud_dlp_it_test.py>:85: FutureWarning: InspectForDetails is experimental.
    | InspectForDetails(

apache_beam/io/gcp/bigquery_read_it_test.py::ReadNewTypesTests::test_native_source
  <https://ci-beam.apache.org/job/beam_PostCommit_Python38/ws/src/sdks/python/apache_beam/io/gcp/bigquery_read_it_test.py>:693: BeamDeprecationWarning: BigQuerySource is deprecated since 2.25.0. Use ReadFromBigQuery instead.
    beam.io.BigQuerySource(query=self.query, use_standard_sql=True)))

apache_beam/io/gcp/bigquery_read_it_test.py::ReadAllBQTests::test_read_queries
  <https://ci-beam.apache.org/job/beam_PostCommit_Python38/ws/src/sdks/python/apache_beam/io/gcp/bigquery_read_it_test.py>:808: FutureWarning: ReadAllFromBigQuery is experimental.
    | beam.io.ReadAllFromBigQuery())

apache_beam/io/gcp/bigquery_read_it_test.py::ReadAllBQTests::test_read_queries
  <https://ci-beam.apache.org/job/beam_PostCommit_Python38/ws/src/sdks/python/apache_beam/io/gcp/bigquery.py>:2658: BeamDeprecationWarning: options is deprecated since First stable release. References to <pipeline>.options will not be supported
    job_name = pcoll.pipeline.options.view_as(GoogleCloudOptions).job_name

apache_beam/io/gcp/bigquery_read_it_test.py::ReadAllBQTests::test_read_queries
  <https://ci-beam.apache.org/job/beam_PostCommit_Python38/ws/src/sdks/python/apache_beam/io/gcp/bigquery.py>:2659: BeamDeprecationWarning: options is deprecated since First stable release. References to <pipeline>.options will not be supported
    project = pcoll.pipeline.options.view_as(GoogleCloudOptions).project

apache_beam/io/gcp/bigquery_read_it_test.py::ReadAllBQTests::test_read_queries
  <https://ci-beam.apache.org/job/beam_PostCommit_Python38/ws/src/sdks/python/apache_beam/io/gcp/bigquery.py>:2672: BeamDeprecationWarning: options is deprecated since First stable release. References to <pipeline>.options will not be supported
    options=pcoll.pipeline.options,

-- Docs: https://docs.pytest.org/en/stable/how-to/capture-warnings.html
- generated xml file: <https://ci-beam.apache.org/job/beam_PostCommit_Python38/ws/src/sdks/python/pytest_postCommitIT-df-py38.xml> -
========== 85 passed, 24 skipped, 257 warnings in 11928.07s (3:18:48) ==========

FAILURE: Build failed with an exception.

* Where:
Script '<https://ci-beam.apache.org/job/beam_PostCommit_Python38/ws/src/sdks/python/test-suites/direct/common.gradle'> line: 185

* What went wrong:
Execution failed for task ':sdks:python:test-suites:direct:py38:hdfsIntegrationTest'.
> Process 'command 'sh'' finished with non-zero exit value 1

* Try:
> Run with --stacktrace option to get the stack trace.
> Run with --info or --debug option to get more log output.

* Get more help at https://help.gradle.org

Deprecated Gradle features were used in this build, making it incompatible with Gradle 8.0.

You can use '--warning-mode all' to show the individual deprecation warnings and determine if they come from your own scripts or plugins.

See https://docs.gradle.org/7.5.1/userguide/command_line_interface.html#sec:command_line_warnings

Execution optimizations have been disabled for 1 invalid unit(s) of work during this build to ensure correctness.
Please consult deprecation warnings for more details.

BUILD FAILED in 3h 33m 51s
205 actionable tasks: 141 executed, 58 from cache, 6 up-to-date

Publishing build scan...
https://gradle.com/s/arwxyd5pu5oaa

Build step 'Invoke Gradle script' changed build result to FAILURE
Build step 'Invoke Gradle script' marked build as failure

---------------------------------------------------------------------
To unsubscribe, e-mail: builds-unsubscribe@beam.apache.org
For additional commands, e-mail: builds-help@beam.apache.org


Build failed in Jenkins: beam_PostCommit_Python38 #3735

Posted by Apache Jenkins Server <je...@builds.apache.org>.
See <https://ci-beam.apache.org/job/beam_PostCommit_Python38/3735/display/redirect>

Changes:


------------------------------------------
[...truncated 10.47 MB...]
../../build/gradleenv/-1734967051/lib/python3.8/site-packages/tenacity/_asyncio.py:42
../../build/gradleenv/-1734967051/lib/python3.8/site-packages/tenacity/_asyncio.py:42
../../build/gradleenv/-1734967051/lib/python3.8/site-packages/tenacity/_asyncio.py:42
../../build/gradleenv/-1734967051/lib/python3.8/site-packages/tenacity/_asyncio.py:42
../../build/gradleenv/-1734967051/lib/python3.8/site-packages/tenacity/_asyncio.py:42
../../build/gradleenv/-1734967051/lib/python3.8/site-packages/tenacity/_asyncio.py:42
  <https://ci-beam.apache.org/job/beam_PostCommit_Python38/ws/src/build/gradleenv/-1734967051/lib/python3.8/site-packages/tenacity/_asyncio.py>:42: DeprecationWarning: "@coroutine" decorator is deprecated since Python 3.8, use "async def" instead
    def call(self, fn, *args, **kwargs):

apache_beam/typehints/pandas_type_compatibility_test.py:67
apache_beam/typehints/pandas_type_compatibility_test.py:67
apache_beam/typehints/pandas_type_compatibility_test.py:67
apache_beam/typehints/pandas_type_compatibility_test.py:67
apache_beam/typehints/pandas_type_compatibility_test.py:67
apache_beam/typehints/pandas_type_compatibility_test.py:67
apache_beam/typehints/pandas_type_compatibility_test.py:67
apache_beam/typehints/pandas_type_compatibility_test.py:67
  <https://ci-beam.apache.org/job/beam_PostCommit_Python38/ws/src/sdks/python/apache_beam/typehints/pandas_type_compatibility_test.py>:67: FutureWarning: pandas.Int64Index is deprecated and will be removed from pandas in a future version. Use pandas.Index with the appropriate dtype instead.
    }).set_index(pd.Int64Index(range(123, 223), name='an_index')),

apache_beam/typehints/pandas_type_compatibility_test.py:90
apache_beam/typehints/pandas_type_compatibility_test.py:90
apache_beam/typehints/pandas_type_compatibility_test.py:90
apache_beam/typehints/pandas_type_compatibility_test.py:90
apache_beam/typehints/pandas_type_compatibility_test.py:90
apache_beam/typehints/pandas_type_compatibility_test.py:90
apache_beam/typehints/pandas_type_compatibility_test.py:90
apache_beam/typehints/pandas_type_compatibility_test.py:90
  <https://ci-beam.apache.org/job/beam_PostCommit_Python38/ws/src/sdks/python/apache_beam/typehints/pandas_type_compatibility_test.py>:90: FutureWarning: pandas.Int64Index is deprecated and will be removed from pandas in a future version. Use pandas.Index with the appropriate dtype instead.
    pd.Int64Index(range(123, 223), name='an_index'),

apache_beam/typehints/pandas_type_compatibility_test.py:91
apache_beam/typehints/pandas_type_compatibility_test.py:91
apache_beam/typehints/pandas_type_compatibility_test.py:91
apache_beam/typehints/pandas_type_compatibility_test.py:91
apache_beam/typehints/pandas_type_compatibility_test.py:91
apache_beam/typehints/pandas_type_compatibility_test.py:91
apache_beam/typehints/pandas_type_compatibility_test.py:91
apache_beam/typehints/pandas_type_compatibility_test.py:91
  <https://ci-beam.apache.org/job/beam_PostCommit_Python38/ws/src/sdks/python/apache_beam/typehints/pandas_type_compatibility_test.py>:91: FutureWarning: pandas.Int64Index is deprecated and will be removed from pandas in a future version. Use pandas.Index with the appropriate dtype instead.
    pd.Int64Index(range(475, 575), name='another_index'),

apache_beam/dataframe/io_it_test.py: 3 warnings
apache_beam/examples/cookbook/bigquery_tornadoes_it_test.py: 1 warning
apache_beam/examples/dataframe/flight_delays_it_test.py: 1 warning
apache_beam/io/gcp/bigquery_io_read_it_test.py: 2 warnings
apache_beam/io/gcp/bigquery_read_it_test.py: 7 warnings
apache_beam/io/gcp/big_query_query_to_table_it_test.py: 4 warnings
apache_beam/io/gcp/bigquery_json_it_test.py: 3 warnings
  <https://ci-beam.apache.org/job/beam_PostCommit_Python38/ws/src/sdks/python/apache_beam/io/gcp/bigquery.py>:2485: BeamDeprecationWarning: options is deprecated since First stable release. References to <pipeline>.options will not be supported
    temp_location = pcoll.pipeline.options.view_as(

apache_beam/dataframe/io_it_test.py: 3 warnings
apache_beam/examples/cookbook/bigquery_tornadoes_it_test.py: 1 warning
apache_beam/examples/dataframe/flight_delays_it_test.py: 1 warning
apache_beam/io/gcp/bigquery_io_read_it_test.py: 2 warnings
apache_beam/io/gcp/bigquery_read_it_test.py: 7 warnings
apache_beam/io/gcp/big_query_query_to_table_it_test.py: 4 warnings
apache_beam/io/gcp/bigquery_json_it_test.py: 3 warnings
  <https://ci-beam.apache.org/job/beam_PostCommit_Python38/ws/src/sdks/python/apache_beam/io/gcp/bigquery.py>:2487: BeamDeprecationWarning: options is deprecated since First stable release. References to <pipeline>.options will not be supported
    job_name = pcoll.pipeline.options.view_as(GoogleCloudOptions).job_name

apache_beam/dataframe/io_it_test.py: 3 warnings
apache_beam/examples/cookbook/bigquery_tornadoes_it_test.py: 1 warning
apache_beam/examples/dataframe/flight_delays_it_test.py: 1 warning
apache_beam/io/gcp/bigquery_io_read_it_test.py: 2 warnings
apache_beam/io/gcp/bigquery_read_it_test.py: 7 warnings
apache_beam/io/gcp/big_query_query_to_table_it_test.py: 4 warnings
apache_beam/io/gcp/bigquery_json_it_test.py: 3 warnings
  <https://ci-beam.apache.org/job/beam_PostCommit_Python38/ws/src/sdks/python/apache_beam/io/gcp/bigquery.py>:2511: BeamDeprecationWarning: options is deprecated since First stable release. References to <pipeline>.options will not be supported
    pipeline_options=pcoll.pipeline.options,

apache_beam/examples/complete/game/game_stats_it_test.py::GameStatsIT::test_game_stats_it
apache_beam/examples/complete/game/hourly_team_score_it_test.py::HourlyTeamScoreIT::test_hourly_team_score_it
apache_beam/examples/complete/game/leader_board_it_test.py::LeaderBoardIT::test_leader_board_it
apache_beam/io/gcp/bigquery_test.py::PubSubBigQueryIT::test_file_loads
apache_beam/io/gcp/bigquery_test.py::PubSubBigQueryIT::test_streaming_inserts
  <https://ci-beam.apache.org/job/beam_PostCommit_Python38/ws/src/sdks/python/apache_beam/io/gcp/tests/utils.py>:63: PendingDeprecationWarning: Client.dataset is deprecated and will be removed in a future version. Use a string like 'my_project.my_dataset' or a cloud.google.bigquery.DatasetReference object, instead.
    dataset_ref = client.dataset(unique_dataset_name, project=project)

apache_beam/examples/complete/game/game_stats_it_test.py: 2 warnings
apache_beam/examples/cookbook/bigquery_tornadoes_it_test.py: 1 warning
apache_beam/examples/complete/game/hourly_team_score_it_test.py: 1 warning
apache_beam/examples/complete/game/leader_board_it_test.py: 2 warnings
apache_beam/io/gcp/big_query_query_to_table_it_test.py: 4 warnings
apache_beam/io/gcp/bigquery_test.py: 6 warnings
apache_beam/io/gcp/bigquery_write_it_test.py: 4 warnings
apache_beam/io/gcp/bigquery_json_it_test.py: 2 warnings
apache_beam/io/gcp/bigquery_file_loads_test.py: 3 warnings
  <https://ci-beam.apache.org/job/beam_PostCommit_Python38/ws/src/sdks/python/apache_beam/io/gcp/bigquery.py>:1992: BeamDeprecationWarning: options is deprecated since First stable release. References to <pipeline>.options will not be supported
    is_streaming_pipeline = p.options.view_as(StandardOptions).streaming

apache_beam/examples/complete/game/game_stats_it_test.py: 2 warnings
apache_beam/examples/cookbook/bigquery_tornadoes_it_test.py: 1 warning
apache_beam/examples/complete/game/hourly_team_score_it_test.py: 1 warning
apache_beam/examples/complete/game/leader_board_it_test.py: 2 warnings
apache_beam/io/gcp/big_query_query_to_table_it_test.py: 4 warnings
apache_beam/io/gcp/bigquery_test.py: 6 warnings
apache_beam/io/gcp/bigquery_write_it_test.py: 4 warnings
apache_beam/io/gcp/bigquery_json_it_test.py: 2 warnings
apache_beam/io/gcp/bigquery_file_loads_test.py: 3 warnings
  <https://ci-beam.apache.org/job/beam_PostCommit_Python38/ws/src/sdks/python/apache_beam/io/gcp/bigquery.py>:1998: BeamDeprecationWarning: options is deprecated since First stable release. References to <pipeline>.options will not be supported
    experiments = p.options.view_as(DebugOptions).experiments or []

apache_beam/dataframe/io_it_test.py: 2 warnings
apache_beam/io/gcp/bigquery_json_it_test.py: 1 warning
apache_beam/io/gcp/bigquery_read_it_test.py: 9 warnings
  <https://ci-beam.apache.org/job/beam_PostCommit_Python38/ws/src/sdks/python/apache_beam/io/gcp/bigquery.py>:2529: BeamDeprecationWarning: options is deprecated since First stable release. References to <pipeline>.options will not be supported
    project_id = pcoll.pipeline.options.view_as(GoogleCloudOptions).project

apache_beam/dataframe/io_it_test.py: 2 warnings
apache_beam/io/gcp/bigquery_json_it_test.py: 1 warning
apache_beam/io/gcp/bigquery_read_it_test.py: 9 warnings
  <https://ci-beam.apache.org/job/beam_PostCommit_Python38/ws/src/sdks/python/apache_beam/io/gcp/bigquery.py>:2550: BeamDeprecationWarning: options is deprecated since First stable release. References to <pipeline>.options will not be supported
    pipeline_options=pcoll.pipeline.options,

apache_beam/examples/cookbook/bigquery_tornadoes_it_test.py: 1 warning
apache_beam/io/gcp/big_query_query_to_table_it_test.py: 4 warnings
apache_beam/io/gcp/bigquery_write_it_test.py: 4 warnings
apache_beam/io/gcp/bigquery_test.py: 2 warnings
  <https://ci-beam.apache.org/job/beam_PostCommit_Python38/ws/src/sdks/python/apache_beam/io/gcp/bigquery.py>:1988: BeamDeprecationWarning: options is deprecated since First stable release. References to <pipeline>.options will not be supported
    self.table_reference.projectId = pcoll.pipeline.options.view_as(

apache_beam/examples/cookbook/bigquery_tornadoes_it_test.py: 1 warning
apache_beam/io/gcp/big_query_query_to_table_it_test.py: 4 warnings
apache_beam/io/gcp/bigquery_write_it_test.py: 3 warnings
apache_beam/io/gcp/bigquery_test.py: 3 warnings
apache_beam/io/gcp/bigquery_file_loads_test.py: 3 warnings
  <https://ci-beam.apache.org/job/beam_PostCommit_Python38/ws/src/sdks/python/apache_beam/io/gcp/bigquery_file_loads.py>:1166: BeamDeprecationWarning: options is deprecated since First stable release. References to <pipeline>.options will not be supported
    self.project = self.project or p.options.view_as(GoogleCloudOptions).project

apache_beam/examples/cookbook/bigquery_tornadoes_it_test.py: 1 warning
apache_beam/examples/complete/game/hourly_team_score_it_test.py: 1 warning
apache_beam/io/gcp/big_query_query_to_table_it_test.py: 4 warnings
apache_beam/io/gcp/bigquery_write_it_test.py: 3 warnings
apache_beam/io/gcp/bigquery_test.py: 3 warnings
apache_beam/io/gcp/bigquery_file_loads_test.py: 3 warnings
  <https://ci-beam.apache.org/job/beam_PostCommit_Python38/ws/src/sdks/python/apache_beam/io/gcp/bigquery_file_loads.py>:1173: BeamDeprecationWarning: options is deprecated since First stable release. References to <pipeline>.options will not be supported
    temp_location = p.options.view_as(GoogleCloudOptions).temp_location

apache_beam/examples/cookbook/bigquery_tornadoes_it_test.py: 1 warning
apache_beam/examples/complete/game/hourly_team_score_it_test.py: 1 warning
apache_beam/io/gcp/big_query_query_to_table_it_test.py: 4 warnings
apache_beam/io/gcp/bigquery_write_it_test.py: 3 warnings
apache_beam/io/gcp/bigquery_test.py: 3 warnings
apache_beam/io/gcp/bigquery_file_loads_test.py: 3 warnings
  <https://ci-beam.apache.org/job/beam_PostCommit_Python38/ws/src/sdks/python/apache_beam/io/gcp/bigquery_file_loads.py>:1175: BeamDeprecationWarning: options is deprecated since First stable release. References to <pipeline>.options will not be supported
    p.options.view_as(GoogleCloudOptions).job_name or 'AUTOMATIC_JOB_NAME')

apache_beam/examples/cookbook/bigquery_tornadoes_it_test.py::BigqueryTornadoesIT::test_bigquery_tornadoes_it
  <https://ci-beam.apache.org/job/beam_PostCommit_Python38/ws/src/sdks/python/apache_beam/io/gcp/tests/utils.py>:100: PendingDeprecationWarning: Client.dataset is deprecated and will be removed in a future version. Use a string like 'my_project.my_dataset' or a cloud.google.bigquery.DatasetReference object, instead.
    table_ref = client.dataset(dataset_id).table(table_id)

apache_beam/examples/dataframe/flight_delays_it_test.py::FlightDelaysTest::test_flight_delays
  <https://ci-beam.apache.org/job/beam_PostCommit_Python38/ws/src/sdks/python/apache_beam/examples/dataframe/flight_delays.py>:47: FutureWarning: The default value of numeric_only in DataFrame.mean is deprecated. In a future version, it will default to False. In addition, specifying 'numeric_only=None' is deprecated. Select only valid columns or specify the value of numeric_only to silence this warning.
    return airline_df[at_top_airports].mean()

apache_beam/examples/dataframe/flight_delays_it_test.py::FlightDelaysTest::test_flight_delays
apache_beam/examples/dataframe/taxiride_it_test.py::TaxirideIT::test_aggregation
apache_beam/examples/dataframe/taxiride_it_test.py::TaxirideIT::test_enrich
  <https://ci-beam.apache.org/job/beam_PostCommit_Python38/ws/src/sdks/python/apache_beam/dataframe/io.py>:659: FutureWarning: WriteToFiles is experimental.
    return pcoll | fileio.WriteToFiles(

apache_beam/examples/dataframe/flight_delays_it_test.py::FlightDelaysTest::test_flight_delays
apache_beam/examples/dataframe/taxiride_it_test.py::TaxirideIT::test_aggregation
apache_beam/examples/dataframe/taxiride_it_test.py::TaxirideIT::test_enrich
  <https://ci-beam.apache.org/job/beam_PostCommit_Python38/ws/src/sdks/python/apache_beam/io/fileio.py>:591: BeamDeprecationWarning: options is deprecated since First stable release. References to <pipeline>.options will not be supported
    p.options.view_as(GoogleCloudOptions).temp_location or

apache_beam/io/gcp/bigquery_test.py::BigQueryStreamingInsertTransformIntegrationTests::test_multiple_destinations_transform
  <https://ci-beam.apache.org/job/beam_PostCommit_Python38/ws/src/sdks/python/apache_beam/io/gcp/bigquery_test.py>:1690: BeamDeprecationWarning: options is deprecated since First stable release. References to <pipeline>.options will not be supported
    streaming = self.test_pipeline.options.view_as(StandardOptions).streaming

apache_beam/io/gcp/bigquery_read_it_test.py::ReadTests::test_native_source
  <https://ci-beam.apache.org/job/beam_PostCommit_Python38/ws/src/sdks/python/apache_beam/io/gcp/bigquery_read_it_test.py>:170: BeamDeprecationWarning: BigQuerySource is deprecated since 2.25.0. Use ReadFromBigQuery instead.
    beam.io.BigQuerySource(query=self.query, use_standard_sql=True)))

apache_beam/ml/gcp/cloud_dlp_it_test.py::CloudDLPIT::test_deidentification
  <https://ci-beam.apache.org/job/beam_PostCommit_Python38/ws/src/sdks/python/apache_beam/ml/gcp/cloud_dlp_it_test.py>:74: FutureWarning: MaskDetectedDetails is experimental.
    | MaskDetectedDetails(

apache_beam/ml/gcp/cloud_dlp_it_test.py::CloudDLPIT::test_inspection
  <https://ci-beam.apache.org/job/beam_PostCommit_Python38/ws/src/sdks/python/apache_beam/ml/gcp/cloud_dlp_it_test.py>:85: FutureWarning: InspectForDetails is experimental.
    | InspectForDetails(

apache_beam/ml/inference/sklearn_inference_it_test.py::SklearnInference::test_sklearn_regression
  <https://ci-beam.apache.org/job/beam_PostCommit_Python38/ws/src/sdks/python/apache_beam/examples/inference/sklearn_japanese_housing_regression.py>:128: FutureWarning: SklearnModelHandlerPandas is experimental. No backwards-compatibility guarantees.
    model_loader = SklearnModelHandlerPandas(

apache_beam/ml/inference/sklearn_inference_it_test.py::SklearnInference::test_sklearn_regression
  <https://ci-beam.apache.org/job/beam_PostCommit_Python38/ws/src/build/gradleenv/-1734967051/lib/python3.8/site-packages/dill/_dill.py>:472: FutureWarning: SklearnModelHandlerPandas is experimental. No backwards-compatibility guarantees.
    obj = StockUnpickler.load(self)

apache_beam/io/gcp/bigquery_read_it_test.py::ReadNewTypesTests::test_native_source
  <https://ci-beam.apache.org/job/beam_PostCommit_Python38/ws/src/sdks/python/apache_beam/io/gcp/bigquery_read_it_test.py>:693: BeamDeprecationWarning: BigQuerySource is deprecated since 2.25.0. Use ReadFromBigQuery instead.
    beam.io.BigQuerySource(query=self.query, use_standard_sql=True)))

apache_beam/io/gcp/bigquery_read_it_test.py::ReadAllBQTests::test_read_queries
  <https://ci-beam.apache.org/job/beam_PostCommit_Python38/ws/src/sdks/python/apache_beam/io/gcp/bigquery_read_it_test.py>:808: FutureWarning: ReadAllFromBigQuery is experimental.
    | beam.io.ReadAllFromBigQuery())

apache_beam/io/gcp/bigquery_read_it_test.py::ReadAllBQTests::test_read_queries
  <https://ci-beam.apache.org/job/beam_PostCommit_Python38/ws/src/sdks/python/apache_beam/io/gcp/bigquery.py>:2658: BeamDeprecationWarning: options is deprecated since First stable release. References to <pipeline>.options will not be supported
    job_name = pcoll.pipeline.options.view_as(GoogleCloudOptions).job_name

apache_beam/io/gcp/bigquery_read_it_test.py::ReadAllBQTests::test_read_queries
  <https://ci-beam.apache.org/job/beam_PostCommit_Python38/ws/src/sdks/python/apache_beam/io/gcp/bigquery.py>:2659: BeamDeprecationWarning: options is deprecated since First stable release. References to <pipeline>.options will not be supported
    project = pcoll.pipeline.options.view_as(GoogleCloudOptions).project

apache_beam/io/gcp/bigquery_read_it_test.py::ReadAllBQTests::test_read_queries
  <https://ci-beam.apache.org/job/beam_PostCommit_Python38/ws/src/sdks/python/apache_beam/io/gcp/bigquery.py>:2672: BeamDeprecationWarning: options is deprecated since First stable release. References to <pipeline>.options will not be supported
    options=pcoll.pipeline.options,

-- Docs: https://docs.pytest.org/en/stable/how-to/capture-warnings.html
- generated xml file: <https://ci-beam.apache.org/job/beam_PostCommit_Python38/ws/src/sdks/python/pytest_postCommitIT-df-py38.xml> -
========== 85 passed, 24 skipped, 257 warnings in 11611.64s (3:13:31) ==========

FAILURE: Build failed with an exception.

* Where:
Script '<https://ci-beam.apache.org/job/beam_PostCommit_Python38/ws/src/sdks/python/test-suites/direct/common.gradle'> line: 185

* What went wrong:
Execution failed for task ':sdks:python:test-suites:direct:py38:hdfsIntegrationTest'.
> Process 'command 'sh'' finished with non-zero exit value 1

* Try:
> Run with --stacktrace option to get the stack trace.
> Run with --info or --debug option to get more log output.

* Get more help at https://help.gradle.org

Deprecated Gradle features were used in this build, making it incompatible with Gradle 8.0.

You can use '--warning-mode all' to show the individual deprecation warnings and determine if they come from your own scripts or plugins.

See https://docs.gradle.org/7.5.1/userguide/command_line_interface.html#sec:command_line_warnings

Execution optimizations have been disabled for 1 invalid unit(s) of work during this build to ensure correctness.
Please consult deprecation warnings for more details.

BUILD FAILED in 3h 28m 24s
205 actionable tasks: 141 executed, 58 from cache, 6 up-to-date

Publishing build scan...
https://gradle.com/s/fkqlf4qkjxz2g

Build step 'Invoke Gradle script' changed build result to FAILURE
Build step 'Invoke Gradle script' marked build as failure

---------------------------------------------------------------------
To unsubscribe, e-mail: builds-unsubscribe@beam.apache.org
For additional commands, e-mail: builds-help@beam.apache.org


Build failed in Jenkins: beam_PostCommit_Python38 #3734

Posted by Apache Jenkins Server <je...@builds.apache.org>.
See <https://ci-beam.apache.org/job/beam_PostCommit_Python38/3734/display/redirect>

Changes:


------------------------------------------
[...truncated 10.39 MB...]
../../build/gradleenv/-1734967051/lib/python3.8/site-packages/tenacity/_asyncio.py:42
../../build/gradleenv/-1734967051/lib/python3.8/site-packages/tenacity/_asyncio.py:42
../../build/gradleenv/-1734967051/lib/python3.8/site-packages/tenacity/_asyncio.py:42
../../build/gradleenv/-1734967051/lib/python3.8/site-packages/tenacity/_asyncio.py:42
../../build/gradleenv/-1734967051/lib/python3.8/site-packages/tenacity/_asyncio.py:42
../../build/gradleenv/-1734967051/lib/python3.8/site-packages/tenacity/_asyncio.py:42
  <https://ci-beam.apache.org/job/beam_PostCommit_Python38/ws/src/build/gradleenv/-1734967051/lib/python3.8/site-packages/tenacity/_asyncio.py>:42: DeprecationWarning: "@coroutine" decorator is deprecated since Python 3.8, use "async def" instead
    def call(self, fn, *args, **kwargs):

apache_beam/typehints/pandas_type_compatibility_test.py:67
apache_beam/typehints/pandas_type_compatibility_test.py:67
apache_beam/typehints/pandas_type_compatibility_test.py:67
apache_beam/typehints/pandas_type_compatibility_test.py:67
apache_beam/typehints/pandas_type_compatibility_test.py:67
apache_beam/typehints/pandas_type_compatibility_test.py:67
apache_beam/typehints/pandas_type_compatibility_test.py:67
apache_beam/typehints/pandas_type_compatibility_test.py:67
  <https://ci-beam.apache.org/job/beam_PostCommit_Python38/ws/src/sdks/python/apache_beam/typehints/pandas_type_compatibility_test.py>:67: FutureWarning: pandas.Int64Index is deprecated and will be removed from pandas in a future version. Use pandas.Index with the appropriate dtype instead.
    }).set_index(pd.Int64Index(range(123, 223), name='an_index')),

apache_beam/typehints/pandas_type_compatibility_test.py:90
apache_beam/typehints/pandas_type_compatibility_test.py:90
apache_beam/typehints/pandas_type_compatibility_test.py:90
apache_beam/typehints/pandas_type_compatibility_test.py:90
apache_beam/typehints/pandas_type_compatibility_test.py:90
apache_beam/typehints/pandas_type_compatibility_test.py:90
apache_beam/typehints/pandas_type_compatibility_test.py:90
apache_beam/typehints/pandas_type_compatibility_test.py:90
  <https://ci-beam.apache.org/job/beam_PostCommit_Python38/ws/src/sdks/python/apache_beam/typehints/pandas_type_compatibility_test.py>:90: FutureWarning: pandas.Int64Index is deprecated and will be removed from pandas in a future version. Use pandas.Index with the appropriate dtype instead.
    pd.Int64Index(range(123, 223), name='an_index'),

apache_beam/typehints/pandas_type_compatibility_test.py:91
apache_beam/typehints/pandas_type_compatibility_test.py:91
apache_beam/typehints/pandas_type_compatibility_test.py:91
apache_beam/typehints/pandas_type_compatibility_test.py:91
apache_beam/typehints/pandas_type_compatibility_test.py:91
apache_beam/typehints/pandas_type_compatibility_test.py:91
apache_beam/typehints/pandas_type_compatibility_test.py:91
apache_beam/typehints/pandas_type_compatibility_test.py:91
  <https://ci-beam.apache.org/job/beam_PostCommit_Python38/ws/src/sdks/python/apache_beam/typehints/pandas_type_compatibility_test.py>:91: FutureWarning: pandas.Int64Index is deprecated and will be removed from pandas in a future version. Use pandas.Index with the appropriate dtype instead.
    pd.Int64Index(range(475, 575), name='another_index'),

apache_beam/dataframe/io_it_test.py: 3 warnings
apache_beam/examples/cookbook/bigquery_tornadoes_it_test.py: 1 warning
apache_beam/io/gcp/big_query_query_to_table_it_test.py: 4 warnings
apache_beam/examples/dataframe/flight_delays_it_test.py: 1 warning
apache_beam/io/gcp/bigquery_io_read_it_test.py: 2 warnings
apache_beam/io/gcp/bigquery_read_it_test.py: 7 warnings
apache_beam/io/gcp/bigquery_json_it_test.py: 3 warnings
  <https://ci-beam.apache.org/job/beam_PostCommit_Python38/ws/src/sdks/python/apache_beam/io/gcp/bigquery.py>:2485: BeamDeprecationWarning: options is deprecated since First stable release. References to <pipeline>.options will not be supported
    temp_location = pcoll.pipeline.options.view_as(

apache_beam/dataframe/io_it_test.py: 3 warnings
apache_beam/examples/cookbook/bigquery_tornadoes_it_test.py: 1 warning
apache_beam/io/gcp/big_query_query_to_table_it_test.py: 4 warnings
apache_beam/examples/dataframe/flight_delays_it_test.py: 1 warning
apache_beam/io/gcp/bigquery_io_read_it_test.py: 2 warnings
apache_beam/io/gcp/bigquery_read_it_test.py: 7 warnings
apache_beam/io/gcp/bigquery_json_it_test.py: 3 warnings
  <https://ci-beam.apache.org/job/beam_PostCommit_Python38/ws/src/sdks/python/apache_beam/io/gcp/bigquery.py>:2487: BeamDeprecationWarning: options is deprecated since First stable release. References to <pipeline>.options will not be supported
    job_name = pcoll.pipeline.options.view_as(GoogleCloudOptions).job_name

apache_beam/dataframe/io_it_test.py: 3 warnings
apache_beam/examples/cookbook/bigquery_tornadoes_it_test.py: 1 warning
apache_beam/io/gcp/big_query_query_to_table_it_test.py: 4 warnings
apache_beam/examples/dataframe/flight_delays_it_test.py: 1 warning
apache_beam/io/gcp/bigquery_io_read_it_test.py: 2 warnings
apache_beam/io/gcp/bigquery_read_it_test.py: 7 warnings
apache_beam/io/gcp/bigquery_json_it_test.py: 3 warnings
  <https://ci-beam.apache.org/job/beam_PostCommit_Python38/ws/src/sdks/python/apache_beam/io/gcp/bigquery.py>:2511: BeamDeprecationWarning: options is deprecated since First stable release. References to <pipeline>.options will not be supported
    pipeline_options=pcoll.pipeline.options,

apache_beam/examples/complete/game/game_stats_it_test.py::GameStatsIT::test_game_stats_it
apache_beam/examples/complete/game/hourly_team_score_it_test.py::HourlyTeamScoreIT::test_hourly_team_score_it
apache_beam/examples/complete/game/leader_board_it_test.py::LeaderBoardIT::test_leader_board_it
apache_beam/io/gcp/bigquery_test.py::PubSubBigQueryIT::test_file_loads
apache_beam/io/gcp/bigquery_test.py::PubSubBigQueryIT::test_streaming_inserts
  <https://ci-beam.apache.org/job/beam_PostCommit_Python38/ws/src/sdks/python/apache_beam/io/gcp/tests/utils.py>:63: PendingDeprecationWarning: Client.dataset is deprecated and will be removed in a future version. Use a string like 'my_project.my_dataset' or a cloud.google.bigquery.DatasetReference object, instead.
    dataset_ref = client.dataset(unique_dataset_name, project=project)

apache_beam/examples/complete/game/game_stats_it_test.py: 2 warnings
apache_beam/examples/cookbook/bigquery_tornadoes_it_test.py: 1 warning
apache_beam/examples/complete/game/hourly_team_score_it_test.py: 1 warning
apache_beam/io/gcp/big_query_query_to_table_it_test.py: 4 warnings
apache_beam/examples/complete/game/leader_board_it_test.py: 2 warnings
apache_beam/io/gcp/bigquery_test.py: 6 warnings
apache_beam/io/gcp/bigquery_file_loads_test.py: 3 warnings
apache_beam/io/gcp/bigquery_json_it_test.py: 2 warnings
apache_beam/io/gcp/bigquery_write_it_test.py: 4 warnings
  <https://ci-beam.apache.org/job/beam_PostCommit_Python38/ws/src/sdks/python/apache_beam/io/gcp/bigquery.py>:1992: BeamDeprecationWarning: options is deprecated since First stable release. References to <pipeline>.options will not be supported
    is_streaming_pipeline = p.options.view_as(StandardOptions).streaming

apache_beam/examples/complete/game/game_stats_it_test.py: 2 warnings
apache_beam/examples/cookbook/bigquery_tornadoes_it_test.py: 1 warning
apache_beam/examples/complete/game/hourly_team_score_it_test.py: 1 warning
apache_beam/io/gcp/big_query_query_to_table_it_test.py: 4 warnings
apache_beam/examples/complete/game/leader_board_it_test.py: 2 warnings
apache_beam/io/gcp/bigquery_test.py: 6 warnings
apache_beam/io/gcp/bigquery_file_loads_test.py: 3 warnings
apache_beam/io/gcp/bigquery_json_it_test.py: 2 warnings
apache_beam/io/gcp/bigquery_write_it_test.py: 4 warnings
  <https://ci-beam.apache.org/job/beam_PostCommit_Python38/ws/src/sdks/python/apache_beam/io/gcp/bigquery.py>:1998: BeamDeprecationWarning: options is deprecated since First stable release. References to <pipeline>.options will not be supported
    experiments = p.options.view_as(DebugOptions).experiments or []

apache_beam/examples/cookbook/bigquery_tornadoes_it_test.py: 1 warning
apache_beam/io/gcp/big_query_query_to_table_it_test.py: 4 warnings
apache_beam/io/gcp/bigquery_test.py: 2 warnings
apache_beam/io/gcp/bigquery_write_it_test.py: 4 warnings
  <https://ci-beam.apache.org/job/beam_PostCommit_Python38/ws/src/sdks/python/apache_beam/io/gcp/bigquery.py>:1988: BeamDeprecationWarning: options is deprecated since First stable release. References to <pipeline>.options will not be supported
    self.table_reference.projectId = pcoll.pipeline.options.view_as(

apache_beam/examples/cookbook/bigquery_tornadoes_it_test.py: 1 warning
apache_beam/io/gcp/big_query_query_to_table_it_test.py: 4 warnings
apache_beam/io/gcp/bigquery_file_loads_test.py: 3 warnings
apache_beam/io/gcp/bigquery_test.py: 3 warnings
apache_beam/io/gcp/bigquery_write_it_test.py: 3 warnings
  <https://ci-beam.apache.org/job/beam_PostCommit_Python38/ws/src/sdks/python/apache_beam/io/gcp/bigquery_file_loads.py>:1166: BeamDeprecationWarning: options is deprecated since First stable release. References to <pipeline>.options will not be supported
    self.project = self.project or p.options.view_as(GoogleCloudOptions).project

apache_beam/examples/cookbook/bigquery_tornadoes_it_test.py: 1 warning
apache_beam/examples/complete/game/hourly_team_score_it_test.py: 1 warning
apache_beam/io/gcp/big_query_query_to_table_it_test.py: 4 warnings
apache_beam/io/gcp/bigquery_file_loads_test.py: 3 warnings
apache_beam/io/gcp/bigquery_test.py: 3 warnings
apache_beam/io/gcp/bigquery_write_it_test.py: 3 warnings
  <https://ci-beam.apache.org/job/beam_PostCommit_Python38/ws/src/sdks/python/apache_beam/io/gcp/bigquery_file_loads.py>:1173: BeamDeprecationWarning: options is deprecated since First stable release. References to <pipeline>.options will not be supported
    temp_location = p.options.view_as(GoogleCloudOptions).temp_location

apache_beam/examples/cookbook/bigquery_tornadoes_it_test.py: 1 warning
apache_beam/examples/complete/game/hourly_team_score_it_test.py: 1 warning
apache_beam/io/gcp/big_query_query_to_table_it_test.py: 4 warnings
apache_beam/io/gcp/bigquery_file_loads_test.py: 3 warnings
apache_beam/io/gcp/bigquery_test.py: 3 warnings
apache_beam/io/gcp/bigquery_write_it_test.py: 3 warnings
  <https://ci-beam.apache.org/job/beam_PostCommit_Python38/ws/src/sdks/python/apache_beam/io/gcp/bigquery_file_loads.py>:1175: BeamDeprecationWarning: options is deprecated since First stable release. References to <pipeline>.options will not be supported
    p.options.view_as(GoogleCloudOptions).job_name or 'AUTOMATIC_JOB_NAME')

apache_beam/examples/cookbook/bigquery_tornadoes_it_test.py::BigqueryTornadoesIT::test_bigquery_tornadoes_it
  <https://ci-beam.apache.org/job/beam_PostCommit_Python38/ws/src/sdks/python/apache_beam/io/gcp/tests/utils.py>:100: PendingDeprecationWarning: Client.dataset is deprecated and will be removed in a future version. Use a string like 'my_project.my_dataset' or a cloud.google.bigquery.DatasetReference object, instead.
    table_ref = client.dataset(dataset_id).table(table_id)

apache_beam/dataframe/io_it_test.py: 2 warnings
apache_beam/io/gcp/bigquery_json_it_test.py: 1 warning
apache_beam/io/gcp/bigquery_read_it_test.py: 9 warnings
  <https://ci-beam.apache.org/job/beam_PostCommit_Python38/ws/src/sdks/python/apache_beam/io/gcp/bigquery.py>:2529: BeamDeprecationWarning: options is deprecated since First stable release. References to <pipeline>.options will not be supported
    project_id = pcoll.pipeline.options.view_as(GoogleCloudOptions).project

apache_beam/dataframe/io_it_test.py: 2 warnings
apache_beam/io/gcp/bigquery_json_it_test.py: 1 warning
apache_beam/io/gcp/bigquery_read_it_test.py: 9 warnings
  <https://ci-beam.apache.org/job/beam_PostCommit_Python38/ws/src/sdks/python/apache_beam/io/gcp/bigquery.py>:2550: BeamDeprecationWarning: options is deprecated since First stable release. References to <pipeline>.options will not be supported
    pipeline_options=pcoll.pipeline.options,

apache_beam/examples/dataframe/flight_delays_it_test.py::FlightDelaysTest::test_flight_delays
  <https://ci-beam.apache.org/job/beam_PostCommit_Python38/ws/src/sdks/python/apache_beam/examples/dataframe/flight_delays.py>:47: FutureWarning: The default value of numeric_only in DataFrame.mean is deprecated. In a future version, it will default to False. In addition, specifying 'numeric_only=None' is deprecated. Select only valid columns or specify the value of numeric_only to silence this warning.
    return airline_df[at_top_airports].mean()

apache_beam/examples/dataframe/flight_delays_it_test.py::FlightDelaysTest::test_flight_delays
apache_beam/examples/dataframe/taxiride_it_test.py::TaxirideIT::test_aggregation
apache_beam/examples/dataframe/taxiride_it_test.py::TaxirideIT::test_enrich
  <https://ci-beam.apache.org/job/beam_PostCommit_Python38/ws/src/sdks/python/apache_beam/dataframe/io.py>:659: FutureWarning: WriteToFiles is experimental.
    return pcoll | fileio.WriteToFiles(

apache_beam/examples/dataframe/flight_delays_it_test.py::FlightDelaysTest::test_flight_delays
apache_beam/examples/dataframe/taxiride_it_test.py::TaxirideIT::test_aggregation
apache_beam/examples/dataframe/taxiride_it_test.py::TaxirideIT::test_enrich
  <https://ci-beam.apache.org/job/beam_PostCommit_Python38/ws/src/sdks/python/apache_beam/io/fileio.py>:591: BeamDeprecationWarning: options is deprecated since First stable release. References to <pipeline>.options will not be supported
    p.options.view_as(GoogleCloudOptions).temp_location or

apache_beam/io/gcp/bigquery_test.py::BigQueryStreamingInsertTransformIntegrationTests::test_multiple_destinations_transform
  <https://ci-beam.apache.org/job/beam_PostCommit_Python38/ws/src/sdks/python/apache_beam/io/gcp/bigquery_test.py>:1690: BeamDeprecationWarning: options is deprecated since First stable release. References to <pipeline>.options will not be supported
    streaming = self.test_pipeline.options.view_as(StandardOptions).streaming

apache_beam/io/gcp/bigquery_read_it_test.py::ReadTests::test_native_source
  <https://ci-beam.apache.org/job/beam_PostCommit_Python38/ws/src/sdks/python/apache_beam/io/gcp/bigquery_read_it_test.py>:170: BeamDeprecationWarning: BigQuerySource is deprecated since 2.25.0. Use ReadFromBigQuery instead.
    beam.io.BigQuerySource(query=self.query, use_standard_sql=True)))

apache_beam/ml/gcp/cloud_dlp_it_test.py::CloudDLPIT::test_deidentification
  <https://ci-beam.apache.org/job/beam_PostCommit_Python38/ws/src/sdks/python/apache_beam/ml/gcp/cloud_dlp_it_test.py>:74: FutureWarning: MaskDetectedDetails is experimental.
    | MaskDetectedDetails(

apache_beam/ml/gcp/cloud_dlp_it_test.py::CloudDLPIT::test_inspection
  <https://ci-beam.apache.org/job/beam_PostCommit_Python38/ws/src/sdks/python/apache_beam/ml/gcp/cloud_dlp_it_test.py>:85: FutureWarning: InspectForDetails is experimental.
    | InspectForDetails(

apache_beam/ml/inference/sklearn_inference_it_test.py::SklearnInference::test_sklearn_regression
  <https://ci-beam.apache.org/job/beam_PostCommit_Python38/ws/src/sdks/python/apache_beam/examples/inference/sklearn_japanese_housing_regression.py>:128: FutureWarning: SklearnModelHandlerPandas is experimental. No backwards-compatibility guarantees.
    model_loader = SklearnModelHandlerPandas(

apache_beam/ml/inference/sklearn_inference_it_test.py::SklearnInference::test_sklearn_regression
  <https://ci-beam.apache.org/job/beam_PostCommit_Python38/ws/src/build/gradleenv/-1734967051/lib/python3.8/site-packages/dill/_dill.py>:472: FutureWarning: SklearnModelHandlerPandas is experimental. No backwards-compatibility guarantees.
    obj = StockUnpickler.load(self)

apache_beam/io/gcp/bigquery_read_it_test.py::ReadNewTypesTests::test_native_source
  <https://ci-beam.apache.org/job/beam_PostCommit_Python38/ws/src/sdks/python/apache_beam/io/gcp/bigquery_read_it_test.py>:693: BeamDeprecationWarning: BigQuerySource is deprecated since 2.25.0. Use ReadFromBigQuery instead.
    beam.io.BigQuerySource(query=self.query, use_standard_sql=True)))

apache_beam/io/gcp/bigquery_read_it_test.py::ReadAllBQTests::test_read_queries
  <https://ci-beam.apache.org/job/beam_PostCommit_Python38/ws/src/sdks/python/apache_beam/io/gcp/bigquery_read_it_test.py>:808: FutureWarning: ReadAllFromBigQuery is experimental.
    | beam.io.ReadAllFromBigQuery())

apache_beam/io/gcp/bigquery_read_it_test.py::ReadAllBQTests::test_read_queries
  <https://ci-beam.apache.org/job/beam_PostCommit_Python38/ws/src/sdks/python/apache_beam/io/gcp/bigquery.py>:2658: BeamDeprecationWarning: options is deprecated since First stable release. References to <pipeline>.options will not be supported
    job_name = pcoll.pipeline.options.view_as(GoogleCloudOptions).job_name

apache_beam/io/gcp/bigquery_read_it_test.py::ReadAllBQTests::test_read_queries
  <https://ci-beam.apache.org/job/beam_PostCommit_Python38/ws/src/sdks/python/apache_beam/io/gcp/bigquery.py>:2659: BeamDeprecationWarning: options is deprecated since First stable release. References to <pipeline>.options will not be supported
    project = pcoll.pipeline.options.view_as(GoogleCloudOptions).project

apache_beam/io/gcp/bigquery_read_it_test.py::ReadAllBQTests::test_read_queries
  <https://ci-beam.apache.org/job/beam_PostCommit_Python38/ws/src/sdks/python/apache_beam/io/gcp/bigquery.py>:2672: BeamDeprecationWarning: options is deprecated since First stable release. References to <pipeline>.options will not be supported
    options=pcoll.pipeline.options,

-- Docs: https://docs.pytest.org/en/stable/how-to/capture-warnings.html
- generated xml file: <https://ci-beam.apache.org/job/beam_PostCommit_Python38/ws/src/sdks/python/pytest_postCommitIT-df-py38.xml> -
========== 85 passed, 24 skipped, 257 warnings in 11662.47s (3:14:22) ==========

FAILURE: Build failed with an exception.

* Where:
Script '<https://ci-beam.apache.org/job/beam_PostCommit_Python38/ws/src/sdks/python/test-suites/direct/common.gradle'> line: 185

* What went wrong:
Execution failed for task ':sdks:python:test-suites:direct:py38:hdfsIntegrationTest'.
> Process 'command 'sh'' finished with non-zero exit value 1

* Try:
> Run with --stacktrace option to get the stack trace.
> Run with --info or --debug option to get more log output.

* Get more help at https://help.gradle.org

Deprecated Gradle features were used in this build, making it incompatible with Gradle 8.0.

You can use '--warning-mode all' to show the individual deprecation warnings and determine if they come from your own scripts or plugins.

See https://docs.gradle.org/7.5.1/userguide/command_line_interface.html#sec:command_line_warnings

Execution optimizations have been disabled for 1 invalid unit(s) of work during this build to ensure correctness.
Please consult deprecation warnings for more details.

BUILD FAILED in 3h 29m 8s
205 actionable tasks: 141 executed, 58 from cache, 6 up-to-date

Publishing build scan...
https://gradle.com/s/uvwid6zsiefcq

Build step 'Invoke Gradle script' changed build result to FAILURE
Build step 'Invoke Gradle script' marked build as failure

---------------------------------------------------------------------
To unsubscribe, e-mail: builds-unsubscribe@beam.apache.org
For additional commands, e-mail: builds-help@beam.apache.org


Build failed in Jenkins: beam_PostCommit_Python38 #3733

Posted by Apache Jenkins Server <je...@builds.apache.org>.
See <https://ci-beam.apache.org/job/beam_PostCommit_Python38/3733/display/redirect>

Changes:


------------------------------------------
[...truncated 10.47 MB...]
../../build/gradleenv/-1734967051/lib/python3.8/site-packages/tenacity/_asyncio.py:42
../../build/gradleenv/-1734967051/lib/python3.8/site-packages/tenacity/_asyncio.py:42
../../build/gradleenv/-1734967051/lib/python3.8/site-packages/tenacity/_asyncio.py:42
../../build/gradleenv/-1734967051/lib/python3.8/site-packages/tenacity/_asyncio.py:42
../../build/gradleenv/-1734967051/lib/python3.8/site-packages/tenacity/_asyncio.py:42
../../build/gradleenv/-1734967051/lib/python3.8/site-packages/tenacity/_asyncio.py:42
  <https://ci-beam.apache.org/job/beam_PostCommit_Python38/ws/src/build/gradleenv/-1734967051/lib/python3.8/site-packages/tenacity/_asyncio.py>:42: DeprecationWarning: "@coroutine" decorator is deprecated since Python 3.8, use "async def" instead
    def call(self, fn, *args, **kwargs):

apache_beam/typehints/pandas_type_compatibility_test.py:67
apache_beam/typehints/pandas_type_compatibility_test.py:67
apache_beam/typehints/pandas_type_compatibility_test.py:67
apache_beam/typehints/pandas_type_compatibility_test.py:67
apache_beam/typehints/pandas_type_compatibility_test.py:67
apache_beam/typehints/pandas_type_compatibility_test.py:67
apache_beam/typehints/pandas_type_compatibility_test.py:67
apache_beam/typehints/pandas_type_compatibility_test.py:67
  <https://ci-beam.apache.org/job/beam_PostCommit_Python38/ws/src/sdks/python/apache_beam/typehints/pandas_type_compatibility_test.py>:67: FutureWarning: pandas.Int64Index is deprecated and will be removed from pandas in a future version. Use pandas.Index with the appropriate dtype instead.
    }).set_index(pd.Int64Index(range(123, 223), name='an_index')),

apache_beam/typehints/pandas_type_compatibility_test.py:90
apache_beam/typehints/pandas_type_compatibility_test.py:90
apache_beam/typehints/pandas_type_compatibility_test.py:90
apache_beam/typehints/pandas_type_compatibility_test.py:90
apache_beam/typehints/pandas_type_compatibility_test.py:90
apache_beam/typehints/pandas_type_compatibility_test.py:90
apache_beam/typehints/pandas_type_compatibility_test.py:90
apache_beam/typehints/pandas_type_compatibility_test.py:90
  <https://ci-beam.apache.org/job/beam_PostCommit_Python38/ws/src/sdks/python/apache_beam/typehints/pandas_type_compatibility_test.py>:90: FutureWarning: pandas.Int64Index is deprecated and will be removed from pandas in a future version. Use pandas.Index with the appropriate dtype instead.
    pd.Int64Index(range(123, 223), name='an_index'),

apache_beam/typehints/pandas_type_compatibility_test.py:91
apache_beam/typehints/pandas_type_compatibility_test.py:91
apache_beam/typehints/pandas_type_compatibility_test.py:91
apache_beam/typehints/pandas_type_compatibility_test.py:91
apache_beam/typehints/pandas_type_compatibility_test.py:91
apache_beam/typehints/pandas_type_compatibility_test.py:91
apache_beam/typehints/pandas_type_compatibility_test.py:91
apache_beam/typehints/pandas_type_compatibility_test.py:91
  <https://ci-beam.apache.org/job/beam_PostCommit_Python38/ws/src/sdks/python/apache_beam/typehints/pandas_type_compatibility_test.py>:91: FutureWarning: pandas.Int64Index is deprecated and will be removed from pandas in a future version. Use pandas.Index with the appropriate dtype instead.
    pd.Int64Index(range(475, 575), name='another_index'),

apache_beam/dataframe/io_it_test.py: 3 warnings
apache_beam/examples/cookbook/bigquery_tornadoes_it_test.py: 1 warning
apache_beam/examples/dataframe/flight_delays_it_test.py: 1 warning
apache_beam/io/gcp/big_query_query_to_table_it_test.py: 4 warnings
apache_beam/io/gcp/bigquery_read_it_test.py: 7 warnings
apache_beam/io/gcp/bigquery_io_read_it_test.py: 2 warnings
apache_beam/io/gcp/bigquery_json_it_test.py: 3 warnings
  <https://ci-beam.apache.org/job/beam_PostCommit_Python38/ws/src/sdks/python/apache_beam/io/gcp/bigquery.py>:2485: BeamDeprecationWarning: options is deprecated since First stable release. References to <pipeline>.options will not be supported
    temp_location = pcoll.pipeline.options.view_as(

apache_beam/dataframe/io_it_test.py: 3 warnings
apache_beam/examples/cookbook/bigquery_tornadoes_it_test.py: 1 warning
apache_beam/examples/dataframe/flight_delays_it_test.py: 1 warning
apache_beam/io/gcp/big_query_query_to_table_it_test.py: 4 warnings
apache_beam/io/gcp/bigquery_read_it_test.py: 7 warnings
apache_beam/io/gcp/bigquery_io_read_it_test.py: 2 warnings
apache_beam/io/gcp/bigquery_json_it_test.py: 3 warnings
  <https://ci-beam.apache.org/job/beam_PostCommit_Python38/ws/src/sdks/python/apache_beam/io/gcp/bigquery.py>:2487: BeamDeprecationWarning: options is deprecated since First stable release. References to <pipeline>.options will not be supported
    job_name = pcoll.pipeline.options.view_as(GoogleCloudOptions).job_name

apache_beam/dataframe/io_it_test.py: 3 warnings
apache_beam/examples/cookbook/bigquery_tornadoes_it_test.py: 1 warning
apache_beam/examples/dataframe/flight_delays_it_test.py: 1 warning
apache_beam/io/gcp/big_query_query_to_table_it_test.py: 4 warnings
apache_beam/io/gcp/bigquery_read_it_test.py: 7 warnings
apache_beam/io/gcp/bigquery_io_read_it_test.py: 2 warnings
apache_beam/io/gcp/bigquery_json_it_test.py: 3 warnings
  <https://ci-beam.apache.org/job/beam_PostCommit_Python38/ws/src/sdks/python/apache_beam/io/gcp/bigquery.py>:2511: BeamDeprecationWarning: options is deprecated since First stable release. References to <pipeline>.options will not be supported
    pipeline_options=pcoll.pipeline.options,

apache_beam/examples/complete/game/game_stats_it_test.py::GameStatsIT::test_game_stats_it
apache_beam/examples/complete/game/hourly_team_score_it_test.py::HourlyTeamScoreIT::test_hourly_team_score_it
apache_beam/examples/complete/game/leader_board_it_test.py::LeaderBoardIT::test_leader_board_it
apache_beam/io/gcp/bigquery_test.py::PubSubBigQueryIT::test_file_loads
apache_beam/io/gcp/bigquery_test.py::PubSubBigQueryIT::test_streaming_inserts
  <https://ci-beam.apache.org/job/beam_PostCommit_Python38/ws/src/sdks/python/apache_beam/io/gcp/tests/utils.py>:63: PendingDeprecationWarning: Client.dataset is deprecated and will be removed in a future version. Use a string like 'my_project.my_dataset' or a cloud.google.bigquery.DatasetReference object, instead.
    dataset_ref = client.dataset(unique_dataset_name, project=project)

apache_beam/examples/complete/game/game_stats_it_test.py: 2 warnings
apache_beam/examples/cookbook/bigquery_tornadoes_it_test.py: 1 warning
apache_beam/examples/complete/game/hourly_team_score_it_test.py: 1 warning
apache_beam/io/gcp/big_query_query_to_table_it_test.py: 4 warnings
apache_beam/examples/complete/game/leader_board_it_test.py: 2 warnings
apache_beam/io/gcp/bigquery_file_loads_test.py: 3 warnings
apache_beam/io/gcp/bigquery_test.py: 6 warnings
apache_beam/io/gcp/bigquery_json_it_test.py: 2 warnings
apache_beam/io/gcp/bigquery_write_it_test.py: 4 warnings
  <https://ci-beam.apache.org/job/beam_PostCommit_Python38/ws/src/sdks/python/apache_beam/io/gcp/bigquery.py>:1992: BeamDeprecationWarning: options is deprecated since First stable release. References to <pipeline>.options will not be supported
    is_streaming_pipeline = p.options.view_as(StandardOptions).streaming

apache_beam/examples/complete/game/game_stats_it_test.py: 2 warnings
apache_beam/examples/cookbook/bigquery_tornadoes_it_test.py: 1 warning
apache_beam/examples/complete/game/hourly_team_score_it_test.py: 1 warning
apache_beam/io/gcp/big_query_query_to_table_it_test.py: 4 warnings
apache_beam/examples/complete/game/leader_board_it_test.py: 2 warnings
apache_beam/io/gcp/bigquery_file_loads_test.py: 3 warnings
apache_beam/io/gcp/bigquery_test.py: 6 warnings
apache_beam/io/gcp/bigquery_json_it_test.py: 2 warnings
apache_beam/io/gcp/bigquery_write_it_test.py: 4 warnings
  <https://ci-beam.apache.org/job/beam_PostCommit_Python38/ws/src/sdks/python/apache_beam/io/gcp/bigquery.py>:1998: BeamDeprecationWarning: options is deprecated since First stable release. References to <pipeline>.options will not be supported
    experiments = p.options.view_as(DebugOptions).experiments or []

apache_beam/dataframe/io_it_test.py: 2 warnings
apache_beam/io/gcp/bigquery_json_it_test.py: 1 warning
apache_beam/io/gcp/bigquery_read_it_test.py: 9 warnings
  <https://ci-beam.apache.org/job/beam_PostCommit_Python38/ws/src/sdks/python/apache_beam/io/gcp/bigquery.py>:2529: BeamDeprecationWarning: options is deprecated since First stable release. References to <pipeline>.options will not be supported
    project_id = pcoll.pipeline.options.view_as(GoogleCloudOptions).project

apache_beam/dataframe/io_it_test.py: 2 warnings
apache_beam/io/gcp/bigquery_json_it_test.py: 1 warning
apache_beam/io/gcp/bigquery_read_it_test.py: 9 warnings
  <https://ci-beam.apache.org/job/beam_PostCommit_Python38/ws/src/sdks/python/apache_beam/io/gcp/bigquery.py>:2550: BeamDeprecationWarning: options is deprecated since First stable release. References to <pipeline>.options will not be supported
    pipeline_options=pcoll.pipeline.options,

apache_beam/examples/cookbook/bigquery_tornadoes_it_test.py: 1 warning
apache_beam/io/gcp/big_query_query_to_table_it_test.py: 4 warnings
apache_beam/io/gcp/bigquery_write_it_test.py: 4 warnings
apache_beam/io/gcp/bigquery_test.py: 2 warnings
  <https://ci-beam.apache.org/job/beam_PostCommit_Python38/ws/src/sdks/python/apache_beam/io/gcp/bigquery.py>:1988: BeamDeprecationWarning: options is deprecated since First stable release. References to <pipeline>.options will not be supported
    self.table_reference.projectId = pcoll.pipeline.options.view_as(

apache_beam/examples/cookbook/bigquery_tornadoes_it_test.py: 1 warning
apache_beam/io/gcp/big_query_query_to_table_it_test.py: 4 warnings
apache_beam/io/gcp/bigquery_file_loads_test.py: 3 warnings
apache_beam/io/gcp/bigquery_test.py: 3 warnings
apache_beam/io/gcp/bigquery_write_it_test.py: 3 warnings
  <https://ci-beam.apache.org/job/beam_PostCommit_Python38/ws/src/sdks/python/apache_beam/io/gcp/bigquery_file_loads.py>:1166: BeamDeprecationWarning: options is deprecated since First stable release. References to <pipeline>.options will not be supported
    self.project = self.project or p.options.view_as(GoogleCloudOptions).project

apache_beam/examples/cookbook/bigquery_tornadoes_it_test.py: 1 warning
apache_beam/examples/complete/game/hourly_team_score_it_test.py: 1 warning
apache_beam/io/gcp/big_query_query_to_table_it_test.py: 4 warnings
apache_beam/io/gcp/bigquery_file_loads_test.py: 3 warnings
apache_beam/io/gcp/bigquery_test.py: 3 warnings
apache_beam/io/gcp/bigquery_write_it_test.py: 3 warnings
  <https://ci-beam.apache.org/job/beam_PostCommit_Python38/ws/src/sdks/python/apache_beam/io/gcp/bigquery_file_loads.py>:1173: BeamDeprecationWarning: options is deprecated since First stable release. References to <pipeline>.options will not be supported
    temp_location = p.options.view_as(GoogleCloudOptions).temp_location

apache_beam/examples/cookbook/bigquery_tornadoes_it_test.py: 1 warning
apache_beam/examples/complete/game/hourly_team_score_it_test.py: 1 warning
apache_beam/io/gcp/big_query_query_to_table_it_test.py: 4 warnings
apache_beam/io/gcp/bigquery_file_loads_test.py: 3 warnings
apache_beam/io/gcp/bigquery_test.py: 3 warnings
apache_beam/io/gcp/bigquery_write_it_test.py: 3 warnings
  <https://ci-beam.apache.org/job/beam_PostCommit_Python38/ws/src/sdks/python/apache_beam/io/gcp/bigquery_file_loads.py>:1175: BeamDeprecationWarning: options is deprecated since First stable release. References to <pipeline>.options will not be supported
    p.options.view_as(GoogleCloudOptions).job_name or 'AUTOMATIC_JOB_NAME')

apache_beam/examples/cookbook/bigquery_tornadoes_it_test.py::BigqueryTornadoesIT::test_bigquery_tornadoes_it
  <https://ci-beam.apache.org/job/beam_PostCommit_Python38/ws/src/sdks/python/apache_beam/io/gcp/tests/utils.py>:100: PendingDeprecationWarning: Client.dataset is deprecated and will be removed in a future version. Use a string like 'my_project.my_dataset' or a cloud.google.bigquery.DatasetReference object, instead.
    table_ref = client.dataset(dataset_id).table(table_id)

apache_beam/examples/dataframe/flight_delays_it_test.py::FlightDelaysTest::test_flight_delays
  <https://ci-beam.apache.org/job/beam_PostCommit_Python38/ws/src/sdks/python/apache_beam/examples/dataframe/flight_delays.py>:47: FutureWarning: The default value of numeric_only in DataFrame.mean is deprecated. In a future version, it will default to False. In addition, specifying 'numeric_only=None' is deprecated. Select only valid columns or specify the value of numeric_only to silence this warning.
    return airline_df[at_top_airports].mean()

apache_beam/examples/dataframe/flight_delays_it_test.py::FlightDelaysTest::test_flight_delays
apache_beam/examples/dataframe/taxiride_it_test.py::TaxirideIT::test_aggregation
apache_beam/examples/dataframe/taxiride_it_test.py::TaxirideIT::test_enrich
  <https://ci-beam.apache.org/job/beam_PostCommit_Python38/ws/src/sdks/python/apache_beam/dataframe/io.py>:659: FutureWarning: WriteToFiles is experimental.
    return pcoll | fileio.WriteToFiles(

apache_beam/examples/dataframe/flight_delays_it_test.py::FlightDelaysTest::test_flight_delays
apache_beam/examples/dataframe/taxiride_it_test.py::TaxirideIT::test_aggregation
apache_beam/examples/dataframe/taxiride_it_test.py::TaxirideIT::test_enrich
  <https://ci-beam.apache.org/job/beam_PostCommit_Python38/ws/src/sdks/python/apache_beam/io/fileio.py>:591: BeamDeprecationWarning: options is deprecated since First stable release. References to <pipeline>.options will not be supported
    p.options.view_as(GoogleCloudOptions).temp_location or

apache_beam/io/gcp/bigquery_test.py::BigQueryStreamingInsertTransformIntegrationTests::test_multiple_destinations_transform
  <https://ci-beam.apache.org/job/beam_PostCommit_Python38/ws/src/sdks/python/apache_beam/io/gcp/bigquery_test.py>:1690: BeamDeprecationWarning: options is deprecated since First stable release. References to <pipeline>.options will not be supported
    streaming = self.test_pipeline.options.view_as(StandardOptions).streaming

apache_beam/io/gcp/bigquery_read_it_test.py::ReadTests::test_native_source
  <https://ci-beam.apache.org/job/beam_PostCommit_Python38/ws/src/sdks/python/apache_beam/io/gcp/bigquery_read_it_test.py>:170: BeamDeprecationWarning: BigQuerySource is deprecated since 2.25.0. Use ReadFromBigQuery instead.
    beam.io.BigQuerySource(query=self.query, use_standard_sql=True)))

apache_beam/ml/gcp/cloud_dlp_it_test.py::CloudDLPIT::test_deidentification
  <https://ci-beam.apache.org/job/beam_PostCommit_Python38/ws/src/sdks/python/apache_beam/ml/gcp/cloud_dlp_it_test.py>:74: FutureWarning: MaskDetectedDetails is experimental.
    | MaskDetectedDetails(

apache_beam/ml/gcp/cloud_dlp_it_test.py::CloudDLPIT::test_inspection
  <https://ci-beam.apache.org/job/beam_PostCommit_Python38/ws/src/sdks/python/apache_beam/ml/gcp/cloud_dlp_it_test.py>:85: FutureWarning: InspectForDetails is experimental.
    | InspectForDetails(

apache_beam/ml/inference/sklearn_inference_it_test.py::SklearnInference::test_sklearn_regression
  <https://ci-beam.apache.org/job/beam_PostCommit_Python38/ws/src/sdks/python/apache_beam/examples/inference/sklearn_japanese_housing_regression.py>:128: FutureWarning: SklearnModelHandlerPandas is experimental. No backwards-compatibility guarantees.
    model_loader = SklearnModelHandlerPandas(

apache_beam/ml/inference/sklearn_inference_it_test.py::SklearnInference::test_sklearn_regression
  <https://ci-beam.apache.org/job/beam_PostCommit_Python38/ws/src/build/gradleenv/-1734967051/lib/python3.8/site-packages/dill/_dill.py>:472: FutureWarning: SklearnModelHandlerPandas is experimental. No backwards-compatibility guarantees.
    obj = StockUnpickler.load(self)

apache_beam/io/gcp/bigquery_read_it_test.py::ReadNewTypesTests::test_native_source
  <https://ci-beam.apache.org/job/beam_PostCommit_Python38/ws/src/sdks/python/apache_beam/io/gcp/bigquery_read_it_test.py>:693: BeamDeprecationWarning: BigQuerySource is deprecated since 2.25.0. Use ReadFromBigQuery instead.
    beam.io.BigQuerySource(query=self.query, use_standard_sql=True)))

apache_beam/io/gcp/bigquery_read_it_test.py::ReadAllBQTests::test_read_queries
  <https://ci-beam.apache.org/job/beam_PostCommit_Python38/ws/src/sdks/python/apache_beam/io/gcp/bigquery_read_it_test.py>:808: FutureWarning: ReadAllFromBigQuery is experimental.
    | beam.io.ReadAllFromBigQuery())

apache_beam/io/gcp/bigquery_read_it_test.py::ReadAllBQTests::test_read_queries
  <https://ci-beam.apache.org/job/beam_PostCommit_Python38/ws/src/sdks/python/apache_beam/io/gcp/bigquery.py>:2658: BeamDeprecationWarning: options is deprecated since First stable release. References to <pipeline>.options will not be supported
    job_name = pcoll.pipeline.options.view_as(GoogleCloudOptions).job_name

apache_beam/io/gcp/bigquery_read_it_test.py::ReadAllBQTests::test_read_queries
  <https://ci-beam.apache.org/job/beam_PostCommit_Python38/ws/src/sdks/python/apache_beam/io/gcp/bigquery.py>:2659: BeamDeprecationWarning: options is deprecated since First stable release. References to <pipeline>.options will not be supported
    project = pcoll.pipeline.options.view_as(GoogleCloudOptions).project

apache_beam/io/gcp/bigquery_read_it_test.py::ReadAllBQTests::test_read_queries
  <https://ci-beam.apache.org/job/beam_PostCommit_Python38/ws/src/sdks/python/apache_beam/io/gcp/bigquery.py>:2672: BeamDeprecationWarning: options is deprecated since First stable release. References to <pipeline>.options will not be supported
    options=pcoll.pipeline.options,

-- Docs: https://docs.pytest.org/en/stable/how-to/capture-warnings.html
- generated xml file: <https://ci-beam.apache.org/job/beam_PostCommit_Python38/ws/src/sdks/python/pytest_postCommitIT-df-py38.xml> -
========== 85 passed, 24 skipped, 257 warnings in 11826.09s (3:17:06) ==========

FAILURE: Build failed with an exception.

* Where:
Script '<https://ci-beam.apache.org/job/beam_PostCommit_Python38/ws/src/sdks/python/test-suites/direct/common.gradle'> line: 185

* What went wrong:
Execution failed for task ':sdks:python:test-suites:direct:py38:hdfsIntegrationTest'.
> Process 'command 'sh'' finished with non-zero exit value 1

* Try:
> Run with --stacktrace option to get the stack trace.
> Run with --info or --debug option to get more log output.

* Get more help at https://help.gradle.org

Deprecated Gradle features were used in this build, making it incompatible with Gradle 8.0.

You can use '--warning-mode all' to show the individual deprecation warnings and determine if they come from your own scripts or plugins.

See https://docs.gradle.org/7.5.1/userguide/command_line_interface.html#sec:command_line_warnings

Execution optimizations have been disabled for 1 invalid unit(s) of work during this build to ensure correctness.
Please consult deprecation warnings for more details.

BUILD FAILED in 3h 30m 41s
205 actionable tasks: 141 executed, 58 from cache, 6 up-to-date

Publishing build scan...
https://gradle.com/s/htgiaxsuk7e6g

Build step 'Invoke Gradle script' changed build result to FAILURE
Build step 'Invoke Gradle script' marked build as failure

---------------------------------------------------------------------
To unsubscribe, e-mail: builds-unsubscribe@beam.apache.org
For additional commands, e-mail: builds-help@beam.apache.org


Build failed in Jenkins: beam_PostCommit_Python38 #3732

Posted by Apache Jenkins Server <je...@builds.apache.org>.
See <https://ci-beam.apache.org/job/beam_PostCommit_Python38/3732/display/redirect>

Changes:


------------------------------------------
[...truncated 10.47 MB...]
../../build/gradleenv/-1734967051/lib/python3.8/site-packages/tenacity/_asyncio.py:42
../../build/gradleenv/-1734967051/lib/python3.8/site-packages/tenacity/_asyncio.py:42
../../build/gradleenv/-1734967051/lib/python3.8/site-packages/tenacity/_asyncio.py:42
../../build/gradleenv/-1734967051/lib/python3.8/site-packages/tenacity/_asyncio.py:42
../../build/gradleenv/-1734967051/lib/python3.8/site-packages/tenacity/_asyncio.py:42
../../build/gradleenv/-1734967051/lib/python3.8/site-packages/tenacity/_asyncio.py:42
  <https://ci-beam.apache.org/job/beam_PostCommit_Python38/ws/src/build/gradleenv/-1734967051/lib/python3.8/site-packages/tenacity/_asyncio.py>:42: DeprecationWarning: "@coroutine" decorator is deprecated since Python 3.8, use "async def" instead
    def call(self, fn, *args, **kwargs):

apache_beam/typehints/pandas_type_compatibility_test.py:67
apache_beam/typehints/pandas_type_compatibility_test.py:67
apache_beam/typehints/pandas_type_compatibility_test.py:67
apache_beam/typehints/pandas_type_compatibility_test.py:67
apache_beam/typehints/pandas_type_compatibility_test.py:67
apache_beam/typehints/pandas_type_compatibility_test.py:67
apache_beam/typehints/pandas_type_compatibility_test.py:67
apache_beam/typehints/pandas_type_compatibility_test.py:67
  <https://ci-beam.apache.org/job/beam_PostCommit_Python38/ws/src/sdks/python/apache_beam/typehints/pandas_type_compatibility_test.py>:67: FutureWarning: pandas.Int64Index is deprecated and will be removed from pandas in a future version. Use pandas.Index with the appropriate dtype instead.
    }).set_index(pd.Int64Index(range(123, 223), name='an_index')),

apache_beam/typehints/pandas_type_compatibility_test.py:90
apache_beam/typehints/pandas_type_compatibility_test.py:90
apache_beam/typehints/pandas_type_compatibility_test.py:90
apache_beam/typehints/pandas_type_compatibility_test.py:90
apache_beam/typehints/pandas_type_compatibility_test.py:90
apache_beam/typehints/pandas_type_compatibility_test.py:90
apache_beam/typehints/pandas_type_compatibility_test.py:90
apache_beam/typehints/pandas_type_compatibility_test.py:90
  <https://ci-beam.apache.org/job/beam_PostCommit_Python38/ws/src/sdks/python/apache_beam/typehints/pandas_type_compatibility_test.py>:90: FutureWarning: pandas.Int64Index is deprecated and will be removed from pandas in a future version. Use pandas.Index with the appropriate dtype instead.
    pd.Int64Index(range(123, 223), name='an_index'),

apache_beam/typehints/pandas_type_compatibility_test.py:91
apache_beam/typehints/pandas_type_compatibility_test.py:91
apache_beam/typehints/pandas_type_compatibility_test.py:91
apache_beam/typehints/pandas_type_compatibility_test.py:91
apache_beam/typehints/pandas_type_compatibility_test.py:91
apache_beam/typehints/pandas_type_compatibility_test.py:91
apache_beam/typehints/pandas_type_compatibility_test.py:91
apache_beam/typehints/pandas_type_compatibility_test.py:91
  <https://ci-beam.apache.org/job/beam_PostCommit_Python38/ws/src/sdks/python/apache_beam/typehints/pandas_type_compatibility_test.py>:91: FutureWarning: pandas.Int64Index is deprecated and will be removed from pandas in a future version. Use pandas.Index with the appropriate dtype instead.
    pd.Int64Index(range(475, 575), name='another_index'),

apache_beam/dataframe/io_it_test.py: 3 warnings
apache_beam/examples/cookbook/bigquery_tornadoes_it_test.py: 1 warning
apache_beam/examples/dataframe/flight_delays_it_test.py: 1 warning
apache_beam/io/gcp/bigquery_read_it_test.py: 7 warnings
apache_beam/io/gcp/bigquery_io_read_it_test.py: 2 warnings
apache_beam/io/gcp/bigquery_json_it_test.py: 3 warnings
apache_beam/io/gcp/big_query_query_to_table_it_test.py: 4 warnings
  <https://ci-beam.apache.org/job/beam_PostCommit_Python38/ws/src/sdks/python/apache_beam/io/gcp/bigquery.py>:2485: BeamDeprecationWarning: options is deprecated since First stable release. References to <pipeline>.options will not be supported
    temp_location = pcoll.pipeline.options.view_as(

apache_beam/dataframe/io_it_test.py: 3 warnings
apache_beam/examples/cookbook/bigquery_tornadoes_it_test.py: 1 warning
apache_beam/examples/dataframe/flight_delays_it_test.py: 1 warning
apache_beam/io/gcp/bigquery_read_it_test.py: 7 warnings
apache_beam/io/gcp/bigquery_io_read_it_test.py: 2 warnings
apache_beam/io/gcp/bigquery_json_it_test.py: 3 warnings
apache_beam/io/gcp/big_query_query_to_table_it_test.py: 4 warnings
  <https://ci-beam.apache.org/job/beam_PostCommit_Python38/ws/src/sdks/python/apache_beam/io/gcp/bigquery.py>:2487: BeamDeprecationWarning: options is deprecated since First stable release. References to <pipeline>.options will not be supported
    job_name = pcoll.pipeline.options.view_as(GoogleCloudOptions).job_name

apache_beam/dataframe/io_it_test.py: 3 warnings
apache_beam/examples/cookbook/bigquery_tornadoes_it_test.py: 1 warning
apache_beam/examples/dataframe/flight_delays_it_test.py: 1 warning
apache_beam/io/gcp/bigquery_read_it_test.py: 7 warnings
apache_beam/io/gcp/bigquery_io_read_it_test.py: 2 warnings
apache_beam/io/gcp/bigquery_json_it_test.py: 3 warnings
apache_beam/io/gcp/big_query_query_to_table_it_test.py: 4 warnings
  <https://ci-beam.apache.org/job/beam_PostCommit_Python38/ws/src/sdks/python/apache_beam/io/gcp/bigquery.py>:2511: BeamDeprecationWarning: options is deprecated since First stable release. References to <pipeline>.options will not be supported
    pipeline_options=pcoll.pipeline.options,

apache_beam/examples/complete/game/game_stats_it_test.py::GameStatsIT::test_game_stats_it
apache_beam/examples/complete/game/hourly_team_score_it_test.py::HourlyTeamScoreIT::test_hourly_team_score_it
apache_beam/examples/complete/game/leader_board_it_test.py::LeaderBoardIT::test_leader_board_it
apache_beam/io/gcp/bigquery_test.py::PubSubBigQueryIT::test_file_loads
apache_beam/io/gcp/bigquery_test.py::PubSubBigQueryIT::test_streaming_inserts
  <https://ci-beam.apache.org/job/beam_PostCommit_Python38/ws/src/sdks/python/apache_beam/io/gcp/tests/utils.py>:63: PendingDeprecationWarning: Client.dataset is deprecated and will be removed in a future version. Use a string like 'my_project.my_dataset' or a cloud.google.bigquery.DatasetReference object, instead.
    dataset_ref = client.dataset(unique_dataset_name, project=project)

apache_beam/examples/complete/game/game_stats_it_test.py: 2 warnings
apache_beam/examples/cookbook/bigquery_tornadoes_it_test.py: 1 warning
apache_beam/examples/complete/game/hourly_team_score_it_test.py: 1 warning
apache_beam/examples/complete/game/leader_board_it_test.py: 2 warnings
apache_beam/io/gcp/bigquery_file_loads_test.py: 3 warnings
apache_beam/io/gcp/bigquery_test.py: 6 warnings
apache_beam/io/gcp/bigquery_write_it_test.py: 4 warnings
apache_beam/io/gcp/bigquery_json_it_test.py: 2 warnings
apache_beam/io/gcp/big_query_query_to_table_it_test.py: 4 warnings
  <https://ci-beam.apache.org/job/beam_PostCommit_Python38/ws/src/sdks/python/apache_beam/io/gcp/bigquery.py>:1992: BeamDeprecationWarning: options is deprecated since First stable release. References to <pipeline>.options will not be supported
    is_streaming_pipeline = p.options.view_as(StandardOptions).streaming

apache_beam/examples/complete/game/game_stats_it_test.py: 2 warnings
apache_beam/examples/cookbook/bigquery_tornadoes_it_test.py: 1 warning
apache_beam/examples/complete/game/hourly_team_score_it_test.py: 1 warning
apache_beam/examples/complete/game/leader_board_it_test.py: 2 warnings
apache_beam/io/gcp/bigquery_file_loads_test.py: 3 warnings
apache_beam/io/gcp/bigquery_test.py: 6 warnings
apache_beam/io/gcp/bigquery_write_it_test.py: 4 warnings
apache_beam/io/gcp/bigquery_json_it_test.py: 2 warnings
apache_beam/io/gcp/big_query_query_to_table_it_test.py: 4 warnings
  <https://ci-beam.apache.org/job/beam_PostCommit_Python38/ws/src/sdks/python/apache_beam/io/gcp/bigquery.py>:1998: BeamDeprecationWarning: options is deprecated since First stable release. References to <pipeline>.options will not be supported
    experiments = p.options.view_as(DebugOptions).experiments or []

apache_beam/examples/cookbook/bigquery_tornadoes_it_test.py: 1 warning
apache_beam/io/gcp/bigquery_write_it_test.py: 4 warnings
apache_beam/io/gcp/big_query_query_to_table_it_test.py: 4 warnings
apache_beam/io/gcp/bigquery_test.py: 2 warnings
  <https://ci-beam.apache.org/job/beam_PostCommit_Python38/ws/src/sdks/python/apache_beam/io/gcp/bigquery.py>:1988: BeamDeprecationWarning: options is deprecated since First stable release. References to <pipeline>.options will not be supported
    self.table_reference.projectId = pcoll.pipeline.options.view_as(

apache_beam/examples/cookbook/bigquery_tornadoes_it_test.py: 1 warning
apache_beam/io/gcp/bigquery_file_loads_test.py: 3 warnings
apache_beam/io/gcp/bigquery_write_it_test.py: 3 warnings
apache_beam/io/gcp/bigquery_test.py: 3 warnings
apache_beam/io/gcp/big_query_query_to_table_it_test.py: 4 warnings
  <https://ci-beam.apache.org/job/beam_PostCommit_Python38/ws/src/sdks/python/apache_beam/io/gcp/bigquery_file_loads.py>:1166: BeamDeprecationWarning: options is deprecated since First stable release. References to <pipeline>.options will not be supported
    self.project = self.project or p.options.view_as(GoogleCloudOptions).project

apache_beam/examples/cookbook/bigquery_tornadoes_it_test.py: 1 warning
apache_beam/examples/complete/game/hourly_team_score_it_test.py: 1 warning
apache_beam/io/gcp/bigquery_file_loads_test.py: 3 warnings
apache_beam/io/gcp/bigquery_write_it_test.py: 3 warnings
apache_beam/io/gcp/bigquery_test.py: 3 warnings
apache_beam/io/gcp/big_query_query_to_table_it_test.py: 4 warnings
  <https://ci-beam.apache.org/job/beam_PostCommit_Python38/ws/src/sdks/python/apache_beam/io/gcp/bigquery_file_loads.py>:1173: BeamDeprecationWarning: options is deprecated since First stable release. References to <pipeline>.options will not be supported
    temp_location = p.options.view_as(GoogleCloudOptions).temp_location

apache_beam/examples/cookbook/bigquery_tornadoes_it_test.py: 1 warning
apache_beam/examples/complete/game/hourly_team_score_it_test.py: 1 warning
apache_beam/io/gcp/bigquery_file_loads_test.py: 3 warnings
apache_beam/io/gcp/bigquery_write_it_test.py: 3 warnings
apache_beam/io/gcp/bigquery_test.py: 3 warnings
apache_beam/io/gcp/big_query_query_to_table_it_test.py: 4 warnings
  <https://ci-beam.apache.org/job/beam_PostCommit_Python38/ws/src/sdks/python/apache_beam/io/gcp/bigquery_file_loads.py>:1175: BeamDeprecationWarning: options is deprecated since First stable release. References to <pipeline>.options will not be supported
    p.options.view_as(GoogleCloudOptions).job_name or 'AUTOMATIC_JOB_NAME')

apache_beam/examples/cookbook/bigquery_tornadoes_it_test.py::BigqueryTornadoesIT::test_bigquery_tornadoes_it
  <https://ci-beam.apache.org/job/beam_PostCommit_Python38/ws/src/sdks/python/apache_beam/io/gcp/tests/utils.py>:100: PendingDeprecationWarning: Client.dataset is deprecated and will be removed in a future version. Use a string like 'my_project.my_dataset' or a cloud.google.bigquery.DatasetReference object, instead.
    table_ref = client.dataset(dataset_id).table(table_id)

apache_beam/dataframe/io_it_test.py: 2 warnings
apache_beam/io/gcp/bigquery_json_it_test.py: 1 warning
apache_beam/io/gcp/bigquery_read_it_test.py: 9 warnings
  <https://ci-beam.apache.org/job/beam_PostCommit_Python38/ws/src/sdks/python/apache_beam/io/gcp/bigquery.py>:2529: BeamDeprecationWarning: options is deprecated since First stable release. References to <pipeline>.options will not be supported
    project_id = pcoll.pipeline.options.view_as(GoogleCloudOptions).project

apache_beam/dataframe/io_it_test.py: 2 warnings
apache_beam/io/gcp/bigquery_json_it_test.py: 1 warning
apache_beam/io/gcp/bigquery_read_it_test.py: 9 warnings
  <https://ci-beam.apache.org/job/beam_PostCommit_Python38/ws/src/sdks/python/apache_beam/io/gcp/bigquery.py>:2550: BeamDeprecationWarning: options is deprecated since First stable release. References to <pipeline>.options will not be supported
    pipeline_options=pcoll.pipeline.options,

apache_beam/examples/dataframe/flight_delays_it_test.py::FlightDelaysTest::test_flight_delays
  <https://ci-beam.apache.org/job/beam_PostCommit_Python38/ws/src/sdks/python/apache_beam/examples/dataframe/flight_delays.py>:47: FutureWarning: The default value of numeric_only in DataFrame.mean is deprecated. In a future version, it will default to False. In addition, specifying 'numeric_only=None' is deprecated. Select only valid columns or specify the value of numeric_only to silence this warning.
    return airline_df[at_top_airports].mean()

apache_beam/examples/dataframe/flight_delays_it_test.py::FlightDelaysTest::test_flight_delays
apache_beam/examples/dataframe/taxiride_it_test.py::TaxirideIT::test_aggregation
apache_beam/examples/dataframe/taxiride_it_test.py::TaxirideIT::test_enrich
  <https://ci-beam.apache.org/job/beam_PostCommit_Python38/ws/src/sdks/python/apache_beam/dataframe/io.py>:659: FutureWarning: WriteToFiles is experimental.
    return pcoll | fileio.WriteToFiles(

apache_beam/examples/dataframe/flight_delays_it_test.py::FlightDelaysTest::test_flight_delays
apache_beam/examples/dataframe/taxiride_it_test.py::TaxirideIT::test_aggregation
apache_beam/examples/dataframe/taxiride_it_test.py::TaxirideIT::test_enrich
  <https://ci-beam.apache.org/job/beam_PostCommit_Python38/ws/src/sdks/python/apache_beam/io/fileio.py>:591: BeamDeprecationWarning: options is deprecated since First stable release. References to <pipeline>.options will not be supported
    p.options.view_as(GoogleCloudOptions).temp_location or

apache_beam/io/gcp/bigquery_test.py::BigQueryStreamingInsertTransformIntegrationTests::test_multiple_destinations_transform
  <https://ci-beam.apache.org/job/beam_PostCommit_Python38/ws/src/sdks/python/apache_beam/io/gcp/bigquery_test.py>:1690: BeamDeprecationWarning: options is deprecated since First stable release. References to <pipeline>.options will not be supported
    streaming = self.test_pipeline.options.view_as(StandardOptions).streaming

apache_beam/io/gcp/bigquery_read_it_test.py::ReadTests::test_native_source
  <https://ci-beam.apache.org/job/beam_PostCommit_Python38/ws/src/sdks/python/apache_beam/io/gcp/bigquery_read_it_test.py>:170: BeamDeprecationWarning: BigQuerySource is deprecated since 2.25.0. Use ReadFromBigQuery instead.
    beam.io.BigQuerySource(query=self.query, use_standard_sql=True)))

apache_beam/ml/gcp/cloud_dlp_it_test.py::CloudDLPIT::test_deidentification
  <https://ci-beam.apache.org/job/beam_PostCommit_Python38/ws/src/sdks/python/apache_beam/ml/gcp/cloud_dlp_it_test.py>:74: FutureWarning: MaskDetectedDetails is experimental.
    | MaskDetectedDetails(

apache_beam/ml/gcp/cloud_dlp_it_test.py::CloudDLPIT::test_inspection
  <https://ci-beam.apache.org/job/beam_PostCommit_Python38/ws/src/sdks/python/apache_beam/ml/gcp/cloud_dlp_it_test.py>:85: FutureWarning: InspectForDetails is experimental.
    | InspectForDetails(

apache_beam/ml/inference/sklearn_inference_it_test.py::SklearnInference::test_sklearn_regression
  <https://ci-beam.apache.org/job/beam_PostCommit_Python38/ws/src/sdks/python/apache_beam/examples/inference/sklearn_japanese_housing_regression.py>:128: FutureWarning: SklearnModelHandlerPandas is experimental. No backwards-compatibility guarantees.
    model_loader = SklearnModelHandlerPandas(

apache_beam/ml/inference/sklearn_inference_it_test.py::SklearnInference::test_sklearn_regression
  <https://ci-beam.apache.org/job/beam_PostCommit_Python38/ws/src/build/gradleenv/-1734967051/lib/python3.8/site-packages/dill/_dill.py>:472: FutureWarning: SklearnModelHandlerPandas is experimental. No backwards-compatibility guarantees.
    obj = StockUnpickler.load(self)

apache_beam/io/gcp/bigquery_read_it_test.py::ReadNewTypesTests::test_native_source
  <https://ci-beam.apache.org/job/beam_PostCommit_Python38/ws/src/sdks/python/apache_beam/io/gcp/bigquery_read_it_test.py>:693: BeamDeprecationWarning: BigQuerySource is deprecated since 2.25.0. Use ReadFromBigQuery instead.
    beam.io.BigQuerySource(query=self.query, use_standard_sql=True)))

apache_beam/io/gcp/bigquery_read_it_test.py::ReadAllBQTests::test_read_queries
  <https://ci-beam.apache.org/job/beam_PostCommit_Python38/ws/src/sdks/python/apache_beam/io/gcp/bigquery_read_it_test.py>:808: FutureWarning: ReadAllFromBigQuery is experimental.
    | beam.io.ReadAllFromBigQuery())

apache_beam/io/gcp/bigquery_read_it_test.py::ReadAllBQTests::test_read_queries
  <https://ci-beam.apache.org/job/beam_PostCommit_Python38/ws/src/sdks/python/apache_beam/io/gcp/bigquery.py>:2658: BeamDeprecationWarning: options is deprecated since First stable release. References to <pipeline>.options will not be supported
    job_name = pcoll.pipeline.options.view_as(GoogleCloudOptions).job_name

apache_beam/io/gcp/bigquery_read_it_test.py::ReadAllBQTests::test_read_queries
  <https://ci-beam.apache.org/job/beam_PostCommit_Python38/ws/src/sdks/python/apache_beam/io/gcp/bigquery.py>:2659: BeamDeprecationWarning: options is deprecated since First stable release. References to <pipeline>.options will not be supported
    project = pcoll.pipeline.options.view_as(GoogleCloudOptions).project

apache_beam/io/gcp/bigquery_read_it_test.py::ReadAllBQTests::test_read_queries
  <https://ci-beam.apache.org/job/beam_PostCommit_Python38/ws/src/sdks/python/apache_beam/io/gcp/bigquery.py>:2672: BeamDeprecationWarning: options is deprecated since First stable release. References to <pipeline>.options will not be supported
    options=pcoll.pipeline.options,

-- Docs: https://docs.pytest.org/en/stable/how-to/capture-warnings.html
- generated xml file: <https://ci-beam.apache.org/job/beam_PostCommit_Python38/ws/src/sdks/python/pytest_postCommitIT-df-py38.xml> -
========== 85 passed, 24 skipped, 257 warnings in 10973.39s (3:02:53) ==========

FAILURE: Build failed with an exception.

* Where:
Script '<https://ci-beam.apache.org/job/beam_PostCommit_Python38/ws/src/sdks/python/test-suites/direct/common.gradle'> line: 185

* What went wrong:
Execution failed for task ':sdks:python:test-suites:direct:py38:hdfsIntegrationTest'.
> Process 'command 'sh'' finished with non-zero exit value 1

* Try:
> Run with --stacktrace option to get the stack trace.
> Run with --info or --debug option to get more log output.

* Get more help at https://help.gradle.org

Deprecated Gradle features were used in this build, making it incompatible with Gradle 8.0.

You can use '--warning-mode all' to show the individual deprecation warnings and determine if they come from your own scripts or plugins.

See https://docs.gradle.org/7.5.1/userguide/command_line_interface.html#sec:command_line_warnings

Execution optimizations have been disabled for 1 invalid unit(s) of work during this build to ensure correctness.
Please consult deprecation warnings for more details.

BUILD FAILED in 3h 17m 32s
205 actionable tasks: 141 executed, 58 from cache, 6 up-to-date

Publishing build scan...
https://gradle.com/s/usmc43l6vy3uk

Build step 'Invoke Gradle script' changed build result to FAILURE
Build step 'Invoke Gradle script' marked build as failure

---------------------------------------------------------------------
To unsubscribe, e-mail: builds-unsubscribe@beam.apache.org
For additional commands, e-mail: builds-help@beam.apache.org


Build failed in Jenkins: beam_PostCommit_Python38 #3731

Posted by Apache Jenkins Server <je...@builds.apache.org>.
See <https://ci-beam.apache.org/job/beam_PostCommit_Python38/3731/display/redirect>

Changes:


------------------------------------------
[...truncated 9.54 MB...]
ff797de5fc7318ccc5574a1681d0af77a470d50c401ae03ee4a8437c449c4634
INFO:apache_beam.runners.portability.local_job_service:Completed job in 27.47615146636963 seconds with state DONE.
INFO:root:Completed job in 27.47615146636963 seconds with state DONE.
INFO:apache_beam.runners.portability.portable_runner:Job state changed to DONE

> Task :sdks:python:test-suites:dataflow:py38:postCommitIT
>>> RUNNING integration tests with pipeline options: --runner=TestDataflowRunner --project=apache-beam-testing --region=us-central1 --staging_location=gs://temp-storage-for-end-to-end-tests/staging-it --temp_location=gs://temp-storage-for-end-to-end-tests/temp-it --output=gs://temp-storage-for-end-to-end-tests/py-it-cloud/output --sdk_location=<https://ci-beam.apache.org/job/beam_PostCommit_Python38/ws/src/sdks/python/build/apache-beam.tar.gz> --requirements_file=postcommit_requirements.txt --num_workers=1 --sleep_secs=20 --kms_key_name=projects/apache-beam-testing/locations/global/keyRings/beam-it/cryptoKeys/test --dataflow_kms_key=projects/apache-beam-testing/locations/global/keyRings/beam-it/cryptoKeys/test
>>>   pytest options: --capture=no --timeout=4500 --color=yes --log-cli-level=INFO --numprocesses=8 --dist=loadfile
>>>   collect markers: -m=it_postcommit

> Task :sdks:python:test-suites:portable:py38:portableWordCountSparkRunnerBatch
INFO:apache_beam.runners.worker.worker_pool_main:Listening for workers at localhost:38277
INFO:root:Default Python SDK image for environment is apache/beam_python3.8_sdk:2.46.0.dev
INFO:apache_beam.runners.portability.fn_api_runner.translations:==================== <function pack_combiners at 0x7f3f1f524670> ====================
INFO:apache_beam.runners.portability.fn_api_runner.translations:==================== <function lift_combiners at 0x7f3f1f524700> ====================
INFO:apache_beam.runners.portability.fn_api_runner.translations:==================== <function sort_stages at 0x7f3f1f524e50> ====================
INFO:apache_beam.utils.subprocess_server:Starting service with ['java' '-jar' '<https://ci-beam.apache.org/job/beam_PostCommit_Python38/ws/src/runners/spark/3/job-server/build/libs/beam-runners-spark-3-job-server-2.46.0-SNAPSHOT.jar'> '--spark-master-url' 'local[4]' '--artifacts-dir' '/tmp/beam-tempufr70tc5/artifactsqkbyamjk' '--job-port' '46041' '--artifact-port' '0' '--expansion-port' '0']
INFO:apache_beam.utils.subprocess_server:23/02/12 08:30:13 WARN software.amazon.awssdk.regions.internal.util.EC2MetadataUtils: Unable to retrieve the requested metadata.
INFO:apache_beam.utils.subprocess_server:23/02/12 08:30:14 INFO org.apache.beam.runners.jobsubmission.JobServerDriver: ArtifactStagingService started on localhost:33223
INFO:apache_beam.utils.subprocess_server:23/02/12 08:30:14 INFO org.apache.beam.runners.jobsubmission.JobServerDriver: Java ExpansionService started on localhost:37119
INFO:apache_beam.utils.subprocess_server:23/02/12 08:30:14 INFO org.apache.beam.runners.jobsubmission.JobServerDriver: JobService started on localhost:46041
INFO:apache_beam.utils.subprocess_server:23/02/12 08:30:14 INFO org.apache.beam.runners.jobsubmission.JobServerDriver: Job server now running, terminate with Ctrl+C
WARNING:root:Waiting for grpc channel to be ready at localhost:46041.
INFO:apache_beam.utils.subprocess_server:23/02/12 08:30:15 INFO org.apache.beam.runners.fnexecution.artifact.ArtifactStagingService: Staging artifacts for job_a5e6df25-8aea-472e-b03a-a101e32c0642.
INFO:apache_beam.utils.subprocess_server:23/02/12 08:30:15 INFO org.apache.beam.runners.fnexecution.artifact.ArtifactStagingService: Resolving artifacts for job_a5e6df25-8aea-472e-b03a-a101e32c0642.ref_Environment_default_environment_1.
INFO:apache_beam.utils.subprocess_server:23/02/12 08:30:15 INFO org.apache.beam.runners.fnexecution.artifact.ArtifactStagingService: Getting 1 artifacts for job_a5e6df25-8aea-472e-b03a-a101e32c0642.null.
INFO:apache_beam.utils.subprocess_server:23/02/12 08:30:15 INFO org.apache.beam.runners.fnexecution.artifact.ArtifactStagingService: Artifacts fully staged for job_a5e6df25-8aea-472e-b03a-a101e32c0642.
INFO:apache_beam.utils.subprocess_server:23/02/12 08:30:16 INFO org.apache.beam.runners.spark.SparkJobInvoker: Invoking job BeamApp-jenkins-0212083016-2492b63d_d94093f2-5fcb-49f7-8c05-25adc04b90e0
INFO:apache_beam.utils.subprocess_server:23/02/12 08:30:16 INFO org.apache.beam.runners.jobsubmission.JobInvocation: Starting job invocation BeamApp-jenkins-0212083016-2492b63d_d94093f2-5fcb-49f7-8c05-25adc04b90e0
INFO:apache_beam.runners.portability.portable_runner:Environment "LOOPBACK" has started a component necessary for the execution. Be sure to run the pipeline using
  with Pipeline() as p:
    p.apply(..)
This ensures that the pipeline finishes before this program exits.
INFO:apache_beam.runners.portability.portable_runner:Job state changed to STOPPED
INFO:apache_beam.runners.portability.portable_runner:Job state changed to STARTING
INFO:apache_beam.runners.portability.portable_runner:Job state changed to RUNNING
INFO:apache_beam.utils.subprocess_server:23/02/12 08:30:17 INFO org.apache.beam.runners.spark.translation.SparkContextFactory: Creating a brand new Spark Context.
INFO:apache_beam.utils.subprocess_server:23/02/12 08:30:18 WARN org.apache.hadoop.util.NativeCodeLoader: Unable to load native-hadoop library for your platform... using builtin-java classes where applicable
INFO:apache_beam.utils.subprocess_server:23/02/12 08:30:19 INFO org.sparkproject.jetty.util.log: Logging initialized @9210ms to org.sparkproject.jetty.util.log.Slf4jLog
INFO:apache_beam.utils.subprocess_server:23/02/12 08:30:19 INFO org.sparkproject.jetty.server.Server: jetty-9.4.40.v20210413; built: 2021-04-13T20:42:42.668Z; git: b881a572662e1943a14ae12e7e1207989f218b74; jvm 1.8.0_352-8u352-ga-1~20.04-b08
INFO:apache_beam.utils.subprocess_server:23/02/12 08:30:19 INFO org.sparkproject.jetty.server.Server: Started @9500ms
INFO:apache_beam.utils.subprocess_server:23/02/12 08:30:19 INFO org.sparkproject.jetty.server.AbstractConnector: Started ServerConnector@7ac8d042{HTTP/1.1, (http/1.1)}{127.0.0.1:4040}
INFO:apache_beam.utils.subprocess_server:23/02/12 08:30:19 INFO org.sparkproject.jetty.server.handler.ContextHandler: Started o.s.j.s.ServletContextHandler@2a52a6e3{/jobs,null,AVAILABLE,@Spark}
INFO:apache_beam.utils.subprocess_server:23/02/12 08:30:19 INFO org.sparkproject.jetty.server.handler.ContextHandler: Started o.s.j.s.ServletContextHandler@322dd002{/jobs/json,null,AVAILABLE,@Spark}
INFO:apache_beam.utils.subprocess_server:23/02/12 08:30:19 INFO org.sparkproject.jetty.server.handler.ContextHandler: Started o.s.j.s.ServletContextHandler@7ad5dac{/jobs/job,null,AVAILABLE,@Spark}
INFO:apache_beam.utils.subprocess_server:23/02/12 08:30:19 INFO org.sparkproject.jetty.server.handler.ContextHandler: Started o.s.j.s.ServletContextHandler@63290806{/jobs/job/json,null,AVAILABLE,@Spark}
INFO:apache_beam.utils.subprocess_server:23/02/12 08:30:19 INFO org.sparkproject.jetty.server.handler.ContextHandler: Started o.s.j.s.ServletContextHandler@3820c2ff{/stages,null,AVAILABLE,@Spark}
INFO:apache_beam.utils.subprocess_server:23/02/12 08:30:19 INFO org.sparkproject.jetty.server.handler.ContextHandler: Started o.s.j.s.ServletContextHandler@72904adc{/stages/json,null,AVAILABLE,@Spark}
INFO:apache_beam.utils.subprocess_server:23/02/12 08:30:19 INFO org.sparkproject.jetty.server.handler.ContextHandler: Started o.s.j.s.ServletContextHandler@617fe0ae{/stages/stage,null,AVAILABLE,@Spark}
INFO:apache_beam.utils.subprocess_server:23/02/12 08:30:19 INFO org.sparkproject.jetty.server.handler.ContextHandler: Started o.s.j.s.ServletContextHandler@2e9a6a03{/stages/stage/json,null,AVAILABLE,@Spark}
INFO:apache_beam.utils.subprocess_server:23/02/12 08:30:19 INFO org.sparkproject.jetty.server.handler.ContextHandler: Started o.s.j.s.ServletContextHandler@6d24a9a3{/stages/pool,null,AVAILABLE,@Spark}
INFO:apache_beam.utils.subprocess_server:23/02/12 08:30:19 INFO org.sparkproject.jetty.server.handler.ContextHandler: Started o.s.j.s.ServletContextHandler@54185067{/stages/pool/json,null,AVAILABLE,@Spark}
INFO:apache_beam.utils.subprocess_server:23/02/12 08:30:19 INFO org.sparkproject.jetty.server.handler.ContextHandler: Started o.s.j.s.ServletContextHandler@16dbd4f5{/storage,null,AVAILABLE,@Spark}
INFO:apache_beam.utils.subprocess_server:23/02/12 08:30:19 INFO org.sparkproject.jetty.server.handler.ContextHandler: Started o.s.j.s.ServletContextHandler@56c69eee{/storage/json,null,AVAILABLE,@Spark}
INFO:apache_beam.utils.subprocess_server:23/02/12 08:30:19 INFO org.sparkproject.jetty.server.handler.ContextHandler: Started o.s.j.s.ServletContextHandler@10bf0b41{/storage/rdd,null,AVAILABLE,@Spark}
INFO:apache_beam.utils.subprocess_server:23/02/12 08:30:19 INFO org.sparkproject.jetty.server.handler.ContextHandler: Started o.s.j.s.ServletContextHandler@699396e3{/storage/rdd/json,null,AVAILABLE,@Spark}
INFO:apache_beam.utils.subprocess_server:23/02/12 08:30:19 INFO org.sparkproject.jetty.server.handler.ContextHandler: Started o.s.j.s.ServletContextHandler@11335a1{/environment,null,AVAILABLE,@Spark}
INFO:apache_beam.utils.subprocess_server:23/02/12 08:30:19 INFO org.sparkproject.jetty.server.handler.ContextHandler: Started o.s.j.s.ServletContextHandler@7d4f8af6{/environment/json,null,AVAILABLE,@Spark}
INFO:apache_beam.utils.subprocess_server:23/02/12 08:30:19 INFO org.sparkproject.jetty.server.handler.ContextHandler: Started o.s.j.s.ServletContextHandler@7a9e2c9a{/executors,null,AVAILABLE,@Spark}
INFO:apache_beam.utils.subprocess_server:23/02/12 08:30:19 INFO org.sparkproject.jetty.server.handler.ContextHandler: Started o.s.j.s.ServletContextHandler@2ec6282{/executors/json,null,AVAILABLE,@Spark}
INFO:apache_beam.utils.subprocess_server:23/02/12 08:30:19 INFO org.sparkproject.jetty.server.handler.ContextHandler: Started o.s.j.s.ServletContextHandler@2e9879ee{/executors/threadDump,null,AVAILABLE,@Spark}
INFO:apache_beam.utils.subprocess_server:23/02/12 08:30:19 INFO org.sparkproject.jetty.server.handler.ContextHandler: Started o.s.j.s.ServletContextHandler@66dc52d5{/executors/threadDump/json,null,AVAILABLE,@Spark}
INFO:apache_beam.utils.subprocess_server:23/02/12 08:30:19 INFO org.sparkproject.jetty.server.handler.ContextHandler: Started o.s.j.s.ServletContextHandler@6538628f{/static,null,AVAILABLE,@Spark}
INFO:apache_beam.utils.subprocess_server:23/02/12 08:30:19 INFO org.sparkproject.jetty.server.handler.ContextHandler: Started o.s.j.s.ServletContextHandler@276df83a{/,null,AVAILABLE,@Spark}
INFO:apache_beam.utils.subprocess_server:23/02/12 08:30:19 INFO org.sparkproject.jetty.server.handler.ContextHandler: Started o.s.j.s.ServletContextHandler@2242977d{/api,null,AVAILABLE,@Spark}
INFO:apache_beam.utils.subprocess_server:23/02/12 08:30:19 INFO org.sparkproject.jetty.server.handler.ContextHandler: Started o.s.j.s.ServletContextHandler@77e9fedb{/jobs/job/kill,null,AVAILABLE,@Spark}
INFO:apache_beam.utils.subprocess_server:23/02/12 08:30:19 INFO org.sparkproject.jetty.server.handler.ContextHandler: Started o.s.j.s.ServletContextHandler@c595d69{/stages/stage/kill,null,AVAILABLE,@Spark}
INFO:apache_beam.utils.subprocess_server:23/02/12 08:30:19 INFO org.sparkproject.jetty.server.handler.ContextHandler: Started o.s.j.s.ServletContextHandler@714034fa{/metrics/json,null,AVAILABLE,@Spark}
INFO:apache_beam.utils.subprocess_server:23/02/12 08:30:19 INFO org.apache.beam.runners.spark.metrics.MetricsAccumulator: Instantiated metrics accumulator: MetricQueryResults()
INFO:apache_beam.utils.subprocess_server:23/02/12 08:30:19 WARN software.amazon.awssdk.regions.internal.util.EC2MetadataUtils: Unable to retrieve the requested metadata.
INFO:apache_beam.utils.subprocess_server:23/02/12 08:30:19 INFO org.apache.beam.runners.spark.SparkPipelineRunner: Running job BeamApp-jenkins-0212083016-2492b63d_d94093f2-5fcb-49f7-8c05-25adc04b90e0 on Spark master local[4]
INFO:apache_beam.utils.subprocess_server:23/02/12 08:30:21 WARN software.amazon.awssdk.regions.internal.util.EC2MetadataUtils: Unable to retrieve the requested metadata.
INFO:apache_beam.utils.subprocess_server:23/02/12 08:30:21 WARN software.amazon.awssdk.regions.internal.util.EC2MetadataUtils: Unable to retrieve the requested metadata.
INFO:apache_beam.utils.subprocess_server:23/02/12 08:30:21 WARN software.amazon.awssdk.regions.internal.util.EC2MetadataUtils: Unable to retrieve the requested metadata.
INFO:apache_beam.utils.subprocess_server:23/02/12 08:30:21 WARN software.amazon.awssdk.regions.internal.util.EC2MetadataUtils: Unable to retrieve the requested metadata.
INFO:apache_beam.runners.worker.statecache:Creating state cache with size 0
INFO:apache_beam.runners.worker.sdk_worker:Creating insecure control channel for localhost:36311.
INFO:apache_beam.runners.worker.sdk_worker:Control channel established.
INFO:apache_beam.runners.worker.sdk_worker:Initializing SDKHarness with unbounded number of workers.
INFO:apache_beam.utils.subprocess_server:23/02/12 08:30:22 INFO org.apache.beam.runners.fnexecution.control.FnApiControlClientPoolService: Beam Fn Control client connected with id 1-1
INFO:apache_beam.utils.subprocess_server:23/02/12 08:30:22 INFO org.apache.beam.runners.fnexecution.control.FnApiControlClientPoolService: getProcessBundleDescriptor request with id 1-2
INFO:apache_beam.runners.worker.sdk_worker:Creating insecure state channel for localhost:33573.
INFO:apache_beam.runners.worker.sdk_worker:State channel established.
INFO:root:Default Python SDK image for environment is apache/beam_python3.8_sdk:2.46.0.dev
INFO:apache_beam.runners.worker.data_plane:Creating client data channel for localhost:45961
INFO:apache_beam.utils.subprocess_server:23/02/12 08:30:22 INFO org.apache.beam.runners.fnexecution.data.GrpcDataService: Beam Fn Data client connected.
INFO:apache_beam.utils.subprocess_server:23/02/12 08:30:22 INFO org.apache.beam.runners.fnexecution.control.FnApiControlClientPoolService: getProcessBundleDescriptor request with id 1-3
INFO:root:Default Python SDK image for environment is apache/beam_python3.8_sdk:2.46.0.dev
INFO:apache_beam.utils.subprocess_server:23/02/12 08:30:22 WARN software.amazon.awssdk.regions.internal.util.EC2MetadataUtils: Unable to retrieve the requested metadata.
INFO:apache_beam.utils.subprocess_server:23/02/12 08:30:22 WARN software.amazon.awssdk.regions.internal.util.EC2MetadataUtils: Unable to retrieve the requested metadata.
INFO:apache_beam.utils.subprocess_server:23/02/12 08:30:22 WARN software.amazon.awssdk.regions.internal.util.EC2MetadataUtils: Unable to retrieve the requested metadata.
INFO:apache_beam.utils.subprocess_server:23/02/12 08:30:22 WARN software.amazon.awssdk.regions.internal.util.EC2MetadataUtils: Unable to retrieve the requested metadata.
INFO:apache_beam.utils.subprocess_server:23/02/12 08:30:23 INFO org.apache.beam.runners.fnexecution.control.FnApiControlClientPoolService: getProcessBundleDescriptor request with id 1-4
INFO:root:Default Python SDK image for environment is apache/beam_python3.8_sdk:2.46.0.dev
INFO:apache_beam.utils.subprocess_server:23/02/12 08:30:23 INFO org.apache.beam.runners.fnexecution.control.FnApiControlClientPoolService: getProcessBundleDescriptor request with id 1-5
INFO:root:Default Python SDK image for environment is apache/beam_python3.8_sdk:2.46.0.dev
INFO:apache_beam.utils.subprocess_server:23/02/12 08:30:23 WARN software.amazon.awssdk.regions.internal.util.EC2MetadataUtils: Unable to retrieve the requested metadata.
INFO:apache_beam.utils.subprocess_server:23/02/12 08:30:23 WARN software.amazon.awssdk.regions.internal.util.EC2MetadataUtils: Unable to retrieve the requested metadata.
INFO:apache_beam.utils.subprocess_server:23/02/12 08:30:23 WARN software.amazon.awssdk.regions.internal.util.EC2MetadataUtils: Unable to retrieve the requested metadata.
INFO:apache_beam.utils.subprocess_server:23/02/12 08:30:23 WARN software.amazon.awssdk.regions.internal.util.EC2MetadataUtils: Unable to retrieve the requested metadata.
INFO:apache_beam.utils.subprocess_server:23/02/12 08:30:23 INFO org.apache.beam.runners.fnexecution.control.FnApiControlClientPoolService: getProcessBundleDescriptor request with id 1-6
INFO:root:Default Python SDK image for environment is apache/beam_python3.8_sdk:2.46.0.dev
INFO:apache_beam.utils.subprocess_server:23/02/12 08:30:23 INFO org.apache.beam.runners.fnexecution.control.FnApiControlClientPoolService: getProcessBundleDescriptor request with id 1-7
INFO:root:Default Python SDK image for environment is apache/beam_python3.8_sdk:2.46.0.dev
INFO:apache_beam.utils.subprocess_server:23/02/12 08:30:23 INFO org.apache.beam.runners.fnexecution.control.FnApiControlClientPoolService: getProcessBundleDescriptor request with id 1-9
INFO:root:Default Python SDK image for environment is apache/beam_python3.8_sdk:2.46.0.dev
INFO:apache_beam.utils.subprocess_server:23/02/12 08:30:23 INFO org.apache.beam.runners.fnexecution.control.FnApiControlClientPoolService: getProcessBundleDescriptor request with id 1-8
INFO:root:Default Python SDK image for environment is apache/beam_python3.8_sdk:2.46.0.dev
INFO:root:Default Python SDK image for environment is apache/beam_python3.8_sdk:2.46.0.dev
INFO:apache_beam.utils.subprocess_server:23/02/12 08:30:23 INFO org.apache.beam.runners.fnexecution.control.FnApiControlClientPoolService: getProcessBundleDescriptor request with id 1-10
INFO:apache_beam.utils.subprocess_server:23/02/12 08:30:23 INFO org.apache.beam.runners.fnexecution.control.FnApiControlClientPoolService: getProcessBundleDescriptor request with id 1-11
INFO:root:Default Python SDK image for environment is apache/beam_python3.8_sdk:2.46.0.dev
INFO:apache_beam.utils.subprocess_server:23/02/12 08:30:23 INFO org.apache.beam.runners.fnexecution.control.FnApiControlClientPoolService: getProcessBundleDescriptor request with id 1-12
INFO:root:Default Python SDK image for environment is apache/beam_python3.8_sdk:2.46.0.dev
INFO:apache_beam.utils.subprocess_server:23/02/12 08:30:23 INFO org.apache.beam.runners.fnexecution.control.FnApiControlClientPoolService: getProcessBundleDescriptor request with id 1-13
INFO:root:Default Python SDK image for environment is apache/beam_python3.8_sdk:2.46.0.dev
INFO:apache_beam.utils.subprocess_server:23/02/12 08:30:23 WARN software.amazon.awssdk.regions.internal.util.EC2MetadataUtils: Unable to retrieve the requested metadata.
INFO:apache_beam.utils.subprocess_server:23/02/12 08:30:23 WARN software.amazon.awssdk.regions.internal.util.EC2MetadataUtils: Unable to retrieve the requested metadata.
INFO:apache_beam.utils.subprocess_server:23/02/12 08:30:23 WARN software.amazon.awssdk.regions.internal.util.EC2MetadataUtils: Unable to retrieve the requested metadata.
INFO:apache_beam.utils.subprocess_server:23/02/12 08:30:23 WARN software.amazon.awssdk.regions.internal.util.EC2MetadataUtils: Unable to retrieve the requested metadata.
INFO:apache_beam.utils.subprocess_server:23/02/12 08:30:23 INFO org.apache.beam.runners.fnexecution.control.FnApiControlClientPoolService: getProcessBundleDescriptor request with id 1-14
INFO:root:Default Python SDK image for environment is apache/beam_python3.8_sdk:2.46.0.dev
INFO:apache_beam.utils.subprocess_server:23/02/12 08:30:23 WARN software.amazon.awssdk.regions.internal.util.EC2MetadataUtils: Unable to retrieve the requested metadata.
INFO:apache_beam.utils.subprocess_server:23/02/12 08:30:24 WARN software.amazon.awssdk.regions.internal.util.EC2MetadataUtils: Unable to retrieve the requested metadata.
INFO:apache_beam.utils.subprocess_server:23/02/12 08:30:24 WARN software.amazon.awssdk.regions.internal.util.EC2MetadataUtils: Unable to retrieve the requested metadata.
INFO:apache_beam.utils.subprocess_server:23/02/12 08:30:24 WARN software.amazon.awssdk.regions.internal.util.EC2MetadataUtils: Unable to retrieve the requested metadata.
INFO:apache_beam.utils.subprocess_server:23/02/12 08:30:24 INFO org.apache.beam.runners.fnexecution.control.FnApiControlClientPoolService: getProcessBundleDescriptor request with id 1-15
INFO:root:Default Python SDK image for environment is apache/beam_python3.8_sdk:2.46.0.dev
INFO:apache_beam.utils.subprocess_server:23/02/12 08:30:24 INFO org.apache.beam.runners.spark.SparkPipelineRunner: Job BeamApp-jenkins-0212083016-2492b63d_d94093f2-5fcb-49f7-8c05-25adc04b90e0: Pipeline translated successfully. Computing outputs
INFO:apache_beam.utils.subprocess_server:23/02/12 08:30:24 WARN software.amazon.awssdk.regions.internal.util.EC2MetadataUtils: Unable to retrieve the requested metadata.
INFO:apache_beam.utils.subprocess_server:23/02/12 08:30:24 WARN software.amazon.awssdk.regions.internal.util.EC2MetadataUtils: Unable to retrieve the requested metadata.
INFO:apache_beam.utils.subprocess_server:23/02/12 08:30:24 WARN software.amazon.awssdk.regions.internal.util.EC2MetadataUtils: Unable to retrieve the requested metadata.
INFO:apache_beam.utils.subprocess_server:23/02/12 08:30:24 WARN software.amazon.awssdk.regions.internal.util.EC2MetadataUtils: Unable to retrieve the requested metadata.
INFO:apache_beam.utils.subprocess_server:23/02/12 08:30:24 INFO org.apache.beam.runners.fnexecution.control.FnApiControlClientPoolService: getProcessBundleDescriptor request with id 1-16
INFO:root:Default Python SDK image for environment is apache/beam_python3.8_sdk:2.46.0.dev
INFO:apache_beam.io.filebasedsink:Starting finalize_write threads with num_shards: 4 (skipped: 0), batches: 4, num_threads: 4
INFO:apache_beam.io.filebasedsink:Renamed 4 shards in 0.01 seconds.
INFO:apache_beam.utils.subprocess_server:23/02/12 08:30:24 INFO org.apache.beam.runners.spark.SparkPipelineRunner: Job BeamApp-jenkins-0212083016-2492b63d_d94093f2-5fcb-49f7-8c05-25adc04b90e0 finished.
INFO:apache_beam.utils.subprocess_server:23/02/12 08:30:24 INFO org.sparkproject.jetty.server.AbstractConnector: Stopped Spark@7ac8d042{HTTP/1.1, (http/1.1)}{127.0.0.1:4040}
INFO:apache_beam.runners.portability.portable_runner:Job state changed to DONE
Exception in thread read_state:
Traceback (most recent call last):
  File "/usr/lib/python3.8/threading.py", line 932, in _bootstrap_inner
    self.run()
  File "/usr/lib/python3.8/threading.py", line 870, in run
Exception in thread run_worker_1-1:
Traceback (most recent call last):
  File "/usr/lib/python3.8/threading.py", line 932, in _bootstrap_inner
    self.run()
  File "/usr/lib/python3.8/threading.py", line 870, in run
    self._target(*self._args, **self._kwargs)
  File "<https://ci-beam.apache.org/job/beam_PostCommit_Python38/ws/src/sdks/python/apache_beam/runners/worker/sdk_worker.py",> line 254, in run
    self._target(*self._args, **self._kwargs)
  File "<https://ci-beam.apache.org/job/beam_PostCommit_Python38/ws/src/sdks/python/apache_beam/runners/worker/sdk_worker.py",> line 1006, in pull_responses
    for work_request in self._control_stub.Control(get_responses()):
  File "<https://ci-beam.apache.org/job/beam_PostCommit_Python38/ws/src/build/gradleenv/2022703442/lib/python3.8/site-packages/grpc/_channel.py",> line 426, in __next__
    return self._next()
  File "<https://ci-beam.apache.org/job/beam_PostCommit_Python38/ws/src/build/gradleenv/2022703442/lib/python3.8/site-packages/grpc/_channel.py",> line 826, in _next
    for response in responses:
  File "<https://ci-beam.apache.org/job/beam_PostCommit_Python38/ws/src/build/gradleenv/2022703442/lib/python3.8/site-packages/grpc/_channel.py",> line 426, in __next__
    raise self
grpc._channel._MultiThreadedRendezvous: <_MultiThreadedRendezvous of RPC that terminated with:
	status = StatusCode.UNAVAILABLE
	details = "Socket closed"
	debug_error_string = "UNKNOWN:Error received from peer ipv6:%5B::1%5D:36311 {grpc_message:"Socket closed", grpc_status:14, created_time:"2023-02-12T08:30:25.000652271+00:00"}"
>
    return self._next()
  File "<https://ci-beam.apache.org/job/beam_PostCommit_Python38/ws/src/build/gradleenv/2022703442/lib/python3.8/site-packages/grpc/_channel.py",> line 826, in _next
    raise self
grpc._channel._MultiThreadedRendezvous: <_MultiThreadedRendezvous of RPC that terminated with:
	status = StatusCode.UNAVAILABLE
	details = "Socket closed"
	debug_error_string = "UNKNOWN:Error received from peer ipv6:%5B::1%5D:33573 {grpc_message:"Socket closed", grpc_status:14, created_time:"2023-02-12T08:30:25.000616765+00:00"}"
>
ERROR:apache_beam.runners.worker.data_plane:Failed to read inputs in the data plane.
Traceback (most recent call last):
  File "<https://ci-beam.apache.org/job/beam_PostCommit_Python38/ws/src/sdks/python/apache_beam/runners/worker/data_plane.py",> line 654, in _read_inputs
    for elements in elements_iterator:
  File "<https://ci-beam.apache.org/job/beam_PostCommit_Python38/ws/src/build/gradleenv/2022703442/lib/python3.8/site-packages/grpc/_channel.py",> line 426, in __next__
    return self._next()
  File "<https://ci-beam.apache.org/job/beam_PostCommit_Python38/ws/src/build/gradleenv/2022703442/lib/python3.8/site-packages/grpc/_channel.py",> line 826, in _next
    raise self
grpc._channel._MultiThreadedRendezvous: <_MultiThreadedRendezvous of RPC that terminated with:
	status = StatusCode.UNAVAILABLE
	details = "Socket closed"
	debug_error_string = "UNKNOWN:Error received from peer ipv6:%5B::1%5D:45961 {created_time:"2023-02-12T08:30:25.000622127+00:00", grpc_status:14, grpc_message:"Socket closed"}"
>
Exception in thread read_grpc_client_inputs:
Traceback (most recent call last):
  File "/usr/lib/python3.8/threading.py", line 932, in _bootstrap_inner
    self.run()
  File "/usr/lib/python3.8/threading.py", line 870, in run
    self._target(*self._args, **self._kwargs)
  File "<https://ci-beam.apache.org/job/beam_PostCommit_Python38/ws/src/sdks/python/apache_beam/runners/worker/data_plane.py",> line 671, in <lambda>
    target=lambda: self._read_inputs(elements_iterator),
  File "<https://ci-beam.apache.org/job/beam_PostCommit_Python38/ws/src/sdks/python/apache_beam/runners/worker/data_plane.py",> line 654, in _read_inputs
    for elements in elements_iterator:
  File "<https://ci-beam.apache.org/job/beam_PostCommit_Python38/ws/src/build/gradleenv/2022703442/lib/python3.8/site-packages/grpc/_channel.py",> line 426, in __next__
    return self._next()
  File "<https://ci-beam.apache.org/job/beam_PostCommit_Python38/ws/src/build/gradleenv/2022703442/lib/python3.8/site-packages/grpc/_channel.py",> line 826, in _next
    raise self
grpc._channel._MultiThreadedRendezvous: <_MultiThreadedRendezvous of RPC that terminated with:
	status = StatusCode.UNAVAILABLE
	details = "Socket closed"
	debug_error_string = "UNKNOWN:Error received from peer ipv6:%5B::1%5D:45961 {created_time:"2023-02-12T08:30:25.000622127+00:00", grpc_status:14, grpc_message:"Socket closed"}"
>

> Task :sdks:python:test-suites:portable:py38:postCommitPy38

> Task :sdks:python:test-suites:dataflow:py38:postCommitIT
warning: sdist: standard file not found: should have one of README, README.rst, README.txt, README.md

warning: check: missing required meta-data: url

warning: check: missing meta-data: either (author and author_email) or (maintainer and maintainer_email) must be supplied


FAILURE: Build failed with an exception.

* Where:
Script '<https://ci-beam.apache.org/job/beam_PostCommit_Python38/ws/src/sdks/python/test-suites/direct/common.gradle'> line: 185

* What went wrong:
Execution failed for task ':sdks:python:test-suites:direct:py38:hdfsIntegrationTest'.
> Process 'command 'sh'' finished with non-zero exit value 1

* Try:
> Run with --stacktrace option to get the stack trace.
> Run with --info or --debug option to get more log output.

* Get more help at https://help.gradle.org

Deprecated Gradle features were used in this build, making it incompatible with Gradle 8.0.

You can use '--warning-mode all' to show the individual deprecation warnings and determine if they come from your own scripts or plugins.

See https://docs.gradle.org/7.5.1/userguide/command_line_interface.html#sec:command_line_warnings

Execution optimizations have been disabled for 1 invalid unit(s) of work during this build to ensure correctness.
Please consult deprecation warnings for more details.

BUILD FAILED in 3h 17m 54s
205 actionable tasks: 141 executed, 58 from cache, 6 up-to-date

Publishing build scan...
https://gradle.com/s/q2uhquw7if6ri

Build step 'Invoke Gradle script' changed build result to FAILURE
Build step 'Invoke Gradle script' marked build as failure

---------------------------------------------------------------------
To unsubscribe, e-mail: builds-unsubscribe@beam.apache.org
For additional commands, e-mail: builds-help@beam.apache.org


Build failed in Jenkins: beam_PostCommit_Python38 #3730

Posted by Apache Jenkins Server <je...@builds.apache.org>.
See <https://ci-beam.apache.org/job/beam_PostCommit_Python38/3730/display/redirect>

Changes:


------------------------------------------
[...truncated 10.45 MB...]
../../build/gradleenv/-1734967051/lib/python3.8/site-packages/tenacity/_asyncio.py:42
../../build/gradleenv/-1734967051/lib/python3.8/site-packages/tenacity/_asyncio.py:42
../../build/gradleenv/-1734967051/lib/python3.8/site-packages/tenacity/_asyncio.py:42
../../build/gradleenv/-1734967051/lib/python3.8/site-packages/tenacity/_asyncio.py:42
../../build/gradleenv/-1734967051/lib/python3.8/site-packages/tenacity/_asyncio.py:42
../../build/gradleenv/-1734967051/lib/python3.8/site-packages/tenacity/_asyncio.py:42
  <https://ci-beam.apache.org/job/beam_PostCommit_Python38/ws/src/build/gradleenv/-1734967051/lib/python3.8/site-packages/tenacity/_asyncio.py>:42: DeprecationWarning: "@coroutine" decorator is deprecated since Python 3.8, use "async def" instead
    def call(self, fn, *args, **kwargs):

apache_beam/typehints/pandas_type_compatibility_test.py:67
apache_beam/typehints/pandas_type_compatibility_test.py:67
apache_beam/typehints/pandas_type_compatibility_test.py:67
apache_beam/typehints/pandas_type_compatibility_test.py:67
apache_beam/typehints/pandas_type_compatibility_test.py:67
apache_beam/typehints/pandas_type_compatibility_test.py:67
apache_beam/typehints/pandas_type_compatibility_test.py:67
apache_beam/typehints/pandas_type_compatibility_test.py:67
  <https://ci-beam.apache.org/job/beam_PostCommit_Python38/ws/src/sdks/python/apache_beam/typehints/pandas_type_compatibility_test.py>:67: FutureWarning: pandas.Int64Index is deprecated and will be removed from pandas in a future version. Use pandas.Index with the appropriate dtype instead.
    }).set_index(pd.Int64Index(range(123, 223), name='an_index')),

apache_beam/typehints/pandas_type_compatibility_test.py:90
apache_beam/typehints/pandas_type_compatibility_test.py:90
apache_beam/typehints/pandas_type_compatibility_test.py:90
apache_beam/typehints/pandas_type_compatibility_test.py:90
apache_beam/typehints/pandas_type_compatibility_test.py:90
apache_beam/typehints/pandas_type_compatibility_test.py:90
apache_beam/typehints/pandas_type_compatibility_test.py:90
apache_beam/typehints/pandas_type_compatibility_test.py:90
  <https://ci-beam.apache.org/job/beam_PostCommit_Python38/ws/src/sdks/python/apache_beam/typehints/pandas_type_compatibility_test.py>:90: FutureWarning: pandas.Int64Index is deprecated and will be removed from pandas in a future version. Use pandas.Index with the appropriate dtype instead.
    pd.Int64Index(range(123, 223), name='an_index'),

apache_beam/typehints/pandas_type_compatibility_test.py:91
apache_beam/typehints/pandas_type_compatibility_test.py:91
apache_beam/typehints/pandas_type_compatibility_test.py:91
apache_beam/typehints/pandas_type_compatibility_test.py:91
apache_beam/typehints/pandas_type_compatibility_test.py:91
apache_beam/typehints/pandas_type_compatibility_test.py:91
apache_beam/typehints/pandas_type_compatibility_test.py:91
apache_beam/typehints/pandas_type_compatibility_test.py:91
  <https://ci-beam.apache.org/job/beam_PostCommit_Python38/ws/src/sdks/python/apache_beam/typehints/pandas_type_compatibility_test.py>:91: FutureWarning: pandas.Int64Index is deprecated and will be removed from pandas in a future version. Use pandas.Index with the appropriate dtype instead.
    pd.Int64Index(range(475, 575), name='another_index'),

apache_beam/dataframe/io_it_test.py: 3 warnings
apache_beam/examples/cookbook/bigquery_tornadoes_it_test.py: 1 warning
apache_beam/examples/dataframe/flight_delays_it_test.py: 1 warning
apache_beam/io/gcp/bigquery_read_it_test.py: 7 warnings
apache_beam/io/gcp/bigquery_io_read_it_test.py: 2 warnings
apache_beam/io/gcp/bigquery_json_it_test.py: 3 warnings
apache_beam/io/gcp/big_query_query_to_table_it_test.py: 4 warnings
  <https://ci-beam.apache.org/job/beam_PostCommit_Python38/ws/src/sdks/python/apache_beam/io/gcp/bigquery.py>:2485: BeamDeprecationWarning: options is deprecated since First stable release. References to <pipeline>.options will not be supported
    temp_location = pcoll.pipeline.options.view_as(

apache_beam/dataframe/io_it_test.py: 3 warnings
apache_beam/examples/cookbook/bigquery_tornadoes_it_test.py: 1 warning
apache_beam/examples/dataframe/flight_delays_it_test.py: 1 warning
apache_beam/io/gcp/bigquery_read_it_test.py: 7 warnings
apache_beam/io/gcp/bigquery_io_read_it_test.py: 2 warnings
apache_beam/io/gcp/bigquery_json_it_test.py: 3 warnings
apache_beam/io/gcp/big_query_query_to_table_it_test.py: 4 warnings
  <https://ci-beam.apache.org/job/beam_PostCommit_Python38/ws/src/sdks/python/apache_beam/io/gcp/bigquery.py>:2487: BeamDeprecationWarning: options is deprecated since First stable release. References to <pipeline>.options will not be supported
    job_name = pcoll.pipeline.options.view_as(GoogleCloudOptions).job_name

apache_beam/dataframe/io_it_test.py: 3 warnings
apache_beam/examples/cookbook/bigquery_tornadoes_it_test.py: 1 warning
apache_beam/examples/dataframe/flight_delays_it_test.py: 1 warning
apache_beam/io/gcp/bigquery_read_it_test.py: 7 warnings
apache_beam/io/gcp/bigquery_io_read_it_test.py: 2 warnings
apache_beam/io/gcp/bigquery_json_it_test.py: 3 warnings
apache_beam/io/gcp/big_query_query_to_table_it_test.py: 4 warnings
  <https://ci-beam.apache.org/job/beam_PostCommit_Python38/ws/src/sdks/python/apache_beam/io/gcp/bigquery.py>:2511: BeamDeprecationWarning: options is deprecated since First stable release. References to <pipeline>.options will not be supported
    pipeline_options=pcoll.pipeline.options,

apache_beam/examples/complete/game/game_stats_it_test.py::GameStatsIT::test_game_stats_it
apache_beam/examples/complete/game/hourly_team_score_it_test.py::HourlyTeamScoreIT::test_hourly_team_score_it
apache_beam/examples/complete/game/leader_board_it_test.py::LeaderBoardIT::test_leader_board_it
apache_beam/io/gcp/bigquery_test.py::PubSubBigQueryIT::test_file_loads
apache_beam/io/gcp/bigquery_test.py::PubSubBigQueryIT::test_streaming_inserts
  <https://ci-beam.apache.org/job/beam_PostCommit_Python38/ws/src/sdks/python/apache_beam/io/gcp/tests/utils.py>:63: PendingDeprecationWarning: Client.dataset is deprecated and will be removed in a future version. Use a string like 'my_project.my_dataset' or a cloud.google.bigquery.DatasetReference object, instead.
    dataset_ref = client.dataset(unique_dataset_name, project=project)

apache_beam/examples/complete/game/game_stats_it_test.py: 2 warnings
apache_beam/examples/cookbook/bigquery_tornadoes_it_test.py: 1 warning
apache_beam/examples/complete/game/hourly_team_score_it_test.py: 1 warning
apache_beam/examples/complete/game/leader_board_it_test.py: 2 warnings
apache_beam/io/gcp/bigquery_file_loads_test.py: 3 warnings
apache_beam/io/gcp/bigquery_test.py: 6 warnings
apache_beam/io/gcp/bigquery_write_it_test.py: 4 warnings
apache_beam/io/gcp/bigquery_json_it_test.py: 2 warnings
apache_beam/io/gcp/big_query_query_to_table_it_test.py: 4 warnings
  <https://ci-beam.apache.org/job/beam_PostCommit_Python38/ws/src/sdks/python/apache_beam/io/gcp/bigquery.py>:1992: BeamDeprecationWarning: options is deprecated since First stable release. References to <pipeline>.options will not be supported
    is_streaming_pipeline = p.options.view_as(StandardOptions).streaming

apache_beam/examples/complete/game/game_stats_it_test.py: 2 warnings
apache_beam/examples/cookbook/bigquery_tornadoes_it_test.py: 1 warning
apache_beam/examples/complete/game/hourly_team_score_it_test.py: 1 warning
apache_beam/examples/complete/game/leader_board_it_test.py: 2 warnings
apache_beam/io/gcp/bigquery_file_loads_test.py: 3 warnings
apache_beam/io/gcp/bigquery_test.py: 6 warnings
apache_beam/io/gcp/bigquery_write_it_test.py: 4 warnings
apache_beam/io/gcp/bigquery_json_it_test.py: 2 warnings
apache_beam/io/gcp/big_query_query_to_table_it_test.py: 4 warnings
  <https://ci-beam.apache.org/job/beam_PostCommit_Python38/ws/src/sdks/python/apache_beam/io/gcp/bigquery.py>:1998: BeamDeprecationWarning: options is deprecated since First stable release. References to <pipeline>.options will not be supported
    experiments = p.options.view_as(DebugOptions).experiments or []

apache_beam/dataframe/io_it_test.py: 2 warnings
apache_beam/io/gcp/bigquery_json_it_test.py: 1 warning
apache_beam/io/gcp/bigquery_read_it_test.py: 9 warnings
  <https://ci-beam.apache.org/job/beam_PostCommit_Python38/ws/src/sdks/python/apache_beam/io/gcp/bigquery.py>:2529: BeamDeprecationWarning: options is deprecated since First stable release. References to <pipeline>.options will not be supported
    project_id = pcoll.pipeline.options.view_as(GoogleCloudOptions).project

apache_beam/dataframe/io_it_test.py: 2 warnings
apache_beam/io/gcp/bigquery_json_it_test.py: 1 warning
apache_beam/io/gcp/bigquery_read_it_test.py: 9 warnings
  <https://ci-beam.apache.org/job/beam_PostCommit_Python38/ws/src/sdks/python/apache_beam/io/gcp/bigquery.py>:2550: BeamDeprecationWarning: options is deprecated since First stable release. References to <pipeline>.options will not be supported
    pipeline_options=pcoll.pipeline.options,

apache_beam/examples/cookbook/bigquery_tornadoes_it_test.py: 1 warning
apache_beam/io/gcp/bigquery_write_it_test.py: 4 warnings
apache_beam/io/gcp/bigquery_test.py: 2 warnings
apache_beam/io/gcp/big_query_query_to_table_it_test.py: 4 warnings
  <https://ci-beam.apache.org/job/beam_PostCommit_Python38/ws/src/sdks/python/apache_beam/io/gcp/bigquery.py>:1988: BeamDeprecationWarning: options is deprecated since First stable release. References to <pipeline>.options will not be supported
    self.table_reference.projectId = pcoll.pipeline.options.view_as(

apache_beam/examples/cookbook/bigquery_tornadoes_it_test.py: 1 warning
apache_beam/io/gcp/bigquery_file_loads_test.py: 3 warnings
apache_beam/io/gcp/bigquery_write_it_test.py: 3 warnings
apache_beam/io/gcp/bigquery_test.py: 3 warnings
apache_beam/io/gcp/big_query_query_to_table_it_test.py: 4 warnings
  <https://ci-beam.apache.org/job/beam_PostCommit_Python38/ws/src/sdks/python/apache_beam/io/gcp/bigquery_file_loads.py>:1166: BeamDeprecationWarning: options is deprecated since First stable release. References to <pipeline>.options will not be supported
    self.project = self.project or p.options.view_as(GoogleCloudOptions).project

apache_beam/examples/cookbook/bigquery_tornadoes_it_test.py: 1 warning
apache_beam/examples/complete/game/hourly_team_score_it_test.py: 1 warning
apache_beam/io/gcp/bigquery_file_loads_test.py: 3 warnings
apache_beam/io/gcp/bigquery_write_it_test.py: 3 warnings
apache_beam/io/gcp/bigquery_test.py: 3 warnings
apache_beam/io/gcp/big_query_query_to_table_it_test.py: 4 warnings
  <https://ci-beam.apache.org/job/beam_PostCommit_Python38/ws/src/sdks/python/apache_beam/io/gcp/bigquery_file_loads.py>:1173: BeamDeprecationWarning: options is deprecated since First stable release. References to <pipeline>.options will not be supported
    temp_location = p.options.view_as(GoogleCloudOptions).temp_location

apache_beam/examples/cookbook/bigquery_tornadoes_it_test.py: 1 warning
apache_beam/examples/complete/game/hourly_team_score_it_test.py: 1 warning
apache_beam/io/gcp/bigquery_file_loads_test.py: 3 warnings
apache_beam/io/gcp/bigquery_write_it_test.py: 3 warnings
apache_beam/io/gcp/bigquery_test.py: 3 warnings
apache_beam/io/gcp/big_query_query_to_table_it_test.py: 4 warnings
  <https://ci-beam.apache.org/job/beam_PostCommit_Python38/ws/src/sdks/python/apache_beam/io/gcp/bigquery_file_loads.py>:1175: BeamDeprecationWarning: options is deprecated since First stable release. References to <pipeline>.options will not be supported
    p.options.view_as(GoogleCloudOptions).job_name or 'AUTOMATIC_JOB_NAME')

apache_beam/examples/cookbook/bigquery_tornadoes_it_test.py::BigqueryTornadoesIT::test_bigquery_tornadoes_it
  <https://ci-beam.apache.org/job/beam_PostCommit_Python38/ws/src/sdks/python/apache_beam/io/gcp/tests/utils.py>:100: PendingDeprecationWarning: Client.dataset is deprecated and will be removed in a future version. Use a string like 'my_project.my_dataset' or a cloud.google.bigquery.DatasetReference object, instead.
    table_ref = client.dataset(dataset_id).table(table_id)

apache_beam/examples/dataframe/flight_delays_it_test.py::FlightDelaysTest::test_flight_delays
  <https://ci-beam.apache.org/job/beam_PostCommit_Python38/ws/src/sdks/python/apache_beam/examples/dataframe/flight_delays.py>:47: FutureWarning: The default value of numeric_only in DataFrame.mean is deprecated. In a future version, it will default to False. In addition, specifying 'numeric_only=None' is deprecated. Select only valid columns or specify the value of numeric_only to silence this warning.
    return airline_df[at_top_airports].mean()

apache_beam/examples/dataframe/flight_delays_it_test.py::FlightDelaysTest::test_flight_delays
apache_beam/examples/dataframe/taxiride_it_test.py::TaxirideIT::test_aggregation
apache_beam/examples/dataframe/taxiride_it_test.py::TaxirideIT::test_enrich
  <https://ci-beam.apache.org/job/beam_PostCommit_Python38/ws/src/sdks/python/apache_beam/dataframe/io.py>:659: FutureWarning: WriteToFiles is experimental.
    return pcoll | fileio.WriteToFiles(

apache_beam/examples/dataframe/flight_delays_it_test.py::FlightDelaysTest::test_flight_delays
apache_beam/examples/dataframe/taxiride_it_test.py::TaxirideIT::test_aggregation
apache_beam/examples/dataframe/taxiride_it_test.py::TaxirideIT::test_enrich
  <https://ci-beam.apache.org/job/beam_PostCommit_Python38/ws/src/sdks/python/apache_beam/io/fileio.py>:591: BeamDeprecationWarning: options is deprecated since First stable release. References to <pipeline>.options will not be supported
    p.options.view_as(GoogleCloudOptions).temp_location or

apache_beam/io/gcp/bigquery_test.py::BigQueryStreamingInsertTransformIntegrationTests::test_multiple_destinations_transform
  <https://ci-beam.apache.org/job/beam_PostCommit_Python38/ws/src/sdks/python/apache_beam/io/gcp/bigquery_test.py>:1690: BeamDeprecationWarning: options is deprecated since First stable release. References to <pipeline>.options will not be supported
    streaming = self.test_pipeline.options.view_as(StandardOptions).streaming

apache_beam/io/gcp/bigquery_read_it_test.py::ReadTests::test_native_source
  <https://ci-beam.apache.org/job/beam_PostCommit_Python38/ws/src/sdks/python/apache_beam/io/gcp/bigquery_read_it_test.py>:170: BeamDeprecationWarning: BigQuerySource is deprecated since 2.25.0. Use ReadFromBigQuery instead.
    beam.io.BigQuerySource(query=self.query, use_standard_sql=True)))

apache_beam/ml/gcp/cloud_dlp_it_test.py::CloudDLPIT::test_deidentification
  <https://ci-beam.apache.org/job/beam_PostCommit_Python38/ws/src/sdks/python/apache_beam/ml/gcp/cloud_dlp_it_test.py>:74: FutureWarning: MaskDetectedDetails is experimental.
    | MaskDetectedDetails(

apache_beam/ml/gcp/cloud_dlp_it_test.py::CloudDLPIT::test_inspection
  <https://ci-beam.apache.org/job/beam_PostCommit_Python38/ws/src/sdks/python/apache_beam/ml/gcp/cloud_dlp_it_test.py>:85: FutureWarning: InspectForDetails is experimental.
    | InspectForDetails(

apache_beam/ml/inference/sklearn_inference_it_test.py::SklearnInference::test_sklearn_regression
  <https://ci-beam.apache.org/job/beam_PostCommit_Python38/ws/src/sdks/python/apache_beam/examples/inference/sklearn_japanese_housing_regression.py>:128: FutureWarning: SklearnModelHandlerPandas is experimental. No backwards-compatibility guarantees.
    model_loader = SklearnModelHandlerPandas(

apache_beam/ml/inference/sklearn_inference_it_test.py::SklearnInference::test_sklearn_regression
  <https://ci-beam.apache.org/job/beam_PostCommit_Python38/ws/src/build/gradleenv/-1734967051/lib/python3.8/site-packages/dill/_dill.py>:472: FutureWarning: SklearnModelHandlerPandas is experimental. No backwards-compatibility guarantees.
    obj = StockUnpickler.load(self)

apache_beam/io/gcp/bigquery_read_it_test.py::ReadNewTypesTests::test_native_source
  <https://ci-beam.apache.org/job/beam_PostCommit_Python38/ws/src/sdks/python/apache_beam/io/gcp/bigquery_read_it_test.py>:693: BeamDeprecationWarning: BigQuerySource is deprecated since 2.25.0. Use ReadFromBigQuery instead.
    beam.io.BigQuerySource(query=self.query, use_standard_sql=True)))

apache_beam/io/gcp/bigquery_read_it_test.py::ReadAllBQTests::test_read_queries
  <https://ci-beam.apache.org/job/beam_PostCommit_Python38/ws/src/sdks/python/apache_beam/io/gcp/bigquery_read_it_test.py>:808: FutureWarning: ReadAllFromBigQuery is experimental.
    | beam.io.ReadAllFromBigQuery())

apache_beam/io/gcp/bigquery_read_it_test.py::ReadAllBQTests::test_read_queries
  <https://ci-beam.apache.org/job/beam_PostCommit_Python38/ws/src/sdks/python/apache_beam/io/gcp/bigquery.py>:2658: BeamDeprecationWarning: options is deprecated since First stable release. References to <pipeline>.options will not be supported
    job_name = pcoll.pipeline.options.view_as(GoogleCloudOptions).job_name

apache_beam/io/gcp/bigquery_read_it_test.py::ReadAllBQTests::test_read_queries
  <https://ci-beam.apache.org/job/beam_PostCommit_Python38/ws/src/sdks/python/apache_beam/io/gcp/bigquery.py>:2659: BeamDeprecationWarning: options is deprecated since First stable release. References to <pipeline>.options will not be supported
    project = pcoll.pipeline.options.view_as(GoogleCloudOptions).project

apache_beam/io/gcp/bigquery_read_it_test.py::ReadAllBQTests::test_read_queries
  <https://ci-beam.apache.org/job/beam_PostCommit_Python38/ws/src/sdks/python/apache_beam/io/gcp/bigquery.py>:2672: BeamDeprecationWarning: options is deprecated since First stable release. References to <pipeline>.options will not be supported
    options=pcoll.pipeline.options,

-- Docs: https://docs.pytest.org/en/stable/how-to/capture-warnings.html
- generated xml file: <https://ci-beam.apache.org/job/beam_PostCommit_Python38/ws/src/sdks/python/pytest_postCommitIT-df-py38.xml> -
========== 85 passed, 24 skipped, 257 warnings in 11508.43s (3:11:48) ==========

FAILURE: Build failed with an exception.

* Where:
Script '<https://ci-beam.apache.org/job/beam_PostCommit_Python38/ws/src/sdks/python/test-suites/direct/common.gradle'> line: 185

* What went wrong:
Execution failed for task ':sdks:python:test-suites:direct:py38:hdfsIntegrationTest'.
> Process 'command 'sh'' finished with non-zero exit value 1

* Try:
> Run with --stacktrace option to get the stack trace.
> Run with --info or --debug option to get more log output.

* Get more help at https://help.gradle.org

Deprecated Gradle features were used in this build, making it incompatible with Gradle 8.0.

You can use '--warning-mode all' to show the individual deprecation warnings and determine if they come from your own scripts or plugins.

See https://docs.gradle.org/7.5.1/userguide/command_line_interface.html#sec:command_line_warnings

Execution optimizations have been disabled for 1 invalid unit(s) of work during this build to ensure correctness.
Please consult deprecation warnings for more details.

BUILD FAILED in 3h 27m 23s
205 actionable tasks: 141 executed, 58 from cache, 6 up-to-date

Publishing build scan...
https://gradle.com/s/nb3gwbictfdg4

Build step 'Invoke Gradle script' changed build result to FAILURE
Build step 'Invoke Gradle script' marked build as failure

---------------------------------------------------------------------
To unsubscribe, e-mail: builds-unsubscribe@beam.apache.org
For additional commands, e-mail: builds-help@beam.apache.org