You are viewing a plain text version of this content. The canonical link for it is here.
Posted to solr-user@lucene.apache.org by Jurgen <bl...@gmail.com> on 2011/02/19 15:26:34 UTC
Problems with ant test : No tests found
Hi List!
I was wondering, after downloading the subversion source with
svn co https://svn.apache.org/repos/asf/lucene/dev/trunk solr_svn
According to the book I am reading I should be able to run the tests
succesfully, so I did a
/var/solr_svn# ant test
And it seems that junit-parallel gives _only_ errors, not because tests it
self fail but tests aren't found.
What did I do wrong?
junit-parallel:
[junit] Testsuite: org.apache.lucene.TestDemo
[junit] Testcase: warning(junit.framework.TestSuite$1): FAILED
[junit] No tests found in org.apache.lucene.TestDemo
[junit] junit.framework.AssertionFailedError: No tests found in
org.apache.lucene.TestDemo
[junit] Tests run: 1, Failures: 1, Errors: 0, Time elapsed: 0,475 sec
[junit] TEST org.apache.lucene.TestDemo FAILED
[junit] Testsuite: org.apache.lucene.TestSearchForDuplicates
[junit] Testcase: warning(junit.framework.TestSuite$1): FAILED
[junit] No tests found in org.apache.lucene.TestSearchForDuplicates
[junit] junit.framework.AssertionFailedError: No tests found in
org.apache.lucene.TestSearchForDuplicates
[junit] Tests run: 1, Failures: 1, Errors: 0, Time elapsed: 0,012 sec
[junit] TEST org.apache.lucene.TestSearchForDuplicates FAILED
[junit] Testsuite: org.apache.lucene.document.TestDocument
[junit] Testcase: warning(junit.framework.TestSuite$1): FAILED
[junit] No tests found in org.apache.lucene.document.TestDocument
[junit] junit.framework.AssertionFailedError: No tests found in
org.apache.lucene.document.TestDocument
[junit] Tests run: 1, Failures: 1, Errors: 0, Time elapsed: 0,008 sec
[junit] TEST org.apache.lucene.document.TestDocument FAILED
[junit] Testsuite: org.apache.lucene.index.TestByteSlices
[junit] Testcase: warning(junit.framework.TestSuite$1): FAILED
[junit] No tests found in org.apache.lucene.index.TestByteSlices
[junit] junit.framework.AssertionFailedError: No tests found in
org.apache.lucene.index.TestByteSlices
[junit] Tests run: 1, Failures: 1, Errors: 0, Time elapsed: 0,008 sec
[junit] TEST org.apache.lucene.index.TestByteSlices FAILED
[junit] Testsuite: org.apache.lucene.index.TestDeletionPolicy
[junit] Testcase: warning(junit.framework.TestSuite$1): FAILED
[junit] No tests found in org.apache.lucene.index.TestDeletionPolicy
[junit] junit.framework.AssertionFailedError: No tests found in
org.apache.lucene.index.TestDeletionPolicy
[junit] Tests run: 1, Failures: 1, Errors: 0, Time elapsed: 0,01 sec
[junit] TEST org.apache.lucene.index.TestDeletionPolicy FAILED
[junit] Testsuite: org.apache.lucene.index.TestDoc
[junit] Testcase: warning(junit.framework.TestSuite$1): FAILED
[junit] No tests found in org.apache.lucene.index.TestDoc
[junit] junit.framework.AssertionFailedError: No tests found in
org.apache.lucene.index.TestDoc
[junit] Tests run: 1, Failures: 1, Errors: 0, Time elapsed: 0,007 sec
[junit] TEST org.apache.lucene.index.TestDoc FAILED
[junit] Testsuite: org.apache.lucene.index.TestIndexWriterDelete
[junit] Testcase: warning(junit.framework.TestSuite$1): FAILED
[junit] No tests found in org.apache.lucene.index.TestIndexWriterDelete
[junit] junit.framework.AssertionFailedError: No tests found in
org.apache.lucene.index.TestIndexWriterDelete
[junit] Tests run: 1, Failures: 1, Errors: 0, Time elapsed: 0,007 sec
[junit] TEST org.apache.lucene.index.TestIndexWriterDelete FAILED
[junit] Testsuite: org.apache.lucene.index.TestMultiFields
[junit] Testcase: warning(junit.framework.TestSuite$1): FAILED
[junit] No tests found in org.apache.lucene.index.TestMultiFields
[junit] junit.framework.AssertionFailedError: No tests found in
org.apache.lucene.index.TestMultiFields
[junit] Tests run: 1, Failures: 1, Errors: 0, Time elapsed: 0,008 sec
[junit] TEST org.apache.lucene.index.TestMultiFields FAILED
[junit] Testsuite: org.apache.lucene.index.TestNoMergeScheduler
[junit] Testcase: warning(junit.framework.TestSuite$1): FAILED
[junit] No tests found in org.apache.lucene.index.TestNoMergeScheduler
[junit] junit.framework.AssertionFailedError: No tests found in
org.apache.lucene.index.TestNoMergeScheduler
[junit] Tests run: 1, Failures: 1, Errors: 0, Time elapsed: 0,007 sec
[junit] TEST org.apache.lucene.index.TestNoMergeScheduler FAILED
[junit] Testsuite: org.apache.lucene.index.TestSegmentTermDocs
[junit] Testcase: warning(junit.framework.TestSuite$1): FAILED
[junit] No tests found in org.apache.lucene.index.TestSegmentTermDocs
[junit] junit.framework.AssertionFailedError: No tests found in
org.apache.lucene.index.TestSegmentTermDocs
[junit] Tests run: 1, Failures: 1, Errors: 0, Time elapsed: 0,012 sec
[junit] TEST org.apache.lucene.index.TestSegmentTermDocs FAILED
[junit] Testsuite: org.apache.lucene.TestAssertions
[junit] Testcase: warning(junit.framework.TestSuite$1): FAILED
[junit] No tests found in org.apache.lucene.TestAssertions
[junit] junit.framework.AssertionFailedError: No tests found in
org.apache.lucene.TestAssertions
[junit] Tests run: 1, Failures: 1, Errors: 0, Time elapsed: 0,657 sec
[junit] TEST org.apache.lucene.TestAssertions FAILED
[junit] Testsuite: org.apache.lucene.analysis.TestToken
[junit] Testcase: warning(junit.framework.TestSuite$1): FAILED
[junit] No tests found in org.apache.lucene.analysis.TestToken
[junit] junit.framework.AssertionFailedError: No tests found in
org.apache.lucene.analysis.TestToken
[junit] Tests run: 1, Failures: 1, Errors: 0, Time elapsed: 0,012 sec
[junit] TEST org.apache.lucene.analysis.TestToken FAILED
[junit] Testsuite: org.apache.lucene.index.TestAtomicUpdate
[junit] Testcase: warning(junit.framework.TestSuite$1): FAILED
[junit] No tests found in org.apache.lucene.index.TestAtomicUpdate
[junit] junit.framework.AssertionFailedError: No tests found in
org.apache.lucene.index.TestAtomicUpdate
[junit] Tests run: 1, Failures: 1, Errors: 0, Time elapsed: 0,013 sec
[junit] TEST org.apache.lucene.index.TestAtomicUpdate FAILED
[junit] Testsuite: org.apache.lucene.index.TestCheckIndex
[junit] Testcase: warning(junit.framework.TestSuite$1): FAILED
[junit] No tests found in org.apache.lucene.index.TestCheckIndex
[junit] junit.framework.AssertionFailedError: No tests found in
org.apache.lucene.index.TestCheckIndex
[junit] Tests run: 1, Failures: 1, Errors: 0, Time elapsed: 0,033 sec
Re: Problems with ant test : No tests found
Posted by Otis Gospodnetic <ot...@yahoo.com>.
Jurgen,
> svn co https://svn.apache.org/repos/asf/lucene/dev/trunk solr_svn
>
> According to the book I am reading I should be able to run the tests
> succesfully, so I did a
>
> /var/solr_svn# ant test
Between the above 2 commands you need to:
/var/solr_svn# cd solr
Otis
----
Sematext :: http://sematext.com/ :: Solr - Lucene - Nutch
Lucene ecosystem search :: http://search-lucene.com/
----- Original Message ----
> From: Jurgen <bl...@gmail.com>
> To: solr-user@lucene.apache.org
> Sent: Sat, February 19, 2011 9:26:34 AM
> Subject: Problems with ant test : No tests found
>
> Hi List!
>
> I was wondering, after downloading the subversion source with
>
> svn co https://svn.apache.org/repos/asf/lucene/dev/trunk solr_svn
>
> According to the book I am reading I should be able to run the tests
> succesfully, so I did a
>
> /var/solr_svn# ant test
>
> And it seems that junit-parallel gives _only_ errors, not because tests it
> self fail but tests aren't found.
> What did I do wrong?
>
> junit-parallel:
> [junit] Testsuite: org.apache.lucene.TestDemo
> [junit] Testcase: warning(junit.framework.TestSuite$1): FAILED
> [junit] No tests found in org.apache.lucene.TestDemo
> [junit] junit.framework.AssertionFailedError: No tests found in
> org.apache.lucene.TestDemo
>
>
> [junit] Tests run: 1, Failures: 1, Errors: 0, Time elapsed: 0,475 sec
>
> [junit] TEST org.apache.lucene.TestDemo FAILED
> [junit] Testsuite: org.apache.lucene.TestSearchForDuplicates
> [junit] Testcase: warning(junit.framework.TestSuite$1): FAILED
> [junit] No tests found in org.apache.lucene.TestSearchForDuplicates
> [junit] junit.framework.AssertionFailedError: No tests found in
> org.apache.lucene.TestSearchForDuplicates
>
>
> [junit] Tests run: 1, Failures: 1, Errors: 0, Time elapsed: 0,012 sec
>
> [junit] TEST org.apache.lucene.TestSearchForDuplicates FAILED
> [junit] Testsuite: org.apache.lucene.document.TestDocument
> [junit] Testcase: warning(junit.framework.TestSuite$1): FAILED
> [junit] No tests found in org.apache.lucene.document.TestDocument
> [junit] junit.framework.AssertionFailedError: No tests found in
> org.apache.lucene.document.TestDocument
>
>
> [junit] Tests run: 1, Failures: 1, Errors: 0, Time elapsed: 0,008 sec
>
> [junit] TEST org.apache.lucene.document.TestDocument FAILED
> [junit] Testsuite: org.apache.lucene.index.TestByteSlices
> [junit] Testcase: warning(junit.framework.TestSuite$1): FAILED
> [junit] No tests found in org.apache.lucene.index.TestByteSlices
> [junit] junit.framework.AssertionFailedError: No tests found in
> org.apache.lucene.index.TestByteSlices
>
>
> [junit] Tests run: 1, Failures: 1, Errors: 0, Time elapsed: 0,008 sec
>
> [junit] TEST org.apache.lucene.index.TestByteSlices FAILED
> [junit] Testsuite: org.apache.lucene.index.TestDeletionPolicy
> [junit] Testcase: warning(junit.framework.TestSuite$1): FAILED
> [junit] No tests found in org.apache.lucene.index.TestDeletionPolicy
> [junit] junit.framework.AssertionFailedError: No tests found in
> org.apache.lucene.index.TestDeletionPolicy
>
>
> [junit] Tests run: 1, Failures: 1, Errors: 0, Time elapsed: 0,01 sec
>
> [junit] TEST org.apache.lucene.index.TestDeletionPolicy FAILED
> [junit] Testsuite: org.apache.lucene.index.TestDoc
> [junit] Testcase: warning(junit.framework.TestSuite$1): FAILED
> [junit] No tests found in org.apache.lucene.index.TestDoc
> [junit] junit.framework.AssertionFailedError: No tests found in
> org.apache.lucene.index.TestDoc
>
>
> [junit] Tests run: 1, Failures: 1, Errors: 0, Time elapsed: 0,007 sec
>
> [junit] TEST org.apache.lucene.index.TestDoc FAILED
> [junit] Testsuite: org.apache.lucene.index.TestIndexWriterDelete
> [junit] Testcase: warning(junit.framework.TestSuite$1): FAILED
> [junit] No tests found in org.apache.lucene.index.TestIndexWriterDelete
> [junit] junit.framework.AssertionFailedError: No tests found in
> org.apache.lucene.index.TestIndexWriterDelete
>
>
> [junit] Tests run: 1, Failures: 1, Errors: 0, Time elapsed: 0,007 sec
>
> [junit] TEST org.apache.lucene.index.TestIndexWriterDelete FAILED
> [junit] Testsuite: org.apache.lucene.index.TestMultiFields
> [junit] Testcase: warning(junit.framework.TestSuite$1): FAILED
> [junit] No tests found in org.apache.lucene.index.TestMultiFields
> [junit] junit.framework.AssertionFailedError: No tests found in
> org.apache.lucene.index.TestMultiFields
>
>
> [junit] Tests run: 1, Failures: 1, Errors: 0, Time elapsed: 0,008 sec
>
> [junit] TEST org.apache.lucene.index.TestMultiFields FAILED
> [junit] Testsuite: org.apache.lucene.index.TestNoMergeScheduler
> [junit] Testcase: warning(junit.framework.TestSuite$1): FAILED
> [junit] No tests found in org.apache.lucene.index.TestNoMergeScheduler
> [junit] junit.framework.AssertionFailedError: No tests found in
> org.apache.lucene.index.TestNoMergeScheduler
>
>
> [junit] Tests run: 1, Failures: 1, Errors: 0, Time elapsed: 0,007 sec
>
> [junit] TEST org.apache.lucene.index.TestNoMergeScheduler FAILED
> [junit] Testsuite: org.apache.lucene.index.TestSegmentTermDocs
> [junit] Testcase: warning(junit.framework.TestSuite$1): FAILED
> [junit] No tests found in org.apache.lucene.index.TestSegmentTermDocs
> [junit] junit.framework.AssertionFailedError: No tests found in
> org.apache.lucene.index.TestSegmentTermDocs
>
>
> [junit] Tests run: 1, Failures: 1, Errors: 0, Time elapsed: 0,012 sec
>
> [junit] TEST org.apache.lucene.index.TestSegmentTermDocs FAILED
> [junit] Testsuite: org.apache.lucene.TestAssertions
> [junit] Testcase: warning(junit.framework.TestSuite$1): FAILED
> [junit] No tests found in org.apache.lucene.TestAssertions
> [junit] junit.framework.AssertionFailedError: No tests found in
> org.apache.lucene.TestAssertions
>
>
> [junit] Tests run: 1, Failures: 1, Errors: 0, Time elapsed: 0,657 sec
>
> [junit] TEST org.apache.lucene.TestAssertions FAILED
> [junit] Testsuite: org.apache.lucene.analysis.TestToken
> [junit] Testcase: warning(junit.framework.TestSuite$1): FAILED
> [junit] No tests found in org.apache.lucene.analysis.TestToken
> [junit] junit.framework.AssertionFailedError: No tests found in
> org.apache.lucene.analysis.TestToken
>
>
> [junit] Tests run: 1, Failures: 1, Errors: 0, Time elapsed: 0,012 sec
>
> [junit] TEST org.apache.lucene.analysis.TestToken FAILED
> [junit] Testsuite: org.apache.lucene.index.TestAtomicUpdate
> [junit] Testcase: warning(junit.framework.TestSuite$1): FAILED
> [junit] No tests found in org.apache.lucene.index.TestAtomicUpdate
> [junit] junit.framework.AssertionFailedError: No tests found in
> org.apache.lucene.index.TestAtomicUpdate
>
>
> [junit] Tests run: 1, Failures: 1, Errors: 0, Time elapsed: 0,013 sec
>
> [junit] TEST org.apache.lucene.index.TestAtomicUpdate FAILED
> [junit] Testsuite: org.apache.lucene.index.TestCheckIndex
> [junit] Testcase: warning(junit.framework.TestSuite$1): FAILED
> [junit] No tests found in org.apache.lucene.index.TestCheckIndex
> [junit] junit.framework.AssertionFailedError: No tests found in
> org.apache.lucene.index.TestCheckIndex
>
>
> [junit] Tests run: 1, Failures: 1, Errors: 0, Time elapsed: 0,033 sec
>