You are viewing a plain text version of this content. The canonical link for it is here.
Posted to builds@solr.apache.org by Apache Jenkins Server <je...@builds.apache.org> on 2026/08/30 23:47:40 UTC
[JENKINS] Solr » Solr-Test-10.0 - Build # 2336 - Unstable!
Build: https://ci-builds.apache.org/job/Solr/job/Solr-Test-10.0/2336/
1 tests failed.
FAILED: org.apache.solr.cloud.LeaderTragicEventTest.classMethod
Error Message:
java.lang.Exception: Error shutting down MiniSolrCloudCluster
Stack Trace:
java.lang.Exception: Error shutting down MiniSolrCloudCluster
at __randomizedtesting.SeedInfo.seed([AD78A15A1F79C597]:0)
at org.apache.solr.cloud.MiniSolrCloudCluster.checkForExceptions(MiniSolrCloudCluster.java:767)
at org.apache.solr.cloud.MiniSolrCloudCluster.shutdown(MiniSolrCloudCluster.java:677)
at org.apache.solr.cloud.SolrCloudTestCase.shutdownCluster(SolrCloudTestCase.java:144)
at java.base/jdk.internal.reflect.DirectMethodHandleAccessor.invoke(DirectMethodHandleAccessor.java:103)
at java.base/java.lang.reflect.Method.invoke(Method.java:580)
at com.carrotsearch.randomizedtesting.RandomizedRunner.invoke(RandomizedRunner.java:1763)
at com.carrotsearch.randomizedtesting.RandomizedRunner$7.evaluate(RandomizedRunner.java:909)
at com.carrotsearch.randomizedtesting.rules.StatementAdapter.evaluate(StatementAdapter.java:36)
at com.carrotsearch.randomizedtesting.rules.StatementAdapter.evaluate(StatementAdapter.java:36)
at org.apache.lucene.tests.util.AbstractBeforeAfterRule$1.evaluate(AbstractBeforeAfterRule.java:43)
at com.carrotsearch.randomizedtesting.rules.SystemPropertiesRestoreRule$1.evaluate(SystemPropertiesRestoreRule.java:80)
at org.junit.rules.RunRules.evaluate(RunRules.java:20)
at org.apache.lucene.tests.util.AbstractBeforeAfterRule$1.evaluate(AbstractBeforeAfterRule.java:43)
at com.carrotsearch.randomizedtesting.rules.StatementAdapter.evaluate(StatementAdapter.java:36)
at org.apache.lucene.tests.util.TestRuleStoreClassName$1.evaluate(TestRuleStoreClassName.java:38)
at com.carrotsearch.randomizedtesting.rules.NoShadowingOrOverridesOnMethodsRule$1.evaluate(NoShadowingOrOverridesOnMethodsRule.java:40)
at com.carrotsearch.randomizedtesting.rules.NoShadowingOrOverridesOnMethodsRule$1.evaluate(NoShadowingOrOverridesOnMethodsRule.java:40)
at com.carrotsearch.randomizedtesting.rules.StatementAdapter.evaluate(StatementAdapter.java:36)
at com.carrotsearch.randomizedtesting.rules.StatementAdapter.evaluate(StatementAdapter.java:36)
at org.apache.lucene.tests.util.TestRuleAssertionsRequired$1.evaluate(TestRuleAssertionsRequired.java:53)
at org.apache.lucene.tests.util.AbstractBeforeAfterRule$1.evaluate(AbstractBeforeAfterRule.java:43)
at org.apache.lucene.tests.util.TestRuleMarkFailure$1.evaluate(TestRuleMarkFailure.java:44)
at org.apache.lucene.tests.util.TestRuleIgnoreAfterMaxFailures$1.evaluate(TestRuleIgnoreAfterMaxFailures.java:60)
at org.apache.lucene.tests.util.TestRuleIgnoreTestSuites$1.evaluate(TestRuleIgnoreTestSuites.java:47)
at org.junit.rules.RunRules.evaluate(RunRules.java:20)
at com.carrotsearch.randomizedtesting.rules.StatementAdapter.evaluate(StatementAdapter.java:36)
at com.carrotsearch.randomizedtesting.ThreadLeakControl$StatementRunner.run(ThreadLeakControl.java:390)
at com.carrotsearch.randomizedtesting.ThreadLeakControl.lambda$forkTimeoutingTask$0(ThreadLeakControl.java:850)
at java.base/java.lang.Thread.run(Thread.java:1583)
Suppressed: java.util.concurrent.TimeoutException
at java.base/java.util.concurrent.CompletableFuture.timedGet(CompletableFuture.java:1960)
at java.base/java.util.concurrent.CompletableFuture.get(CompletableFuture.java:2095)
at org.eclipse.jetty.server.Server.doStop(Server.java:663)
at org.eclipse.jetty.util.component.AbstractLifeCycle.stop(AbstractLifeCycle.java:132)
at org.apache.solr.embedded.JettySolrRunner.stop(JettySolrRunner.java:630)
at org.apache.solr.cloud.MiniSolrCloudCluster.stopJettySolrRunner(MiniSolrCloudCluster.java:562)
at org.apache.solr.cloud.MiniSolrCloudCluster.lambda$shutdown$5(MiniSolrCloudCluster.java:669)
at java.base/java.util.concurrent.FutureTask.run(FutureTask.java:317)
at org.apache.solr.common.util.ExecutorUtil$MDCAwareThreadPoolExecutor.lambda$execute$0(ExecutorUtil.java:381)
at java.base/java.util.concurrent.ThreadPoolExecutor.runWorker(ThreadPoolExecutor.java:1144)
at java.base/java.util.concurrent.ThreadPoolExecutor$Worker.run(ThreadPoolExecutor.java:642)
... 1 more
Build Log:
[...truncated 11 lines...]
ERROR: Workspace has a .git repository, but it appears to be corrupt.
hudson.plugins.git.GitException: Command "git rev-parse --resolve-git-dir /home/jenkins/jenkins-agent/workspace/Solr/Solr-Test-10.0/.git" returned status code 128:
stdout:
stderr: fatal: not a gitdir '/home/jenkins/jenkins-agent/workspace/Solr/Solr-Test-10.0/.git'
at PluginClassLoader for git-client//org.jenkinsci.plugins.gitclient.CliGitAPIImpl.launchCommandIn(CliGitAPIImpl.java:2848)
at PluginClassLoader for git-client//org.jenkinsci.plugins.gitclient.CliGitAPIImpl.launchCommandIn(CliGitAPIImpl.java:2768)
at PluginClassLoader for git-client//org.jenkinsci.plugins.gitclient.CliGitAPIImpl.launchCommandIn(CliGitAPIImpl.java:2763)
at PluginClassLoader for git-client//org.jenkinsci.plugins.gitclient.CliGitAPIImpl.launchCommand(CliGitAPIImpl.java:2052)
at PluginClassLoader for git-client//org.jenkinsci.plugins.gitclient.CliGitAPIImpl.launchCommand(CliGitAPIImpl.java:2064)
at PluginClassLoader for git-client//org.jenkinsci.plugins.gitclient.CliGitAPIImpl.hasGitRepo(CliGitAPIImpl.java:404)
at PluginClassLoader for git-client//hudson.plugins.git.GitAPI.hasGitRepo(GitAPI.java:281)
at jdk.internal.reflect.GeneratedMethodAccessor35.invoke(Unknown Source)
at java.base/jdk.internal.reflect.DelegatingMethodAccessorImpl.invoke(DelegatingMethodAccessorImpl.java:43)
at java.base/java.lang.reflect.Method.invoke(Method.java:569)
at hudson.remoting.RemoteInvocationHandler$RPCRequest.perform(RemoteInvocationHandler.java:986)
at hudson.remoting.RemoteInvocationHandler$RPCRequest.call(RemoteInvocationHandler.java:961)
at hudson.remoting.RemoteInvocationHandler$RPCRequest.call(RemoteInvocationHandler.java:907)
at hudson.remoting.UserRequest.perform(UserRequest.java:225)
at hudson.remoting.UserRequest.perform(UserRequest.java:50)
at hudson.remoting.Request$2.run(Request.java:391)
at hudson.remoting.InterceptingExecutorService.lambda$wrap$0(InterceptingExecutorService.java:81)
at java.base/java.util.concurrent.FutureTask.run(FutureTask.java:264)
at java.base/java.util.concurrent.ThreadPoolExecutor.runWorker(ThreadPoolExecutor.java:1136)
at java.base/java.util.concurrent.ThreadPoolExecutor$Worker.run(ThreadPoolExecutor.java:635)
at java.base/java.lang.Thread.run(Thread.java:840)
Cloning the remote Git repository
Cloning repository https://gitbox.apache.org/repos/asf/solr.git
> git init /home/jenkins/jenkins-agent/workspace/Solr/Solr-Test-10.0 # timeout=10
Fetching upstream changes from https://gitbox.apache.org/repos/asf/solr.git
> git --version # timeout=10
> git --version # 'git version 2.43.0'
> git fetch --tags --force --progress -- https://gitbox.apache.org/repos/asf/solr.git +refs/heads/*:refs/remotes/origin/* # timeout=10
> git config remote.origin.url https://gitbox.apache.org/repos/asf/solr.git # timeout=10
> git config --add remote.origin.fetch +refs/heads/*:refs/remotes/origin/* # timeout=10
Avoid second fetch
> git rev-parse refs/remotes/origin/branch_10_0^{commit} # timeout=10
Checking out Revision 93068d1dfbc48816caac29c5b3aba3bf884aea85 (refs/remotes/origin/branch_10_0)
> git config core.sparsecheckout # timeout=10
> git checkout -f 93068d1dfbc48816caac29c5b3aba3bf884aea85 # timeout=10
> git branch -a -v --no-abbrev # timeout=10
> git checkout -b branch_10_0 93068d1dfbc48816caac29c5b3aba3bf884aea85 # timeout=10
Commit message: "Ref Guide - Change component name to Apache Solr (#4521)"
> git rev-list --no-walk 93068d1dfbc48816caac29c5b3aba3bf884aea85 # timeout=10
No emails were triggered.
provisioning config files...
copy managed file [gradle.properties] to file:/home/jenkins/jenkins-agent/workspace/Solr/Solr-Test-10.0/gradle.properties
[Gradle] - Launching build.
[Solr-Test-10.0] $ /home/jenkins/jenkins-agent/workspace/Solr/Solr-Test-10.0/gradlew -Dtests.haltonfailure=false -Dtests.badapples=false --continue test
Downloading gradle-wrapper.jar from https://raw.githubusercontent.com/gradle/gradle/v8.10.2/gradle/wrapper/gradle-wrapper.jar
To honour the JVM settings for this build a single-use Daemon process will be forked. For more on this, please refer to https://docs.gradle.org/8.10/userguide/gradle_daemon.html#sec:disabling_the_daemon in the Gradle documentation.
Daemon will be stopped at the end of the build
> Task :build-infra:compileJava
Note: /home/jenkins/jenkins-agent/workspace/Solr/Solr-Test-10.0/build-tools/build-infra/src/main/java/org/apache/lucene/gradle/Checksum.java uses or overrides a deprecated API.
Note: Recompile with -Xlint:deprecation for details.
> Task :build-infra:pluginDescriptors
> Task :build-infra:processResources
> Task :build-infra:classes
> Task :build-infra:jar
> Task :gitStatus
> Task :checkJdkInternalsExportedToGradle
> Task :solr:api:compileJava
Note: Some input files use or override a deprecated API.
Note: Recompile with -Xlint:deprecation for details.
> Task :solr:api:processResources NO-SOURCE
> Task :solr:api:classes
> Task :solr:api:jar
> Task :randomizationInfo
Running tests with randomization seed: tests.seed=AD78A15A1F79C597
> Task :solr:api:resolve
SLF4J(W): No SLF4J providers were found.
SLF4J(W): Defaulting to no-operation (NOP) logger implementation
SLF4J(W): See https://www.slf4j.org/codes.html#noProviders for further details.
> Task :solr:solrj:openApiGenerate
Cleaned up output directory /home/jenkins/jenkins-agent/workspace/Solr/Solr-Test-10.0/solr/solrj/build/generated/ before code generation (cleanupOutput set to true).
No application/json content media type found in response. Response examples can currently only be generated for application/json media type.
############################################################################################
# Thanks for using OpenAPI Generator. #
# We appreciate your support! Please consider donation to help us maintain this project. #
# https://opencollective.com/openapi_generator/donate #
############################################################################################
Successfully generated code to /home/jenkins/jenkins-agent/workspace/Solr/Solr-Test-10.0/solr/solrj/build/generated/
> Task :spotlessInternalRegisterDependencies
> Task :solr:solrj:generatedSpotlessHelper
> Task :solr:solrj:generatedSpotless
> Task :solr:solrj:compileJava
Note: Some input files use or override a deprecated API.
Note: Recompile with -Xlint:deprecation for details.
> Task :solr:solrj-jetty:compileJava
Note: /home/jenkins/jenkins-agent/workspace/Solr/Solr-Test-10.0/solr/solrj-jetty/src/java/org/apache/solr/client/solrj/jetty/HttpJettySolrClient.java uses or overrides a deprecated API.
Note: Recompile with -Xlint:deprecation for details.
> Task :solr:solrj-streaming:compileJava
Note: Some input files use or override a deprecated API.
Note: Recompile with -Xlint:deprecation for details.
> Task :solr:solrj-zookeeper:compileJava
Note: Some input files use or override a deprecated API.
Note: Recompile with -Xlint:deprecation for details.
> Task :solr:core:compileJava
Note: Some input files use or override a deprecated API.
Note: Recompile with -Xlint:deprecation for details.
> Task :solr:test-framework:compileJava
Note: Some input files use or override a deprecated API.
Note: Recompile with -Xlint:deprecation for details.
> Task :solr:api:compileTestJava
> Task :solr:api:processTestResources
> Task :solr:api:testClasses
> Task :solr:core:processResources
> Task :solr:core:classes
> Task :solr:core:jar
> Task :solr:solrj:processResources
> Task :solr:solrj:classes
> Task :solr:solrj:jar
> Task :solr:solrj-jetty:processResources NO-SOURCE
> Task :solr:solrj-jetty:classes
> Task :solr:solrj-jetty:jar
> Task :solr:solrj-streaming:processResources
> Task :solr:solrj-streaming:classes
> Task :solr:solrj-streaming:jar
> Task :solr:solrj-zookeeper:processResources NO-SOURCE
> Task :solr:solrj-zookeeper:classes
> Task :solr:solrj-zookeeper:jar
> Task :solr:test-framework:processResources
> Task :solr:test-framework:classes
> Task :solr:test-framework:jar
> Task :solr:api:test
WARNING: Using incubator modules: jdk.incubator.vector
WARNING: Using incubator modules: jdk.incubator.vector
WARNING: A command line option has enabled the Security Manager
WARNING: The Security Manager is deprecated and will be removed in a future release
WARNING: A command line option has enabled the Security Manager
WARNING: The Security Manager is deprecated and will be removed in a future release
java.security.policy: error adding Permission, java.net.URLPermission:
java.util.ServiceConfigurationError: Locale provider adapter "CLDR"cannot be instantiated.
java.security.policy: error adding Permission, java.net.URLPermission:
java.util.ServiceConfigurationError: Locale provider adapter "CLDR"cannot be instantiated.
java.security.policy: error adding Permission, java.net.URLPermission:
java.util.ServiceConfigurationError: Locale provider adapter "CLDR"cannot be instantiated.
java.security.policy: error adding Permission, java.net.URLPermission:
java.util.ServiceConfigurationError: Locale provider adapter "CLDR"cannot be instantiated.
java.security.policy: error adding Permission, java.net.URLPermission:
java.util.ServiceConfigurationError: Locale provider adapter "CLDR"cannot be instantiated.
java.security.policy: error adding Permission, java.net.URLPermission:
java.util.ServiceConfigurationError: Locale provider adapter "CLDR"cannot be instantiated.
:solr:api:test (SUCCESS): 19 test(s)
> Task :solr:api:wipeTaskTemp
> Task :solr:benchmark:compileJava
> Task :solr:benchmark:processResources
> Task :solr:benchmark:classes
> Task :solr:benchmark:compileTestJava
> Task :solr:benchmark:processTestResources
> Task :solr:benchmark:testClasses
> Task :solr:benchmark:test
WARNING: Using incubator modules: jdk.incubator.vector
WARNING: Using incubator modules: jdk.incubator.vector
WARNING: Using incubator modules: jdk.incubator.vector
WARNING: A command line option has enabled the Security Manager
WARNING: The Security Manager is deprecated and will be removed in a future release
WARNING: A command line option has enabled the Security Manager
WARNING: The Security Manager is deprecated and will be removed in a future release
WARNING: A command line option has enabled the Security Manager
WARNING: The Security Manager is deprecated and will be removed in a future release
java.security.policy: error adding Permission, java.net.URLPermission:
java.util.ServiceConfigurationError: Locale provider adapter "CLDR"cannot be instantiated.
java.security.policy: error adding Permission, java.net.URLPermission:
java.util.ServiceConfigurationError: Locale provider adapter "CLDR"cannot be instantiated.
java.security.policy: error adding Permission, java.net.URLPermission:
java.util.ServiceConfigurationError: Locale provider adapter "CLDR"cannot be instantiated.
java.security.policy: error adding Permission, java.net.URLPermission:
java.util.ServiceConfigurationError: Locale provider adapter "CLDR"cannot be instantiated.
java.security.policy: error adding Permission, java.net.URLPermission:
java.util.ServiceConfigurationError: Locale provider adapter "CLDR"cannot be instantiated.
java.security.policy: error adding Permission, java.net.URLPermission:
java.util.ServiceConfigurationError: Locale provider adapter "CLDR"cannot be instantiated.
java.security.policy: error adding Permission, java.net.URLPermission:
java.util.ServiceConfigurationError: Locale provider adapter "CLDR"cannot be instantiated.
java.security.policy: error adding Permission, java.net.URLPermission:
java.util.ServiceConfigurationError: Locale provider adapter "CLDR"cannot be instantiated.
java.security.policy: error adding Permission, java.net.URLPermission:
java.util.ServiceConfigurationError: Locale provider adapter "CLDR"cannot be instantiated.
:solr:benchmark:test (SUCCESS): 10 test(s)
> Task :solr:benchmark:wipeTaskTemp
> Task :solr:core:compileTestJava
Note: Some input files use or override a deprecated API.
Note: Recompile with -Xlint:deprecation for details.
> Task :solr:core:processTestResources
> Task :solr:core:testClasses
> Task :solr:modules:analysis-extras:compileJava
Note: /home/jenkins/jenkins-agent/workspace/Solr/Solr-Test-10.0/solr/modules/analysis-extras/src/java/org/apache/solr/schema/ICUCollationField.java uses or overrides a deprecated API.
Note: Recompile with -Xlint:deprecation for details.
> Task :solr:modules:analysis-extras:processResources NO-SOURCE
> Task :solr:modules:analysis-extras:classes
> Task :solr:modules:analysis-extras:jar
> Task :solr:core:test
WARNING: Using incubator modules: jdk.incubator.vector
WARNING: Using incubator modules: jdk.incubator.vector
WARNING: Using incubator modules: jdk.incubator.vector
WARNING: Using incubator modules: jdk.incubator.vector
WARNING: A command line option has enabled the Security Manager
WARNING: The Security Manager is deprecated and will be removed in a future release
WARNING: A command line option has enabled the Security Manager
WARNING: The Security Manager is deprecated and will be removed in a future release
WARNING: A command line option has enabled the Security Manager
WARNING: The Security Manager is deprecated and will be removed in a future release
WARNING: A command line option has enabled the Security Manager
WARNING: The Security Manager is deprecated and will be removed in a future release
java.security.policy: error adding Permission, java.net.URLPermission:
java.util.ServiceConfigurationError: Locale provider adapter "CLDR"cannot be instantiated.
java.security.policy: error adding Permission, java.net.URLPermission:
java.util.ServiceConfigurationError: Locale provider adapter "CLDR"cannot be instantiated.
java.security.policy: error adding Permission, java.net.URLPermission:
java.util.ServiceConfigurationError: Locale provider adapter "CLDR"cannot be instantiated.
java.security.policy: error adding Permission, java.net.URLPermission:
java.util.ServiceConfigurationError: Locale provider adapter "CLDR"cannot be instantiated.
java.security.policy: error adding Permission, java.net.URLPermission:
java.util.ServiceConfigurationError: Locale provider adapter "CLDR"cannot be instantiated.
java.security.policy: error adding Permission, java.net.URLPermission:
java.util.ServiceConfigurationError: Locale provider adapter "CLDR"cannot be instantiated.
java.security.policy: error adding Permission, java.net.URLPermission:
java.util.ServiceConfigurationError: Locale provider adapter "CLDR"cannot be instantiated.
java.security.policy: error adding Permission, java.net.URLPermission:
java.util.ServiceConfigurationError: Locale provider adapter "CLDR"cannot be instantiated.
java.security.policy: error adding Permission, java.net.URLPermission:
java.util.ServiceConfigurationError: Locale provider adapter "CLDR"cannot be instantiated.
java.security.policy: error adding Permission, java.net.URLPermission:
java.util.ServiceConfigurationError: Locale provider adapter "CLDR"cannot be instantiated.
java.security.policy: error adding Permission, java.net.URLPermission:
java.util.ServiceConfigurationError: Locale provider adapter "CLDR"cannot be instantiated.
java.security.policy: error adding Permission, java.net.URLPermission:
java.util.ServiceConfigurationError: Locale provider adapter "CLDR"cannot be instantiated.
WARNING: Test org.apache.solr.TestRandomDVFaceting wrote 12,356,019 bytes of output.
WARNING: Test org.apache.solr.TestRandomFaceting wrote 31,345,430 bytes of output.
LeaderTragicEventTest > classMethod FAILED
java.lang.Exception: Error shutting down MiniSolrCloudCluster
at __randomizedtesting.SeedInfo.seed([AD78A15A1F79C597]:0)
at org.apache.solr.cloud.MiniSolrCloudCluster.checkForExceptions(MiniSolrCloudCluster.java:767)
at org.apache.solr.cloud.MiniSolrCloudCluster.shutdown(MiniSolrCloudCluster.java:677)
at org.apache.solr.cloud.SolrCloudTestCase.shutdownCluster(SolrCloudTestCase.java:144)
at java.base/jdk.internal.reflect.DirectMethodHandleAccessor.invoke(DirectMethodHandleAccessor.java:103)
at java.base/java.lang.reflect.Method.invoke(Method.java:580)
at com.carrotsearch.randomizedtesting.RandomizedRunner.invoke(RandomizedRunner.java:1763)
at com.carrotsearch.randomizedtesting.RandomizedRunner$7.evaluate(RandomizedRunner.java:909)
at com.carrotsearch.randomizedtesting.rules.StatementAdapter.evaluate(StatementAdapter.java:36)
at com.carrotsearch.randomizedtesting.rules.StatementAdapter.evaluate(StatementAdapter.java:36)
at org.apache.lucene.tests.util.AbstractBeforeAfterRule$1.evaluate(AbstractBeforeAfterRule.java:43)
at com.carrotsearch.randomizedtesting.rules.SystemPropertiesRestoreRule$1.evaluate(SystemPropertiesRestoreRule.java:80)
at org.junit.rules.RunRules.evaluate(RunRules.java:20)
at org.apache.lucene.tests.util.AbstractBeforeAfterRule$1.evaluate(AbstractBeforeAfterRule.java:43)
at com.carrotsearch.randomizedtesting.rules.StatementAdapter.evaluate(StatementAdapter.java:36)
at org.apache.lucene.tests.util.TestRuleStoreClassName$1.evaluate(TestRuleStoreClassName.java:38)
at com.carrotsearch.randomizedtesting.rules.NoShadowingOrOverridesOnMethodsRule$1.evaluate(NoShadowingOrOverridesOnMethodsRule.java:40)
at com.carrotsearch.randomizedtesting.rules.NoShadowingOrOverridesOnMethodsRule$1.evaluate(NoShadowingOrOverridesOnMethodsRule.java:40)
at com.carrotsearch.randomizedtesting.rules.StatementAdapter.evaluate(StatementAdapter.java:36)
at com.carrotsearch.randomizedtesting.rules.StatementAdapter.evaluate(StatementAdapter.java:36)
at org.apache.lucene.tests.util.TestRuleAssertionsRequired$1.evaluate(TestRuleAssertionsRequired.java:53)
at org.apache.lucene.tests.util.AbstractBeforeAfterRule$1.evaluate(AbstractBeforeAfterRule.java:43)
at org.apache.lucene.tests.util.TestRuleMarkFailure$1.evaluate(TestRuleMarkFailure.java:44)
at org.apache.lucene.tests.util.TestRuleIgnoreAfterMaxFailures$1.evaluate(TestRuleIgnoreAfterMaxFailures.java:60)
at org.apache.lucene.tests.util.TestRuleIgnoreTestSuites$1.evaluate(TestRuleIgnoreTestSuites.java:47)
at org.junit.rules.RunRules.evaluate(RunRules.java:20)
at com.carrotsearch.randomizedtesting.rules.StatementAdapter.evaluate(StatementAdapter.java:36)
at com.carrotsearch.randomizedtesting.ThreadLeakControl$StatementRunner.run(ThreadLeakControl.java:390)
at com.carrotsearch.randomizedtesting.ThreadLeakControl.lambda$forkTimeoutingTask$0(ThreadLeakControl.java:850)
at java.base/java.lang.Thread.run(Thread.java:1583)
org.apache.solr.cloud.LeaderTragicEventTest > test suite's output saved to /home/jenkins/jenkins-agent/workspace/Solr/Solr-Test-10.0/solr/core/build/test-results/test/outputs/OUTPUT-org.apache.solr.cloud.LeaderTragicEventTest.txt, copied below:
2> 227268 INFO (SUITE-LeaderTragicEventTest-seed#[AD78A15A1F79C597]-worker) [] o.a.s.SolrTestCase Setting 'solr.configset.default.confdir' system property to test-framework derived value of '/home/jenkins/jenkins-agent/workspace/Solr/Solr-Test-10.0/solr/server/solr/configsets/_default/conf'
2> 227268 INFO (SUITE-LeaderTragicEventTest-seed#[AD78A15A1F79C597]-worker) [] o.a.s.SolrTestCaseJ4 SecureRandom sanity checks: test.solr.allowed.securerandom=null & java.security.egd=file:/dev/./urandom
2> 227269 INFO (SUITE-LeaderTragicEventTest-seed#[AD78A15A1F79C597]-worker) [] o.a.s.u.ErrorLogMuter Closing ErrorLogMuter-regex-63 after mutting 0 log messages
2> 227269 INFO (SUITE-LeaderTragicEventTest-seed#[AD78A15A1F79C597]-worker) [] o.a.s.u.ErrorLogMuter Creating ErrorLogMuter-regex-64 for ERROR logs matching regex: ignore_exception
2> 227270 INFO (SUITE-LeaderTragicEventTest-seed#[AD78A15A1F79C597]-worker) [] o.a.s.SolrTestCaseJ4 Created dataDir: /home/jenkins/jenkins-agent/workspace/Solr/Solr-Test-10.0/build/tmp/tests-tmp/org.apache.solr.cloud.LeaderTragicEventTest_AD78A15A1F79C597-001/data-dir-28-001
2> 227270 WARN (SUITE-LeaderTragicEventTest-seed#[AD78A15A1F79C597]-worker) [] o.a.s.SolrTestCaseJ4 startTrackingSearchers: numOpens=16 numCloses=16
2> 227270 INFO (SUITE-LeaderTragicEventTest-seed#[AD78A15A1F79C597]-worker) [] o.a.s.SolrTestCaseJ4 Using PointFields (NUMERIC_POINTS_SYSPROP=true) w/NUMERIC_DOCVALUES_SYSPROP=false
2> 227271 INFO (SUITE-LeaderTragicEventTest-seed#[AD78A15A1F79C597]-worker) [] o.a.s.SolrTestCaseJ4 Randomized ssl (false) and clientAuth (false) via: @org.apache.solr.util.RandomizeSSL(reason="", value=0.0/0.0, ssl=0.0/0.0, clientAuth=0.0/0.0)
2> 227271 INFO (SUITE-LeaderTragicEventTest-seed#[AD78A15A1F79C597]-worker) [] o.a.s.c.OpenTelemetryConfigurator OpenTelemetry tracer enabled with simple propagation only.
2> 227271 INFO (SUITE-LeaderTragicEventTest-seed#[AD78A15A1F79C597]-worker) [] o.a.s.c.MiniSolrCloudCluster Starting cluster of 2 servers in /home/jenkins/jenkins-agent/workspace/Solr/Solr-Test-10.0/build/tmp/tests-tmp/org.apache.solr.cloud.LeaderTragicEventTest_AD78A15A1F79C597-001/tempDir-001
2> 227271 INFO (SUITE-LeaderTragicEventTest-seed#[AD78A15A1F79C597]-worker) [] o.a.s.c.ZkTestServer STARTING ZK TEST SERVER
2> 227271 INFO (ZkTestServer Run Thread) [] o.a.s.c.ZkTestServer client port: /127.0.0.1:0
2> 227272 INFO (ZkTestServer Run Thread) [] o.a.s.c.ZkTestServer Starting server
2> 227272 WARN (ZkTestServer Run Thread) [] o.a.z.s.ServerCnxnFactory maxCnxns is not configured, using default value 0.
2> 227371 INFO (SUITE-LeaderTragicEventTest-seed#[AD78A15A1F79C597]-worker) [] o.a.s.c.ZkTestServer start zk server on port: 45879
2> 227373 WARN (SUITE-LeaderTragicEventTest-seed#[AD78A15A1F79C597]-worker) [] o.a.s.c.c.SolrZkClient Using default ZkCredentialsInjector. ZkCredentialsInjector is not secure, it creates an empty list of credentials which leads to 'OPEN_ACL_UNSAFE' ACLs to Zookeeper nodes
2> 227373 WARN (SUITE-LeaderTragicEventTest-seed#[AD78A15A1F79C597]-worker) [] o.a.s.c.c.SolrZkClient Using default ZkACLProvider. DefaultZkACLProvider is not secure, it creates 'OPEN_ACL_UNSAFE' ACLs to Zookeeper nodes
2> 227373 INFO (SUITE-LeaderTragicEventTest-seed#[AD78A15A1F79C597]-worker) [] o.a.c.f.i.CuratorFrameworkImpl Starting
2> 227374 INFO (SUITE-LeaderTragicEventTest-seed#[AD78A15A1F79C597]-worker) [] o.a.c.f.i.CuratorFrameworkImpl Default schema
2> 227375 INFO (SUITE-LeaderTragicEventTest-seed#[AD78A15A1F79C597]-worker-EventThread) [] o.a.c.f.s.ConnectionStateManager State change: CONNECTED
2> 227376 INFO (SUITE-LeaderTragicEventTest-seed#[AD78A15A1F79C597]-worker-EventThread) [] o.a.c.f.i.EnsembleTracker New config event received: {}
2> 227376 INFO (SUITE-LeaderTragicEventTest-seed#[AD78A15A1F79C597]-worker-EventThread) [] o.a.c.f.i.EnsembleTracker New config event received: {}
2> 227377 WARN (SUITE-LeaderTragicEventTest-seed#[AD78A15A1F79C597]-worker) [] o.a.s.c.c.SolrZkClient Using default ZkCredentialsInjector. ZkCredentialsInjector is not secure, it creates an empty list of credentials which leads to 'OPEN_ACL_UNSAFE' ACLs to Zookeeper nodes
2> 227377 WARN (SUITE-LeaderTragicEventTest-seed#[AD78A15A1F79C597]-worker) [] o.a.s.c.c.SolrZkClient Using default ZkACLProvider. DefaultZkACLProvider is not secure, it creates 'OPEN_ACL_UNSAFE' ACLs to Zookeeper nodes
2> 227377 INFO (SUITE-LeaderTragicEventTest-seed#[AD78A15A1F79C597]-worker) [] o.a.c.f.i.CuratorFrameworkImpl Starting
2> 227378 INFO (SUITE-LeaderTragicEventTest-seed#[AD78A15A1F79C597]-worker) [] o.a.c.f.i.CuratorFrameworkImpl Default schema
2> 227379 INFO (SUITE-LeaderTragicEventTest-seed#[AD78A15A1F79C597]-worker-EventThread) [] o.a.c.f.s.ConnectionStateManager State change: CONNECTED
2> 227379 WARN (SUITE-LeaderTragicEventTest-seed#[AD78A15A1F79C597]-worker) [] o.a.s.c.c.SolrZkClient Using default ZkCredentialsInjector. ZkCredentialsInjector is not secure, it creates an empty list of credentials which leads to 'OPEN_ACL_UNSAFE' ACLs to Zookeeper nodes
2> 227379 WARN (SUITE-LeaderTragicEventTest-seed#[AD78A15A1F79C597]-worker) [] o.a.s.c.c.SolrZkClient Using default ZkACLProvider. DefaultZkACLProvider is not secure, it creates 'OPEN_ACL_UNSAFE' ACLs to Zookeeper nodes
2> 227379 INFO (SUITE-LeaderTragicEventTest-seed#[AD78A15A1F79C597]-worker) [] o.a.c.f.i.CuratorFrameworkImpl Starting
2> 227379 INFO (SUITE-LeaderTragicEventTest-seed#[AD78A15A1F79C597]-worker-EventThread) [] o.a.c.f.i.EnsembleTracker New config event received: {}
2> 227379 INFO (SUITE-LeaderTragicEventTest-seed#[AD78A15A1F79C597]-worker-EventThread) [] o.a.c.f.i.EnsembleTracker New config event received: {}
2> 227380 INFO (SUITE-LeaderTragicEventTest-seed#[AD78A15A1F79C597]-worker) [] o.a.c.f.i.CuratorFrameworkImpl Default schema
2> 227380 INFO (SUITE-LeaderTragicEventTest-seed#[AD78A15A1F79C597]-worker-EventThread) [] o.a.c.f.s.ConnectionStateManager State change: CONNECTED
2> 227381 INFO (SUITE-LeaderTragicEventTest-seed#[AD78A15A1F79C597]-worker-EventThread) [] o.a.c.f.i.EnsembleTracker New config event received: {}
2> 227381 INFO (SUITE-LeaderTragicEventTest-seed#[AD78A15A1F79C597]-worker-EventThread) [] o.a.c.f.i.EnsembleTracker New config event received: {}
2> 227382 INFO (Curator-Framework-0) [] o.a.c.f.i.CuratorFrameworkImpl backgroundOperationsLoop exiting
2> 227484 INFO (jetty-launcher-2741-thread-2) [] o.a.s.e.JettySolrRunner Start Jetty (configured port=0, binding port=0)
2> 227484 INFO (jetty-launcher-2741-thread-1) [] o.a.s.e.JettySolrRunner Start Jetty (configured port=0, binding port=0)
2> 227484 INFO (jetty-launcher-2741-thread-2) [] o.a.s.e.JettySolrRunner Trying to start Jetty on port 0 try number 2 ...
2> 227484 INFO (jetty-launcher-2741-thread-1) [] o.a.s.e.JettySolrRunner Trying to start Jetty on port 0 try number 2 ...
2> 227484 INFO (jetty-launcher-2741-thread-2) [] o.e.j.s.Server jetty-12.0.27; built: 2025-09-10T23:47:49.595Z; git: 3569a3e83ad136ee44e26b370b74c1c5e9f33e61; jvm 21.0.4+7-LTS
2> 227484 INFO (jetty-launcher-2741-thread-1) [] o.e.j.s.Server jetty-12.0.27; built: 2025-09-10T23:47:49.595Z; git: 3569a3e83ad136ee44e26b370b74c1c5e9f33e61; jvm 21.0.4+7-LTS
2> 227486 INFO (jetty-launcher-2741-thread-2) [] o.e.j.s.DefaultSessionIdManager Session workerName=node0
2> 227486 INFO (jetty-launcher-2741-thread-1) [] o.e.j.s.DefaultSessionIdManager Session workerName=node0
2> 227486 WARN (jetty-launcher-2741-thread-2) [] o.e.j.e.s.ServletContextHandler BaseResource file:///home/jenkins/jenkins-agent/workspace/Solr/Solr-Test-10.0/solr/core/build/tmp/tests-cwd/./ is aliased to file:///home/jenkins/jenkins-agent/workspace/Solr/Solr-Test-10.0/solr/core/build/tmp/tests-cwd/ in oeje10s.ServletContextHandler@50dab843{/solr,/solr,b=file:///home/jenkins/jenkins-agent/workspace/Solr/Solr-Test-10.0/solr/core/build/tmp/tests-cwd/./,a=STOPPED,h=oeje10s.SessionHandler@1bc4b4a{STOPPED}}. May not be supported in future releases.
2> 227486 WARN (jetty-launcher-2741-thread-1) [] o.e.j.e.s.ServletContextHandler BaseResource file:///home/jenkins/jenkins-agent/workspace/Solr/Solr-Test-10.0/solr/core/build/tmp/tests-cwd/./ is aliased to file:///home/jenkins/jenkins-agent/workspace/Solr/Solr-Test-10.0/solr/core/build/tmp/tests-cwd/ in oeje10s.ServletContextHandler@7295a084{/solr,/solr,b=file:///home/jenkins/jenkins-agent/workspace/Solr/Solr-Test-10.0/solr/core/build/tmp/tests-cwd/./,a=STOPPED,h=oeje10s.SessionHandler@7b286e9{STOPPED}}. May not be supported in future releases.
2> 227486 INFO (jetty-launcher-2741-thread-2) [] o.e.j.s.h.ContextHandler /solr Base Resource is an alias: file:///home/jenkins/jenkins-agent/workspace/Solr/Solr-Test-10.0/solr/core/build/tmp/tests-cwd/./ -> file:///home/jenkins/jenkins-agent/workspace/Solr/Solr-Test-10.0/solr/core/build/tmp/tests-cwd/
2> 227486 INFO (jetty-launcher-2741-thread-1) [] o.e.j.s.h.ContextHandler /solr Base Resource is an alias: file:///home/jenkins/jenkins-agent/workspace/Solr/Solr-Test-10.0/solr/core/build/tmp/tests-cwd/./ -> file:///home/jenkins/jenkins-agent/workspace/Solr/Solr-Test-10.0/solr/core/build/tmp/tests-cwd/
2> 227487 INFO (jetty-launcher-2741-thread-2) [] o.e.j.s.h.ContextHandler Started oeje10s.ServletContextHandler@50dab843{/solr,/solr,b=file:///home/jenkins/jenkins-agent/workspace/Solr/Solr-Test-10.0/solr/core/build/tmp/tests-cwd/,a=AVAILABLE,h=oeje10s.SessionHandler@1bc4b4a{STARTED}}
2> 227487 INFO (jetty-launcher-2741-thread-1) [] o.e.j.s.h.ContextHandler Started oeje10s.ServletContextHandler@7295a084{/solr,/solr,b=file:///home/jenkins/jenkins-agent/workspace/Solr/Solr-Test-10.0/solr/core/build/tmp/tests-cwd/,a=AVAILABLE,h=oeje10s.SessionHandler@7b286e9{STARTED}}
2> 227487 INFO (jetty-launcher-2741-thread-2) [] o.a.s.e.JettySolrRunner Jetty properties: {hostPort=39795, zkHost=127.0.0.1:45879/solr}
2> 227487 INFO (jetty-launcher-2741-thread-1) [] o.a.s.e.JettySolrRunner Jetty properties: {hostPort=38937, zkHost=127.0.0.1:45879/solr}
2> 227487 ERROR (jetty-launcher-2741-thread-2) [] o.a.s.u.StartupLoggingUtils Missing Java Option solr.logs.dir. Logging may be missing or incomplete.
2> 227487 ERROR (jetty-launcher-2741-thread-1) [] o.a.s.u.StartupLoggingUtils Missing Java Option solr.logs.dir. Logging may be missing or incomplete.
2> 227487 INFO (jetty-launcher-2741-thread-2) [] o.a.s.s.CoreContainerProvider Using logger factory org.apache.logging.slf4j.Log4jLoggerFactory
2> 227487 INFO (jetty-launcher-2741-thread-1) [] o.a.s.s.CoreContainerProvider Using logger factory org.apache.logging.slf4j.Log4jLoggerFactory
2> 227487 INFO (jetty-launcher-2741-thread-2) [] o.a.s.s.CoreContainerProvider ___ _ Welcome to Apache Solr™ version 10.0.1
2> 227487 INFO (jetty-launcher-2741-thread-2) [] o.a.s.s.CoreContainerProvider / __| ___| |_ _ Starting in cloud mode on port null
2> 227487 INFO (jetty-launcher-2741-thread-1) [] o.a.s.s.CoreContainerProvider ___ _ Welcome to Apache Solr™ version 10.0.1
2> 227487 INFO (jetty-launcher-2741-thread-2) [] o.a.s.s.CoreContainerProvider \__ \/ _ \ | '_| Install dir: /home/jenkins/jenkins-agent/workspace/Solr/Solr-Test-10.0/solr
2> 227487 INFO (jetty-launcher-2741-thread-2) [] o.a.s.s.CoreContainerProvider |___/\___/_|_| Start time: 2026-08-30T23:14:44.173387743Z
2> 227487 INFO (jetty-launcher-2741-thread-1) [] o.a.s.s.CoreContainerProvider / __| ___| |_ _ Starting in cloud mode on port null
2> 227487 INFO (jetty-launcher-2741-thread-1) [] o.a.s.s.CoreContainerProvider \__ \/ _ \ | '_| Install dir: /home/jenkins/jenkins-agent/workspace/Solr/Solr-Test-10.0/solr
2> 227487 INFO (jetty-launcher-2741-thread-1) [] o.a.s.s.CoreContainerProvider |___/\___/_|_| Start time: 2026-08-30T23:14:44.173477603Z
2> 227487 INFO (jetty-launcher-2741-thread-2) [] o.a.s.s.CoreContainerProvider Solr Home: /home/jenkins/jenkins-agent/workspace/Solr/Solr-Test-10.0/build/tmp/tests-tmp/org.apache.solr.cloud.LeaderTragicEventTest_AD78A15A1F79C597-001/tempDir-001/node2 (source: servlet config: solr.solr.home)
2> 227487 INFO (jetty-launcher-2741-thread-1) [] o.a.s.s.CoreContainerProvider Solr Home: /home/jenkins/jenkins-agent/workspace/Solr/Solr-Test-10.0/build/tmp/tests-tmp/org.apache.solr.cloud.LeaderTragicEventTest_AD78A15A1F79C597-001/tempDir-001/node1 (source: servlet config: solr.solr.home)
2> 227487 WARN (jetty-launcher-2741-thread-2) [] o.a.s.c.c.SolrZkClient Using default ZkCredentialsInjector. ZkCredentialsInjector is not secure, it creates an empty list of credentials which leads to 'OPEN_ACL_UNSAFE' ACLs to Zookeeper nodes
2> 227487 WARN (jetty-launcher-2741-thread-2) [] o.a.s.c.c.SolrZkClient Using default ZkACLProvider. DefaultZkACLProvider is not secure, it creates 'OPEN_ACL_UNSAFE' ACLs to Zookeeper nodes
2> 227487 WARN (jetty-launcher-2741-thread-1) [] o.a.s.c.c.SolrZkClient Using default ZkCredentialsInjector. ZkCredentialsInjector is not secure, it creates an empty list of credentials which leads to 'OPEN_ACL_UNSAFE' ACLs to Zookeeper nodes
2> 227487 WARN (jetty-launcher-2741-thread-1) [] o.a.s.c.c.SolrZkClient Using default ZkACLProvider. DefaultZkACLProvider is not secure, it creates 'OPEN_ACL_UNSAFE' ACLs to Zookeeper nodes
2> 227487 INFO (jetty-launcher-2741-thread-2) [] o.a.c.f.i.CuratorFrameworkImpl Starting
2> 227488 INFO (jetty-launcher-2741-thread-1) [] o.a.c.f.i.CuratorFrameworkImpl Starting
2> 227489 INFO (jetty-launcher-2741-thread-2) [] o.a.c.f.i.CuratorFrameworkImpl Default schema
2> 227489 INFO (jetty-launcher-2741-thread-1) [] o.a.c.f.i.CuratorFrameworkImpl Default schema
2> 227490 INFO (jetty-launcher-2741-thread-2-EventThread) [] o.a.c.f.s.ConnectionStateManager State change: CONNECTED
2> 227490 INFO (jetty-launcher-2741-thread-1-EventThread) [] o.a.c.f.s.ConnectionStateManager State change: CONNECTED
2> 227490 INFO (jetty-launcher-2741-thread-2-EventThread) [] o.a.c.f.i.EnsembleTracker New config event received: {}
2> 227490 INFO (jetty-launcher-2741-thread-2-EventThread) [] o.a.c.f.i.EnsembleTracker New config event received: {}
2> 227490 INFO (jetty-launcher-2741-thread-1-EventThread) [] o.a.c.f.i.EnsembleTracker New config event received: {}
2> 227490 INFO (jetty-launcher-2741-thread-1-EventThread) [] o.a.c.f.i.EnsembleTracker New config event received: {}
2> 227491 INFO (Curator-Framework-0) [] o.a.c.f.i.CuratorFrameworkImpl backgroundOperationsLoop exiting
2> 227491 INFO (Curator-Framework-0) [] o.a.c.f.i.CuratorFrameworkImpl backgroundOperationsLoop exiting
2> 227592 INFO (jetty-launcher-2741-thread-2) [] o.a.s.c.SolrXmlConfig Loading solr.xml from /home/jenkins/jenkins-agent/workspace/Solr/Solr-Test-10.0/build/tmp/tests-tmp/org.apache.solr.cloud.LeaderTragicEventTest_AD78A15A1F79C597-001/tempDir-001/node2/solr.xml
2> 227592 INFO (jetty-launcher-2741-thread-1) [] o.a.s.c.SolrXmlConfig Loading solr.xml from /home/jenkins/jenkins-agent/workspace/Solr/Solr-Test-10.0/build/tmp/tests-tmp/org.apache.solr.cloud.LeaderTragicEventTest_AD78A15A1F79C597-001/tempDir-001/node1/solr.xml
2> 227594 INFO (jetty-launcher-2741-thread-1) [] o.a.s.c.SolrXmlConfig Metrics collection is disabled.
2> 227594 INFO (jetty-launcher-2741-thread-2) [] o.a.s.c.SolrXmlConfig Metrics collection is disabled.
2> 227602 INFO (jetty-launcher-2741-thread-1) [] o.a.s.c.ZkContainer Zookeeper client=127.0.0.1:45879/solr
2> 227602 WARN (jetty-launcher-2741-thread-1) [] o.a.s.c.c.SolrZkClient Using default ZkCredentialsInjector. ZkCredentialsInjector is not secure, it creates an empty list of credentials which leads to 'OPEN_ACL_UNSAFE' ACLs to Zookeeper nodes
2> 227602 WARN (jetty-launcher-2741-thread-1) [] o.a.s.c.c.SolrZkClient Using default ZkACLProvider. DefaultZkACLProvider is not secure, it creates 'OPEN_ACL_UNSAFE' ACLs to Zookeeper nodes
2> 227602 INFO (jetty-launcher-2741-thread-2) [] o.a.s.c.ZkContainer Zookeeper client=127.0.0.1:45879/solr
2> 227602 WARN (jetty-launcher-2741-thread-2) [] o.a.s.c.c.SolrZkClient Using default ZkCredentialsInjector. ZkCredentialsInjector is not secure, it creates an empty list of credentials which leads to 'OPEN_ACL_UNSAFE' ACLs to Zookeeper nodes
2> 227602 WARN (jetty-launcher-2741-thread-2) [] o.a.s.c.c.SolrZkClient Using default ZkACLProvider. DefaultZkACLProvider is not secure, it creates 'OPEN_ACL_UNSAFE' ACLs to Zookeeper nodes
2> 227602 INFO (jetty-launcher-2741-thread-1) [] o.a.c.f.i.CuratorFrameworkImpl Starting
2> 227602 INFO (jetty-launcher-2741-thread-2) [] o.a.c.f.i.CuratorFrameworkImpl Starting
2> 227604 INFO (jetty-launcher-2741-thread-1) [] o.a.c.f.i.CuratorFrameworkImpl Default schema
2> 227604 INFO (jetty-launcher-2741-thread-2) [] o.a.c.f.i.CuratorFrameworkImpl Default schema
2> 227605 INFO (jetty-launcher-2741-thread-1-EventThread) [] o.a.c.f.s.ConnectionStateManager State change: CONNECTED
2> 227605 INFO (jetty-launcher-2741-thread-2-EventThread) [] o.a.c.f.s.ConnectionStateManager State change: CONNECTED
2> 227605 INFO (jetty-launcher-2741-thread-1-EventThread) [] o.a.c.f.i.EnsembleTracker New config event received: {}
2> 227605 INFO (jetty-launcher-2741-thread-1-EventThread) [] o.a.c.f.i.EnsembleTracker New config event received: {}
2> 227605 INFO (Curator-Framework-0) [] o.a.c.f.i.CuratorFrameworkImpl backgroundOperationsLoop exiting
2> 227605 INFO (jetty-launcher-2741-thread-2-EventThread) [] o.a.c.f.i.EnsembleTracker New config event received: {}
2> 227605 INFO (jetty-launcher-2741-thread-2-EventThread) [] o.a.c.f.i.EnsembleTracker New config event received: {}
2> 227605 INFO (Curator-Framework-0) [] o.a.c.f.i.CuratorFrameworkImpl backgroundOperationsLoop exiting
2> 227707 INFO (jetty-launcher-2741-thread-2) [n:127.0.0.1:39795_solr] o.a.c.f.i.CuratorFrameworkImpl Starting
2> 227707 INFO (jetty-launcher-2741-thread-1) [n:127.0.0.1:38937_solr] o.a.c.f.i.CuratorFrameworkImpl Starting
2> 227708 INFO (jetty-launcher-2741-thread-1) [n:127.0.0.1:38937_solr] o.a.c.f.i.CuratorFrameworkImpl Default schema
2> 227709 INFO (jetty-launcher-2741-thread-2) [n:127.0.0.1:39795_solr] o.a.c.f.i.CuratorFrameworkImpl Default schema
2> 227709 INFO (jetty-launcher-2741-thread-1-EventThread) [] o.a.c.f.s.ConnectionStateManager State change: CONNECTED
2> 227709 INFO (jetty-launcher-2741-thread-2-EventThread) [] o.a.c.f.s.ConnectionStateManager State change: CONNECTED
2> 227710 INFO (jetty-launcher-2741-thread-1-EventThread) [] o.a.c.f.i.EnsembleTracker New config event received: {}
2> 227710 INFO (jetty-launcher-2741-thread-2-EventThread) [] o.a.c.f.i.EnsembleTracker New config event received: {}
2> 227710 INFO (jetty-launcher-2741-thread-1-EventThread) [] o.a.c.f.i.EnsembleTracker New config event received: {}
2> 227710 INFO (jetty-launcher-2741-thread-2-EventThread) [] o.a.c.f.i.EnsembleTracker New config event received: {}
2> 227727 WARN (jetty-launcher-2741-thread-1) [n:127.0.0.1:38937_solr] o.a.s.c.ZkController Contents of zookeeper /security.json are world-readable; consider setting up ACLs as described in https://solr.apache.org/guide/solr/latest/deployment-guide/zookeeper-access-control.html
2> 227727 WARN (jetty-launcher-2741-thread-2) [n:127.0.0.1:39795_solr] o.a.s.c.ZkController Contents of zookeeper /security.json are world-readable; consider setting up ACLs as described in https://solr.apache.org/guide/solr/latest/deployment-guide/zookeeper-access-control.html
2> 227730 INFO (jetty-launcher-2741-thread-2) [n:127.0.0.1:39795_solr] o.a.s.c.ZkController The Overseer is enabled. It will process all cluster commands & state updates.
2> 227730 INFO (jetty-launcher-2741-thread-1) [n:127.0.0.1:38937_solr] o.a.s.c.ZkController The Overseer is enabled. It will process all cluster commands & state updates.
2> 227733 INFO (jetty-launcher-2741-thread-2) [n:127.0.0.1:39795_solr] o.a.s.c.OverseerElectionContext I am going to be the leader 127.0.0.1:39795_solr
2> 227734 INFO (jetty-launcher-2741-thread-2) [n:127.0.0.1:39795_solr] o.a.s.c.Overseer Overseer (id=72129472812810248-127.0.0.1:39795_solr-n_0000000000) starting
2> 227734 INFO (jetty-launcher-2741-thread-1) [n:127.0.0.1:38937_solr] o.a.s.c.ZkController Register node as live in ZooKeeper: /live_nodes/127.0.0.1:38937_solr
2> 227735 INFO (zkCallback-2772-thread-1) [] o.a.s.c.c.ZkStateReader Updated live nodes from ZooKeeper... (0) -> (1)
2> 227735 INFO (zkCallback-2773-thread-1) [] o.a.s.c.c.ZkStateReader Updated live nodes from ZooKeeper... (0) -> (1)
2> 227737 INFO (jetty-launcher-2741-thread-2) [n:127.0.0.1:39795_solr] o.a.s.c.ZkController Publish node=127.0.0.1:39795_solr as DOWN
2> 227737 INFO (OverseerStateUpdate-72129472812810248-127.0.0.1:39795_solr-n_0000000000) [n:127.0.0.1:39795_solr] o.a.s.c.Overseer Starting to work on the main queue : 127.0.0.1:39795_solr
2> 227738 WARN (jetty-launcher-2741-thread-1) [n:127.0.0.1:38937_solr] o.a.s.c.CoreContainer Not all security plugins configured! authentication=disabled authorization=disabled. Solr is only as secure as you make it. Consider configuring authentication/authorization before exposing Solr to users internal or external. See https://s.apache.org/solrsecurity for more info
2> 227738 INFO (jetty-launcher-2741-thread-2) [n:127.0.0.1:39795_solr] o.a.s.c.ZkController Register node as live in ZooKeeper: /live_nodes/127.0.0.1:39795_solr
2> 227740 INFO (zkCallback-2772-thread-1) [] o.a.s.c.c.ZkStateReader Updated live nodes from ZooKeeper... (1) -> (2)
2> 227740 INFO (zkCallback-2773-thread-1) [] o.a.s.c.c.ZkStateReader Updated live nodes from ZooKeeper... (1) -> (2)
2> 227741 WARN (jetty-launcher-2741-thread-2) [n:127.0.0.1:39795_solr] o.a.s.c.CoreContainer Not all security plugins configured! authentication=disabled authorization=disabled. Solr is only as secure as you make it. Consider configuring authentication/authorization before exposing Solr to users internal or external. See https://s.apache.org/solrsecurity for more info
2> 227760 INFO (jetty-launcher-2741-thread-2) [n:127.0.0.1:39795_solr] o.a.s.c.CorePropertiesLocator Found 0 core definitions underneath /home/jenkins/jenkins-agent/workspace/Solr/Solr-Test-10.0/build/tmp/tests-tmp/org.apache.solr.cloud.LeaderTragicEventTest_AD78A15A1F79C597-001/tempDir-001/node2
2> 227795 INFO (jetty-launcher-2741-thread-2) [n:127.0.0.1:39795_solr] o.a.s.j.SolrRequestAuthorizer Creating a new SolrRequestAuthorizer
2> 227807 INFO (jetty-launcher-2741-thread-1) [n:127.0.0.1:38937_solr] o.a.s.c.CorePropertiesLocator Found 0 core definitions underneath /home/jenkins/jenkins-agent/workspace/Solr/Solr-Test-10.0/build/tmp/tests-tmp/org.apache.solr.cloud.LeaderTragicEventTest_AD78A15A1F79C597-001/tempDir-001/node1
2> 227809 INFO (jetty-launcher-2741-thread-2) [n:127.0.0.1:39795_solr] o.e.j.e.s.ServletContextHandler Started oeje10s.ServletContextHandler@50dab843{/solr,/solr,b=file:///home/jenkins/jenkins-agent/workspace/Solr/Solr-Test-10.0/solr/core/build/tmp/tests-cwd/,a=AVAILABLE,h=oeje10s.SessionHandler@1bc4b4a{STARTED}}
2> 227809 INFO (jetty-launcher-2741-thread-2) [n:127.0.0.1:39795_solr] o.e.j.s.AbstractConnector Started ServerConnector@3addc34f{HTTP/1.1, (http/1.1, h2c)}{127.0.0.1:39795}
2> 227810 INFO (jetty-launcher-2741-thread-2) [n:127.0.0.1:39795_solr] o.e.j.s.Server Started oejs.Server@6ba94434{STARTING}[12.0.27,sto=15000] @227830ms
2> 227841 INFO (jetty-launcher-2741-thread-1) [n:127.0.0.1:38937_solr] o.a.s.j.SolrRequestAuthorizer Creating a new SolrRequestAuthorizer
2> 227854 INFO (jetty-launcher-2741-thread-1) [n:127.0.0.1:38937_solr] o.e.j.e.s.ServletContextHandler Started oeje10s.ServletContextHandler@7295a084{/solr,/solr,b=file:///home/jenkins/jenkins-agent/workspace/Solr/Solr-Test-10.0/solr/core/build/tmp/tests-cwd/,a=AVAILABLE,h=oeje10s.SessionHandler@7b286e9{STARTED}}
2> 227855 INFO (jetty-launcher-2741-thread-1) [n:127.0.0.1:38937_solr] o.e.j.s.AbstractConnector Started ServerConnector@1bc2dc15{HTTP/1.1, (http/1.1, h2c)}{127.0.0.1:38937}
2> 227855 INFO (jetty-launcher-2741-thread-1) [n:127.0.0.1:38937_solr] o.e.j.s.Server Started oejs.Server@3b9fc216{STARTING}[12.0.27,sto=15000] @227876ms
2> 227856 INFO (SUITE-LeaderTragicEventTest-seed#[AD78A15A1F79C597]-worker) [] o.a.s.c.MiniSolrCloudCluster waitForAllNodes: numServers=2
2> 227856 INFO (SUITE-LeaderTragicEventTest-seed#[AD78A15A1F79C597]-worker) [] o.a.s.c.MiniSolrCloudCluster waitForNode: 127.0.0.1:39795_solr
2> 227856 WARN (SUITE-LeaderTragicEventTest-seed#[AD78A15A1F79C597]-worker) [] o.a.s.c.c.SolrZkClient Using default ZkCredentialsInjector. ZkCredentialsInjector is not secure, it creates an empty list of credentials which leads to 'OPEN_ACL_UNSAFE' ACLs to Zookeeper nodes
2> 227856 WARN (SUITE-LeaderTragicEventTest-seed#[AD78A15A1F79C597]-worker) [] o.a.s.c.c.SolrZkClient Using default ZkACLProvider. DefaultZkACLProvider is not secure, it creates 'OPEN_ACL_UNSAFE' ACLs to Zookeeper nodes
2> 227856 INFO (SUITE-LeaderTragicEventTest-seed#[AD78A15A1F79C597]-worker) [] o.a.c.f.i.CuratorFrameworkImpl Starting
2> 227857 INFO (SUITE-LeaderTragicEventTest-seed#[AD78A15A1F79C597]-worker) [] o.a.c.f.i.CuratorFrameworkImpl Default schema
2> 227858 INFO (SUITE-LeaderTragicEventTest-seed#[AD78A15A1F79C597]-worker-EventThread) [] o.a.c.f.s.ConnectionStateManager State change: CONNECTED
2> 227859 INFO (SUITE-LeaderTragicEventTest-seed#[AD78A15A1F79C597]-worker-EventThread) [] o.a.c.f.i.EnsembleTracker New config event received: {}
2> 227859 INFO (SUITE-LeaderTragicEventTest-seed#[AD78A15A1F79C597]-worker-EventThread) [] o.a.c.f.i.EnsembleTracker New config event received: {}
2> 227860 INFO (SUITE-LeaderTragicEventTest-seed#[AD78A15A1F79C597]-worker) [] o.a.s.c.c.ZkStateReader Updated live nodes from ZooKeeper... (0) -> (2)
2> 227861 INFO (SUITE-LeaderTragicEventTest-seed#[AD78A15A1F79C597]-worker) [] o.a.s.c.s.i.ZkClientClusterStateProvider Cluster at 127.0.0.1:45879/solr ready
2> 227861 INFO (SUITE-LeaderTragicEventTest-seed#[AD78A15A1F79C597]-worker) [] o.a.s.c.MiniSolrCloudCluster waitForNode: 127.0.0.1:38937_solr
2> 227861 WARN (SUITE-LeaderTragicEventTest-seed#[AD78A15A1F79C597]-worker) [] o.a.s.c.c.SolrZkClient Using default ZkCredentialsInjector. ZkCredentialsInjector is not secure, it creates an empty list of credentials which leads to 'OPEN_ACL_UNSAFE' ACLs to Zookeeper nodes
2> 227861 WARN (SUITE-LeaderTragicEventTest-seed#[AD78A15A1F79C597]-worker) [] o.a.s.c.c.SolrZkClient Using default ZkACLProvider. DefaultZkACLProvider is not secure, it creates 'OPEN_ACL_UNSAFE' ACLs to Zookeeper nodes
2> 227861 INFO (SUITE-LeaderTragicEventTest-seed#[AD78A15A1F79C597]-worker) [] o.a.c.f.i.CuratorFrameworkImpl Starting
2> 227862 INFO (SUITE-LeaderTragicEventTest-seed#[AD78A15A1F79C597]-worker) [] o.a.c.f.i.CuratorFrameworkImpl Default schema
2> 227862 INFO (SUITE-LeaderTragicEventTest-seed#[AD78A15A1F79C597]-worker-EventThread) [] o.a.c.f.s.ConnectionStateManager State change: CONNECTED
2> 227863 INFO (SUITE-LeaderTragicEventTest-seed#[AD78A15A1F79C597]-worker-EventThread) [] o.a.c.f.i.EnsembleTracker New config event received: {}
2> 227863 INFO (SUITE-LeaderTragicEventTest-seed#[AD78A15A1F79C597]-worker-EventThread) [] o.a.c.f.i.EnsembleTracker New config event received: {}
2> 227866 INFO (Curator-Framework-0) [] o.a.c.f.i.CuratorFrameworkImpl backgroundOperationsLoop exiting
2> 227971 INFO (TEST-LeaderTragicEventTest.testOtherReplicasAreNotActive-seed#[AD78A15A1F79C597]) [] o.a.s.SolrTestCaseJ4 ###Starting testOtherReplicasAreNotActive
2> 227977 INFO (OverseerThreadFactory-2782-thread-1) [ c:testOtherReplicasAreNotActive t:null-13521] o.a.s.c.a.c.CreateCollectionCmd Create collection testOtherReplicasAreNotActive
2> 227977 INFO (OverseerThreadFactory-2782-thread-1) [ c:testOtherReplicasAreNotActive t:null-13521] o.a.s.c.a.c.CreateCollectionCmd solr.cloud.prs.enabled : true and collection prs : null, isPRS : true
2> 227982 INFO (OverseerThreadFactory-2782-thread-1) [ c:testOtherReplicasAreNotActive t:null-13521] o.a.s.c.o.SliceMutator createReplica() {
2> "core":"testOtherReplicasAreNotActive_shard1_replica_n1",
2> "node_name":"127.0.0.1:39795_solr",
2> "base_url":"http://127.0.0.1:39795/solr",
2> "collection":"testOtherReplicasAreNotActive",
2> "shard":"shard1",
2> "state":"down",
2> "type":"NRT",
2> "operation":"ADDREPLICA",
2> "waitForFinalState":"false"}
2> 227984 INFO (OverseerThreadFactory-2782-thread-1) [ c:testOtherReplicasAreNotActive t:null-13521] o.a.s.c.o.SliceMutator createReplica() {
2> "core":"testOtherReplicasAreNotActive_shard1_replica_n3",
2> "node_name":"127.0.0.1:38937_solr",
2> "base_url":"http://127.0.0.1:38937/solr",
2> "collection":"testOtherReplicasAreNotActive",
2> "shard":"shard1",
2> "state":"down",
2> "type":"NRT",
2> "operation":"ADDREPLICA",
2> "waitForFinalState":"false"}
2> 227989 INFO (qtp1630138273-4731-null-13521) [n:127.0.0.1:38937_solr x:testOtherReplicasAreNotActive_shard1_replica_n3 t:null-13521] o.a.s.h.a.a.CreateCore core create command "org.apache.solr.client.api.model.CreateCoreParams@7ee0831d"
2> 227989 INFO (qtp1631057144-4734-null-13521) [n:127.0.0.1:39795_solr x:testOtherReplicasAreNotActive_shard1_replica_n1 t:null-13521] o.a.s.h.a.a.CreateCore core create command "org.apache.solr.client.api.model.CreateCoreParams@2bf5f625"
2> 227995 INFO (qtp1630138273-4731-null-13521) [n:127.0.0.1:38937_solr c:testOtherReplicasAreNotActive s:shard1 r:core_node4 x:testOtherReplicasAreNotActive_shard1_replica_n3 t:null-13521] o.a.s.c.SolrConfig Using Lucene MatchVersion: 10.3.2
2> 227996 INFO (qtp1631057144-4734-null-13521) [n:127.0.0.1:39795_solr c:testOtherReplicasAreNotActive s:shard1 r:core_node2 x:testOtherReplicasAreNotActive_shard1_replica_n1 t:null-13521] o.a.s.c.SolrConfig Using Lucene MatchVersion: 10.3.2
2> 227998 INFO (qtp1630138273-4731-null-13521) [n:127.0.0.1:38937_solr c:testOtherReplicasAreNotActive s:shard1 r:core_node4 x:testOtherReplicasAreNotActive_shard1_replica_n3 t:null-13521] o.a.s.s.IndexSchema Schema name=minimal
2> 227998 INFO (qtp1631057144-4734-null-13521) [n:127.0.0.1:39795_solr c:testOtherReplicasAreNotActive s:shard1 r:core_node2 x:testOtherReplicasAreNotActive_shard1_replica_n1 t:null-13521] o.a.s.s.IndexSchema Schema name=minimal
2> 227998 INFO (qtp1630138273-4731-null-13521) [n:127.0.0.1:38937_solr c:testOtherReplicasAreNotActive s:shard1 r:core_node4 x:testOtherReplicasAreNotActive_shard1_replica_n3 t:null-13521] o.a.s.s.IndexSchema Loaded schema minimal/1.7 with uniqueid field id
2> 227998 INFO (qtp1630138273-4731-null-13521) [n:127.0.0.1:38937_solr c:testOtherReplicasAreNotActive s:shard1 r:core_node4 x:testOtherReplicasAreNotActive_shard1_replica_n3 t:null-13521] o.a.s.c.CoreContainer Creating SolrCore 'testOtherReplicasAreNotActive_shard1_replica_n3' using configuration from configset config
2> 227998 INFO (qtp1631057144-4734-null-13521) [n:127.0.0.1:39795_solr c:testOtherReplicasAreNotActive s:shard1 r:core_node2 x:testOtherReplicasAreNotActive_shard1_replica_n1 t:null-13521] o.a.s.s.IndexSchema Loaded schema minimal/1.7 with uniqueid field id
2> 227999 INFO (qtp1631057144-4734-null-13521) [n:127.0.0.1:39795_solr c:testOtherReplicasAreNotActive s:shard1 r:core_node2 x:testOtherReplicasAreNotActive_shard1_replica_n1 t:null-13521] o.a.s.c.CoreContainer Creating SolrCore 'testOtherReplicasAreNotActive_shard1_replica_n1' using configuration from configset config
2> 227999 INFO (qtp1630138273-4731-null-13521) [n:127.0.0.1:38937_solr c:testOtherReplicasAreNotActive s:shard1 r:core_node4 x:testOtherReplicasAreNotActive_shard1_replica_n3 t:null-13521] o.a.s.c.SolrCore Opening new SolrCore at [/home/jenkins/jenkins-agent/workspace/Solr/Solr-Test-10.0/build/tmp/tests-tmp/org.apache.solr.cloud.LeaderTragicEventTest_AD78A15A1F79C597-001/tempDir-001/node1/testOtherReplicasAreNotActive_shard1_replica_n3], dataDir=[/home/jenkins/jenkins-agent/workspace/Solr/Solr-Test-10.0/build/tmp/tests-tmp/org.apache.solr.cloud.LeaderTragicEventTest_AD78A15A1F79C597-001/tempDir-001/node1/testOtherReplicasAreNotActive_shard1_replica_n3/data/]
2> 227999 INFO (qtp1631057144-4734-null-13521) [n:127.0.0.1:39795_solr c:testOtherReplicasAreNotActive s:shard1 r:core_node2 x:testOtherReplicasAreNotActive_shard1_replica_n1 t:null-13521] o.a.s.c.SolrCore Opening new SolrCore at [/home/jenkins/jenkins-agent/workspace/Solr/Solr-Test-10.0/build/tmp/tests-tmp/org.apache.solr.cloud.LeaderTragicEventTest_AD78A15A1F79C597-001/tempDir-001/node2/testOtherReplicasAreNotActive_shard1_replica_n1], dataDir=[/home/jenkins/jenkins-agent/workspace/Solr/Solr-Test-10.0/build/tmp/tests-tmp/org.apache.solr.cloud.LeaderTragicEventTest_AD78A15A1F79C597-001/tempDir-001/node2/testOtherReplicasAreNotActive_shard1_replica_n1/data/]
2> 228026 INFO (qtp1630138273-4731-null-13521) [n:127.0.0.1:38937_solr c:testOtherReplicasAreNotActive s:shard1 r:core_node4 x:testOtherReplicasAreNotActive_shard1_replica_n3 t:null-13521] o.a.s.j.SolrRequestAuthorizer Creating a new SolrRequestAuthorizer
2> 228030 INFO (qtp1630138273-4731-null-13521) [n:127.0.0.1:38937_solr c:testOtherReplicasAreNotActive s:shard1 r:core_node4 x:testOtherReplicasAreNotActive_shard1_replica_n3 t:null-13521] o.a.s.u.UpdateHandler Using UpdateLog implementation: org.apache.solr.update.UpdateLog
2> 228031 INFO (qtp1630138273-4731-null-13521) [n:127.0.0.1:38937_solr c:testOtherReplicasAreNotActive s:shard1 r:core_node4 x:testOtherReplicasAreNotActive_shard1_replica_n3 t:null-13521] o.a.s.u.UpdateLog Initializing UpdateLog: dataDir=null defaultSyncLevel=FLUSH numRecordsToKeep=100 maxNumLogsToKeep=10
2> 228031 INFO (qtp1630138273-4731-null-13521) [n:127.0.0.1:38937_solr c:testOtherReplicasAreNotActive s:shard1 r:core_node4 x:testOtherReplicasAreNotActive_shard1_replica_n3 t:null-13521] o.a.s.u.CommitTracker Hard AutoCommit: disabled
2> 228031 INFO (qtp1630138273-4731-null-13521) [n:127.0.0.1:38937_solr c:testOtherReplicasAreNotActive s:shard1 r:core_node4 x:testOtherReplicasAreNotActive_shard1_replica_n3 t:null-13521] o.a.s.u.CommitTracker Soft AutoCommit: disabled
2> 228032 INFO (qtp1631057144-4734-null-13521) [n:127.0.0.1:39795_solr c:testOtherReplicasAreNotActive s:shard1 r:core_node2 x:testOtherReplicasAreNotActive_shard1_replica_n1 t:null-13521] o.a.s.j.SolrRequestAuthorizer Creating a new SolrRequestAuthorizer
2> 228034 INFO (qtp1630138273-4731-null-13521) [n:127.0.0.1:38937_solr c:testOtherReplicasAreNotActive s:shard1 r:core_node4 x:testOtherReplicasAreNotActive_shard1_replica_n3 t:null-13521] o.a.s.r.ManagedResourceStorage Configured ZooKeeperStorageIO with znodeBase: /configs/config
2> 228034 INFO (qtp1630138273-4731-null-13521) [n:127.0.0.1:38937_solr c:testOtherReplicasAreNotActive s:shard1 r:core_node4 x:testOtherReplicasAreNotActive_shard1_replica_n3 t:null-13521] o.a.s.r.ManagedResourceStorage Loaded null at path _rest_managed.json using ZooKeeperStorageIO:path=/configs/config
2> 228034 INFO (qtp1630138273-4731-null-13521) [n:127.0.0.1:38937_solr c:testOtherReplicasAreNotActive s:shard1 r:core_node4 x:testOtherReplicasAreNotActive_shard1_replica_n3 t:null-13521] o.a.s.h.ReplicationHandler Commits will be reserved for 10000 ms
2> 228036 INFO (searcherExecutor-2798-thread-1-processing-127.0.0.1:38937_solr testOtherReplicasAreNotActive_shard1_replica_n3 null-13521 testOtherReplicasAreNotActive shard1 core_node4) [n:127.0.0.1:38937_solr c:testOtherReplicasAreNotActive s:shard1 r:core_node4 x:testOtherReplicasAreNotActive_shard1_replica_n3 t:null-13521] o.a.s.c.SolrCore Registered new searcher autowarm time: 0 ms
2> 228037 INFO (qtp1631057144-4734-null-13521) [n:127.0.0.1:39795_solr c:testOtherReplicasAreNotActive s:shard1 r:core_node2 x:testOtherReplicasAreNotActive_shard1_replica_n1 t:null-13521] o.a.s.u.UpdateHandler Using UpdateLog implementation: org.apache.solr.update.UpdateLog
2> 228037 INFO (qtp1631057144-4734-null-13521) [n:127.0.0.1:39795_solr c:testOtherReplicasAreNotActive s:shard1 r:core_node2 x:testOtherReplicasAreNotActive_shard1_replica_n1 t:null-13521] o.a.s.u.UpdateLog Initializing UpdateLog: dataDir=null defaultSyncLevel=FLUSH numRecordsToKeep=100 maxNumLogsToKeep=10
2> 228037 INFO (qtp1631057144-4734-null-13521) [n:127.0.0.1:39795_solr c:testOtherReplicasAreNotActive s:shard1 r:core_node2 x:testOtherReplicasAreNotActive_shard1_replica_n1 t:null-13521] o.a.s.u.CommitTracker Hard AutoCommit: disabled
2> 228037 INFO (qtp1631057144-4734-null-13521) [n:127.0.0.1:39795_solr c:testOtherReplicasAreNotActive s:shard1 r:core_node2 x:testOtherReplicasAreNotActive_shard1_replica_n1 t:null-13521] o.a.s.u.CommitTracker Soft AutoCommit: disabled
2> 228039 INFO (qtp1630138273-4731-null-13521) [n:127.0.0.1:38937_solr c:testOtherReplicasAreNotActive s:shard1 r:core_node4 x:testOtherReplicasAreNotActive_shard1_replica_n3 t:null-13521] o.a.s.c.ZkShardTerms Successful update of terms at /collections/testOtherReplicasAreNotActive/terms/shard1 to Terms{values={core_node4=0}, version=0} for registerTerm
2> 228039 INFO (qtp1630138273-4731-null-13521) [n:127.0.0.1:38937_solr c:testOtherReplicasAreNotActive s:shard1 r:core_node4 x:testOtherReplicasAreNotActive_shard1_replica_n3 t:null-13521] o.a.s.c.ShardLeaderElectionContextBase make sure parent is created /collections/testOtherReplicasAreNotActive/leaders/shard1
2> 228040 INFO (qtp1631057144-4734-null-13521) [n:127.0.0.1:39795_solr c:testOtherReplicasAreNotActive s:shard1 r:core_node2 x:testOtherReplicasAreNotActive_shard1_replica_n1 t:null-13521] o.a.s.r.ManagedResourceStorage Configured ZooKeeperStorageIO with znodeBase: /configs/config
2> 228040 INFO (qtp1631057144-4734-null-13521) [n:127.0.0.1:39795_solr c:testOtherReplicasAreNotActive s:shard1 r:core_node2 x:testOtherReplicasAreNotActive_shard1_replica_n1 t:null-13521] o.a.s.r.ManagedResourceStorage Loaded null at path _rest_managed.json using ZooKeeperStorageIO:path=/configs/config
2> 228040 INFO (qtp1631057144-4734-null-13521) [n:127.0.0.1:39795_solr c:testOtherReplicasAreNotActive s:shard1 r:core_node2 x:testOtherReplicasAreNotActive_shard1_replica_n1 t:null-13521] o.a.s.h.ReplicationHandler Commits will be reserved for 10000 ms
2> 228042 INFO (searcherExecutor-2800-thread-1-processing-127.0.0.1:39795_solr testOtherReplicasAreNotActive_shard1_replica_n1 null-13521 testOtherReplicasAreNotActive shard1 core_node2) [n:127.0.0.1:39795_solr c:testOtherReplicasAreNotActive s:shard1 r:core_node2 x:testOtherReplicasAreNotActive_shard1_replica_n1 t:null-13521] o.a.s.c.SolrCore Registered new searcher autowarm time: 0 ms
2> 228043 INFO (qtp1631057144-4734-null-13521) [n:127.0.0.1:39795_solr c:testOtherReplicasAreNotActive s:shard1 r:core_node2 x:testOtherReplicasAreNotActive_shard1_replica_n1 t:null-13521] o.a.s.c.ZkShardTerms Successful update of terms at /collections/testOtherReplicasAreNotActive/terms/shard1 to Terms{values={core_node2=0, core_node4=0}, version=1} for registerTerm
2> 228043 INFO (qtp1631057144-4734-null-13521) [n:127.0.0.1:39795_solr c:testOtherReplicasAreNotActive s:shard1 r:core_node2 x:testOtherReplicasAreNotActive_shard1_replica_n1 t:null-13521] o.a.s.c.ShardLeaderElectionContextBase make sure parent is created /collections/testOtherReplicasAreNotActive/leaders/shard1
2> 228047 INFO (qtp1631057144-4734-null-13521) [n:127.0.0.1:39795_solr c:testOtherReplicasAreNotActive s:shard1 r:core_node2 x:testOtherReplicasAreNotActive_shard1_replica_n1 t:null-13521] o.a.s.c.ShardLeaderElectionContext Enough replicas found to continue.
2> 228047 INFO (qtp1631057144-4734-null-13521) [n:127.0.0.1:39795_solr c:testOtherReplicasAreNotActive s:shard1 r:core_node2 x:testOtherReplicasAreNotActive_shard1_replica_n1 t:null-13521] o.a.s.c.ShardLeaderElectionContext I may be the new leader - try and sync
2> 228047 INFO (qtp1631057144-4734-null-13521) [n:127.0.0.1:39795_solr c:testOtherReplicasAreNotActive s:shard1 r:core_node2 x:testOtherReplicasAreNotActive_shard1_replica_n1 t:null-13521] o.a.s.c.SyncStrategy Sync replicas to http://127.0.0.1:39795/solr/testOtherReplicasAreNotActive_shard1_replica_n1/
2> 228048 INFO (qtp1631057144-4734-null-13521) [n:127.0.0.1:39795_solr c:testOtherReplicasAreNotActive s:shard1 r:core_node2 x:testOtherReplicasAreNotActive_shard1_replica_n1 t:null-13521] o.a.s.u.PeerSync PeerSync: core=testOtherReplicasAreNotActive_shard1_replica_n1 url=http://127.0.0.1:39795/solr START replicas=[http://127.0.0.1:38937/solr/testOtherReplicasAreNotActive_shard1_replica_n3/] nUpdates=100
2> 228048 INFO (qtp1631057144-4734-null-13521) [n:127.0.0.1:39795_solr c:testOtherReplicasAreNotActive s:shard1 r:core_node2 x:testOtherReplicasAreNotActive_shard1_replica_n1 t:null-13521] o.a.s.u.PeerSync PeerSync: core=testOtherReplicasAreNotActive_shard1_replica_n1 url=http://127.0.0.1:39795/solr DONE. We have no versions. sync failed.
2> 228049 INFO (qtp1630138273-4733-null-13521) [n:127.0.0.1:38937_solr c:testOtherReplicasAreNotActive s:shard1 r:core_node4 x:testOtherReplicasAreNotActive_shard1_replica_n3 t:null-13521] o.a.s.c.S.Request path=/get params={distrib=false&qt=/get&fingerprint=false&getVersions=100&wt=javabin} status=0 QTime=0
2> 228049 INFO (qtp1631057144-4734-null-13521) [n:127.0.0.1:39795_solr c:testOtherReplicasAreNotActive s:shard1 r:core_node2 x:testOtherReplicasAreNotActive_shard1_replica_n1 t:null-13521] o.a.s.c.SyncStrategy Leader's attempt to sync with shard failed, moving to the next candidate
2> 228049 INFO (qtp1631057144-4734-null-13521) [n:127.0.0.1:39795_solr c:testOtherReplicasAreNotActive s:shard1 r:core_node2 x:testOtherReplicasAreNotActive_shard1_replica_n1 t:null-13521] o.a.s.c.ShardLeaderElectionContext We failed sync, but we have no versions - we can't sync in that case - we were active before, so become leader anyway
2> 228049 INFO (qtp1631057144-4734-null-13521) [n:127.0.0.1:39795_solr c:testOtherReplicasAreNotActive s:shard1 r:core_node2 x:testOtherReplicasAreNotActive_shard1_replica_n1 t:null-13521] o.a.s.c.ShardLeaderElectionContextBase Creating leader registration node /collections/testOtherReplicasAreNotActive/leaders/shard1/leader after winning as /collections/testOtherReplicasAreNotActive/leader_elect/shard1/election/72129472812810248-core_node2-n_0000000000
2> 228052 INFO (qtp1631057144-4734-null-13521) [n:127.0.0.1:39795_solr c:testOtherReplicasAreNotActive s:shard1 r:core_node2 x:testOtherReplicasAreNotActive_shard1_replica_n1 t:null-13521] o.a.s.c.ShardLeaderElectionContext I am the new leader: http://127.0.0.1:39795/solr/testOtherReplicasAreNotActive_shard1_replica_n1/ shard1
2> 228154 INFO (zkCallback-2773-thread-1) [] o.a.s.c.c.ZkStateReader A cluster state change: [WatchedEvent state:SyncConnected type:NodeDataChanged path:/collections/testOtherReplicasAreNotActive/state.json zxid: -1] for collection [testOtherReplicasAreNotActive] has occurred - updating... (live nodes size: [2])
2> 228157 INFO (qtp1631057144-4734-null-13521) [n:127.0.0.1:39795_solr c:testOtherReplicasAreNotActive s:shard1 r:core_node2 x:testOtherReplicasAreNotActive_shard1_replica_n1 t:null-13521] o.a.s.c.ZkController I am the leader, no recovery necessary
2> 228160 INFO (qtp1631057144-4734-null-13521) [n:127.0.0.1:39795_solr t:null-13521] o.a.s.s.HttpSolrCall [admin] path=/admin/cores params={qt=/admin/cores&coreNodeName=core_node2&collection.configName=config&newCollection=true&name=testOtherReplicasAreNotActive_shard1_replica_n1&action=CREATE&numShards=1&collection=testOtherReplicasAreNotActive&shard=shard1&wt=javabin&replicaType=NRT} status=0 QTime=171
2> 228260 INFO (zkCallback-2773-thread-1) [] o.a.s.c.c.ZkStateReader A cluster state change: [WatchedEvent state:SyncConnected type:NodeDataChanged path:/collections/testOtherReplicasAreNotActive/state.json zxid: -1] for collection [testOtherReplicasAreNotActive] has occurred - updating... (live nodes size: [2])
2> 229051 INFO (qtp1630138273-4731-null-13521) [n:127.0.0.1:38937_solr t:null-13521] o.a.s.s.HttpSolrCall [admin] path=/admin/cores params={qt=/admin/cores&coreNodeName=core_node4&collection.configName=config&newCollection=true&name=testOtherReplicasAreNotActive_shard1_replica_n3&action=CREATE&numShards=1&collection=testOtherReplicasAreNotActive&shard=shard1&wt=javabin&replicaType=NRT} status=0 QTime=1063
2> 229054 INFO (qtp1631057144-4728-null-13520) [n:127.0.0.1:39795_solr c:testOtherReplicasAreNotActive t:null-13520] o.a.s.h.a.CollectionsHandler Wait for new collection to be active for at most 45 seconds. Check all shard replicas
2> 229151 INFO (zkCallback-2773-thread-1) [] o.a.s.c.c.ZkStateReader A cluster state change: [WatchedEvent state:SyncConnected type:NodeDataChanged path:/collections/testOtherReplicasAreNotActive/state.json zxid: -1] for collection [testOtherReplicasAreNotActive] has occurred - updating... (live nodes size: [2])
2> 229151 INFO (zkCallback-2772-thread-1) [] o.a.s.c.c.ZkStateReader A cluster state change: [WatchedEvent state:SyncConnected type:NodeDataChanged path:/collections/testOtherReplicasAreNotActive/state.json zxid: -1] for collection [testOtherReplicasAreNotActive] has occurred - updating... (live nodes size: [2])
2> 229152 INFO (qtp1631057144-4728-null-13520) [n:127.0.0.1:39795_solr c:testOtherReplicasAreNotActive t:null-13520] o.a.s.s.HttpSolrCall [admin] path=/admin/collections params={collection.configName=config&name=testOtherReplicasAreNotActive&nrtReplicas=2&action=CREATE&numShards=1&wt=javabin} status=0 QTime=1179
2> 229153 INFO (TEST-LeaderTragicEventTest.testOtherReplicasAreNotActive-seed#[AD78A15A1F79C597]) [] o.a.s.c.MiniSolrCloudCluster waitForActiveCollection: testOtherReplicasAreNotActive
2> 229155 INFO (TEST-LeaderTragicEventTest.testOtherReplicasAreNotActive-seed#[AD78A15A1F79C597]) [] o.a.s.c.LeaderTragicEventTest Stop jetty node : http://127.0.0.1:38937/solr state:DocCollection(testOtherReplicasAreNotActive//collections/testOtherReplicasAreNotActive/state.json/5 )={
2> "pullReplicas":"0",
2> "configName":"config",
2> "nrtReplicas":2,
2> "replicationFactor":2,
2> "tlogReplicas":"0",
2> "router":{"name":"compositeId"},
2> "shards":{"shard1":{
2> "range":"80000000-7fffffff",
2> "replicas":{
2> "core_node2":{
2> "core":"testOtherReplicasAreNotActive_shard1_replica_n1",
2> "node_name":"127.0.0.1:39795_solr",
2> "type":"NRT",
2> "state":"active",
2> "leader":"true",
2> "force_set_state":"false",
2> "base_url":"http://127.0.0.1:39795/solr"},
2> "core_node4":{
2> "core":"testOtherReplicasAreNotActive_shard1_replica_n3",
2> "node_name":"127.0.0.1:38937_solr",
2> "type":"NRT",
2> "state":"active",
2> "force_set_state":"false",
2> "base_url":"http://127.0.0.1:38937/solr"}},
2> "state":"active"}}}
2> 229155 INFO (TEST-LeaderTragicEventTest.testOtherReplicasAreNotActive-seed#[AD78A15A1F79C597]) [] o.e.j.s.Server Stopped oejs.Server@3b9fc216{STOPPING}[12.0.27,sto=15000]
2> 229155 INFO (TEST-LeaderTragicEventTest.testOtherReplicasAreNotActive-seed#[AD78A15A1F79C597]) [] o.e.j.s.Server Shutdown oejs.Server@3b9fc216{STOPPING}[12.0.27,sto=15000]
2> 229156 INFO (TEST-LeaderTragicEventTest.testOtherReplicasAreNotActive-seed#[AD78A15A1F79C597]) [] o.e.j.s.AbstractConnector Stopped ServerConnector@1bc2dc15{HTTP/1.1, (http/1.1, h2c)}{127.0.0.1:0}
2> 229156 INFO (TEST-LeaderTragicEventTest.testOtherReplicasAreNotActive-seed#[AD78A15A1F79C597]) [] o.a.s.c.CoreContainer Shutting down CoreContainer instance=2142683678
2> 229156 INFO (TEST-LeaderTragicEventTest.testOtherReplicasAreNotActive-seed#[AD78A15A1F79C597]) [] o.a.s.c.ZkController Remove node as live in ZooKeeper:/live_nodes/127.0.0.1:38937_solr
2> 229157 INFO (zkCallback-2773-thread-1) [] o.a.s.c.c.ZkStateReader Updated live nodes from ZooKeeper... (2) -> (1)
2> 229157 INFO (zkCallback-2791-thread-1) [] o.a.s.c.c.ZkStateReader Updated live nodes from ZooKeeper... (2) -> (1)
2> 229158 INFO (zkCallback-2772-thread-1) [] o.a.s.c.c.ZkStateReader Updated live nodes from ZooKeeper... (2) -> (1)
2> 229158 INFO (TEST-LeaderTragicEventTest.testOtherReplicasAreNotActive-seed#[AD78A15A1F79C597]) [] o.a.s.c.ZkController Publish this node as DOWN...
2> 229158 INFO (TEST-LeaderTragicEventTest.testOtherReplicasAreNotActive-seed#[AD78A15A1F79C597]) [] o.a.s.c.ZkController Publish node=127.0.0.1:38937_solr as DOWN
2> 229160 INFO (TEST-LeaderTragicEventTest.testOtherReplicasAreNotActive-seed#[AD78A15A1F79C597]) [n:127.0.0.1:38937_solr] o.a.s.c.ShardLeaderElectionContextBase No version found for ephemeral leader parent node, won't remove previous leader registration.
2> Ut 31, 2026 5:14:45 SUB io.opentelemetry.sdk.internal.ThrottlingLogger doLog
2> WARNING: CallbackRegistration{instrumentDescriptors=[InstrumentDescriptor{name=solr_node_executor_thread_pool_size, description=Thread pool size, unit=, type=OBSERVABLE_GAUGE, valueType=LONG, advice=Advice{explicitBucketBoundaries=null, attributes=null}}]} has called close() multiple times.
2> Ut 31, 2026 5:14:45 SUB io.opentelemetry.sdk.internal.ThrottlingLogger doLog
2> WARNING: CallbackRegistration{instrumentDescriptors=[InstrumentDescriptor{name=solr_node_executor_thread_pool_tasks, description=Thread pool task counts, unit=, type=OBSERVABLE_GAUGE, valueType=LONG, advice=Advice{explicitBucketBoundaries=null, attributes=null}}]} has called close() multiple times.
2> 229161 INFO (coreCloseExecutor-2811-thread-1-processing-127.0.0.1:38937_solr) [n:127.0.0.1:38937_solr c:testOtherReplicasAreNotActive s:shard1 r:core_node4 x:testOtherReplicasAreNotActive_shard1_replica_n3] o.a.s.c.SolrCore CLOSING SolrCore org.apache.solr.core.SolrCore@e1ace7 testOtherReplicasAreNotActive_shard1_replica_n3
2> Ut 31, 2026 5:14:45 SUB io.opentelemetry.sdk.internal.ThrottlingLogger doLog
2> WARNING: CallbackRegistration{instrumentDescriptors=[InstrumentDescriptor{name=solr_core_replication_downloaded_size, description=Total bytes downloaded during replication, unit=By, type=OBSERVABLE_GAUGE, valueType=LONG, advice=Advice{explicitBucketBoundaries=null, attributes=null}}, InstrumentDescriptor{name=solr_core_replication_is_enabled, description=Whether replication is enabled (1) or not (0), unit=, type=OBSERVABLE_GAUGE, valueType=LONG, advice=Advice{explicitBucketBoundaries=null, attributes=null}}, InstrumentDescriptor{name=solr_core_replication_is_polling_disabled, description=Whether polling is disabled (1) or not (0), unit=, type=OBSERVABLE_GAUGE, valueType=LONG, advice=Advice{explicitBucketBoundaries=null, attributes=null}}, InstrumentDescriptor{name=solr_core_replication_download_speed, description=Download speed in bytes per second, unit=, type=OBSERVABLE_GAUGE, valueType=LONG, advice=Advice{explicitBucketBoundaries=null, attributes=null}}, InstrumentDescriptor{name=solr_core_replication_is_leader, description=Whether this node is a leader (1) or not (0), unit=, type=OBSERVABLE_GAUGE, valueType=LONG, advice=Advice{explicitBucketBoundaries=null, attributes=null}}, InstrumentDescriptor{name=solr_core_replication_index_size, description=Size of the index in megabytes, unit=MBy, type=OBSERVABLE_GAUGE, valueType=DOUBLE, advice=Advice{explicitBucketBoundaries=null, attributes=null}}, InstrumentDescriptor{name=solr_core_replication_time_elapsed, description=Time elapsed during replication in seconds, unit=s, type=OBSERVABLE_GAUGE, valueType=LONG, advice=Advice{explicitBucketBoundaries=null, attributes=null}}, InstrumentDescriptor{name=solr_core_replication_index_version, description=Current index version, unit=, type=OBSERVABLE_GAUGE, valueType=LONG, advice=Advice{explicitBucketBoundaries=null, attributes=null}}, InstrumentDescriptor{name=solr_core_replication_is_replicating, description=Whether replication is in progress (1) or not (0), unit=, type=OBSERVABLE_GAUGE, valueType=LONG, advice=Advice{explicitBucketBoundaries=null, attributes=null}}, InstrumentDescriptor{name=solr_core_replication_index_generation, description=Current index generation, unit=, type=OBSERVABLE_GAUGE, valueType=LONG, advice=Advice{explicitBucketBoundaries=null, attributes=null}}, InstrumentDescriptor{name=solr_core_replication_is_follower, description=Whether this node is a follower (1) or not (0), unit=, type=OBSERVABLE_GAUGE, valueType=LONG, advice=Advice{explicitBucketBoundaries=null, attributes=null}}]} has called close() multiple times.
2> Ut 31, 2026 5:14:45 SUB io.opentelemetry.sdk.internal.ThrottlingLogger doLog
2> WARNING: CallbackRegistration{instrumentDescriptors=[InstrumentDescriptor{name=solr_core_update_auto_commits, description=Current number of auto commits, unit=, type=OBSERVABLE_COUNTER, valueType=LONG, advice=Advice{explicitBucketBoundaries=null, attributes=null}}]} has called close() multiple times.
2> Ut 31, 2026 5:14:45 SUB io.opentelemetry.sdk.internal.ThrottlingLogger doLog
2> WARNING: CallbackRegistration{instrumentDescriptors=[InstrumentDescriptor{name=solr_core_update_commit_stats, description=Metrics around commits, unit=, type=OBSERVABLE_GAUGE, valueType=LONG, advice=Advice{explicitBucketBoundaries=null, attributes=null}}]} has called close() multiple times.
2> Ut 31, 2026 5:14:45 SUB io.opentelemetry.sdk.internal.ThrottlingLogger doLog
2> WARNING: CallbackRegistration{instrumentDescriptors=[InstrumentDescriptor{name=solr_core_update_docs_pending_commit, description=Current number of documents pending commit. Value is reset to 0 on commit., unit=, type=OBSERVABLE_GAUGE, valueType=LONG, advice=Advice{explicitBucketBoundaries=null, attributes=null}}]} has called close() multiple times.
2> 229162 INFO (coreCloseExecutor-2811-thread-1-processing-127.0.0.1:38937_solr) [n:127.0.0.1:38937_solr c:testOtherReplicasAreNotActive s:shard1 r:core_node4 x:testOtherReplicasAreNotActive_shard1_replica_n3] o.a.s.u.DirectUpdateHandler2 Committing on IndexWriter.close() ... SKIPPED (unnecessary).
2> Ut 31, 2026 5:14:45 SUB io.opentelemetry.sdk.internal.ThrottlingLogger doLog
2> WARNING: CallbackRegistration{instrumentDescriptors=[InstrumentDescriptor{name=solr_core_indexsearcher_cache_warmup_time, description=Cache warmup time (most recent), unit=ms, type=OBSERVABLE_GAUGE, valueType=LONG, advice=Advice{explicitBucketBoundaries=null, attributes=null}}, InstrumentDescriptor{name=solr_core_indexsearcher_cache_ops, description=Number of cumulative cache operations (inserts and evictions), unit=, type=OBSERVABLE_COUNTER, valueType=LONG, advice=Advice{explicitBucketBoundaries=null, attributes=null}}, InstrumentDescriptor{name=solr_core_indexsearcher_cache_lookups, description=Number of cumulative cache lookup results (hits and misses), unit=, type=OBSERVABLE_COUNTER, valueType=LONG, advice=Advice{explicitBucketBoundaries=null, attributes=null}}, InstrumentDescriptor{name=solr_core_indexsearcher_cache_ram_used, description=RAM bytes used by cache, unit=By, type=OBSERVABLE_GAUGE, valueType=LONG, advice=Advice{explicitBucketBoundaries=null, attributes=null}}, InstrumentDescriptor{name=solr_core_indexsearcher_cache_size, description=Current number cache entries, unit=, type=OBSERVABLE_GAUGE, valueType=LONG, advice=Advice{explicitBucketBoundaries=null, attributes=null}}]} has called close() multiple times.
2> Ut 31, 2026 5:14:45 SUB io.opentelemetry.sdk.internal.ThrottlingLogger doLog
2> WARNING: CallbackRegistration{instrumentDescriptors=[InstrumentDescriptor{name=solr_core_indexsearcher_termstats_cache, description=Operation counts for the searcher term statistics cache, reported per operation type, unit=, type=OBSERVABLE_GAUGE, valueType=LONG, advice=Advice{explicitBucketBoundaries=null, attributes=null}}]} has called close() multiple times.
2> Ut 31, 2026 5:14:45 SUB io.opentelemetry.sdk.internal.ThrottlingLogger doLog
2> WARNING: CallbackRegistration{instrumentDescriptors=[InstrumentDescriptor{name=solr_core_indexsearcher_live_docs_cache, description=LiveDocs cache metrics, unit=, type=OBSERVABLE_COUNTER, valueType=LONG, advice=Advice{explicitBucketBoundaries=null, attributes=null}}]} has called close() multiple times.
2> Ut 31, 2026 5:14:45 SUB io.opentelemetry.sdk.internal.ThrottlingLogger doLog
2> WARNING: CallbackRegistration{instrumentDescriptors=[InstrumentDescriptor{name=solr_core_indexsearcher_index_num_docs, description=Number of live docs in the index, unit=, type=OBSERVABLE_GAUGE, valueType=LONG, advice=Advice{explicitBucketBoundaries=null, attributes=null}}]} has called close() multiple times.
2> Ut 31, 2026 5:14:45 SUB io.opentelemetry.sdk.internal.ThrottlingLogger doLog
2> WARNING: CallbackRegistration{instrumentDescriptors=[InstrumentDescriptor{name=solr_core_indexsearcher_index_docs, description=Total number of docs in the index (including deletions), unit=, type=OBSERVABLE_GAUGE, valueType=LONG, advice=Advice{explicitBucketBoundaries=null, attributes=null}}]} has called close() multiple times.
2> Ut 31, 2026 5:14:45 SUB io.opentelemetry.sdk.internal.ThrottlingLogger doLog
2> WARNING: CallbackRegistration{instrumentDescriptors=[InstrumentDescriptor{name=solr_core_indexsearcher_index_version, description=Lucene index version, unit=, type=OBSERVABLE_GAUGE, valueType=LONG, advice=Advice{explicitBucketBoundaries=null, attributes=null}}]} has called close() multiple times.
2> Ut 31, 2026 5:14:45 SUB io.opentelemetry.sdk.internal.ThrottlingLogger doLog
2> WARNING: CallbackRegistration{instrumentDescriptors=[InstrumentDescriptor{name=solr_core_ref_count, description=The current number of active references to a Solr core, unit=, type=OBSERVABLE_GAUGE, valueType=LONG, advice=Advice{explicitBucketBoundaries=null, attributes=null}}]} has called close() multiple times.
2> Ut 31, 2026 5:14:45 SUB io.opentelemetry.sdk.internal.ThrottlingLogger doLog
2> WARNING: CallbackRegistration{instrumentDescriptors=[InstrumentDescriptor{name=solr_core_is_leader, description=Indicates whether this Solr core is currently the leader, unit=, type=OBSERVABLE_GAUGE, valueType=LONG, advice=Advice{explicitBucketBoundaries=null, attributes=null}}]} has called close() multiple times.
2> Ut 31, 2026 5:14:45 SUB io.opentelemetry.sdk.internal.ThrottlingLogger doLog
2> WARNING: CallbackRegistration{instrumentDescriptors=[InstrumentDescriptor{name=solr_core_executor_thread_pool_size, description=Thread pool size, unit=, type=OBSERVABLE_GAUGE, valueType=LONG, advice=Advice{explicitBucketBoundaries=null, attributes=null}}]} has called close() multiple times.
2> Ut 31, 2026 5:14:45 SUB io.opentelemetry.sdk.internal.ThrottlingLogger doLog
2> WARNING: CallbackRegistration{instrumentDescriptors=[InstrumentDescriptor{name=solr_core_executor_thread_pool_tasks, description=Thread pool task counts, unit=, type=OBSERVABLE_GAUGE, valueType=LONG, advice=Advice{explicitBucketBoundaries=null, attributes=null}}]} has called close() multiple times.
2> Ut 31, 2026 5:14:45 SUB io.opentelemetry.sdk.internal.ThrottlingLogger doLog
2> WARNING: CallbackRegistration{instrumentDescriptors=[InstrumentDescriptor{name=solr_core_executor_thread_pool_size, description=Thread pool size, unit=, type=OBSERVABLE_GAUGE, valueType=LONG, advice=Advice{explicitBucketBoundaries=null, attributes=null}}]} has called close() multiple times.
2> Ut 31, 2026 5:14:45 SUB io.opentelemetry.sdk.internal.ThrottlingLogger doLog
2> WARNING: CallbackRegistration{instrumentDescriptors=[InstrumentDescriptor{name=solr_core_executor_thread_pool_tasks, description=Thread pool task counts, unit=, type=OBSERVABLE_GAUGE, valueType=LONG, advice=Advice{explicitBucketBoundaries=null, attributes=null}}]} has called close() multiple times.
2> Ut 31, 2026 5:14:45 SUB io.opentelemetry.sdk.internal.ThrottlingLogger doLog
2> WARNING: CallbackRegistration{instrumentDescriptors=[InstrumentDescriptor{name=solr_core_executor_thread_pool_size, description=Thread pool size, unit=, type=OBSERVABLE_GAUGE, valueType=LONG, advice=Advice{explicitBucketBoundaries=null, attributes=null}}]} has called close() multiple times.
2> Ut 31, 2026 5:14:45 SUB io.opentelemetry.sdk.internal.ThrottlingLogger doLog
2> WARNING: CallbackRegistration{instrumentDescriptors=[InstrumentDescriptor{name=solr_core_executor_thread_pool_tasks, description=Thread pool task counts, unit=, type=OBSERVABLE_GAUGE, valueType=LONG, advice=Advice{explicitBucketBoundaries=null, attributes=null}}]} has called close() multiple times.
2> 229165 INFO (Curator-Framework-0) [] o.a.c.f.i.CuratorFrameworkImpl backgroundOperationsLoop exiting
2> 229262 INFO (zkCallback-2773-thread-1) [] o.a.s.c.c.ZkStateReader A cluster state change: [WatchedEvent state:SyncConnected type:NodeDataChanged path:/collections/testOtherReplicasAreNotActive/state.json zxid: -1] for collection [testOtherReplicasAreNotActive] has occurred - updating... (live nodes size: [1])
2> 229266 INFO (TEST-LeaderTragicEventTest.testOtherReplicasAreNotActive-seed#[AD78A15A1F79C597]) [n:127.0.0.1:38937_solr] o.e.j.e.s.ServletContextHandler Stopped oeje10s.ServletContextHandler@7295a084{/solr,/solr,b=file:///home/jenkins/jenkins-agent/workspace/Solr/Solr-Test-10.0/solr/core/build/tmp/tests-cwd/./,a=AVAILABLE,h=oeje10s.SessionHandler@7b286e9{STOPPED}}
2> 229267 INFO (TEST-LeaderTragicEventTest.testOtherReplicasAreNotActive-seed#[AD78A15A1F79C597]) [] o.a.s.c.MiniSolrCloudCluster Cannot wait for Jetty with null node name
2> 229267 INFO (TEST-LeaderTragicEventTest.testOtherReplicasAreNotActive-seed#[AD78A15A1F79C597]) [] o.a.s.c.SolrCloudTestCase waitForState (testOtherReplicasAreNotActive): Timeout waiting for replica get down
2> 229268 INFO (TEST-LeaderTragicEventTest.testOtherReplicasAreNotActive-seed#[AD78A15A1F79C597]) [] o.a.s.c.LeaderTragicEventTest Will crash leader : core_node2:{
2> "core":"testOtherReplicasAreNotActive_shard1_replica_n1",
2> "leader":"true",
2> "node_name":"127.0.0.1:39795_solr",
2> "base_url":"http://127.0.0.1:39795/solr",
2> "state":"active",
2> "type":"NRT",
2> "force_set_state":"false"}
2> 229274 ERROR (qtp1631057144-4730-null-13522) [n:127.0.0.1:39795_solr c:testOtherReplicasAreNotActive s:shard1 r:core_node2 x:testOtherReplicasAreNotActive_shard1_replica_n1 t:null-13522] o.a.s.u.SolrIndexWriter Error closing IndexWriter
2> =>java.lang.IllegalStateException: this writer hit an unrecoverable error; cannot flush
2> at org.apache.lucene.index.IndexWriter.doFlush(IndexWriter.java:4288)
2>
2> 229275 INFO (qtp1631057144-4730-null-13522) [n:127.0.0.1:39795_solr c:testOtherReplicasAreNotActive s:shard1 r:core_node2 x:testOtherReplicasAreNotActive_shard1_replica_n1 t:null-13522] o.a.s.u.DefaultSolrCoreState New IndexWriter is ready to be used.
2> 229275 ERROR (qtp1631057144-4730-null-13522) [n:127.0.0.1:39795_solr c:testOtherReplicasAreNotActive s:shard1 r:core_node2 x:testOtherReplicasAreNotActive_shard1_replica_n1 t:null-13522] o.a.s.h.RequestHandlerBase Server exception
2> =>org.apache.solr.common.SolrException: Random tragedy fail
2> at org.apache.solr.util.TestInjection.injectLeaderTragedy(TestInjection.java:407)
2>
2> 229275 INFO (qtp1631057144-4730-null-13522) [n:127.0.0.1:39795_solr c:testOtherReplicasAreNotActive s:shard1 r:core_node2 x:testOtherReplicasAreNotActive_shard1_replica_n1 t:null-13522] o.a.s.c.S.Request path=/update params={commit=true&wt=javabin} status=500 QTime=2
2> 229276 ERROR (qtp1631057144-4730-null-13522) [n:127.0.0.1:39795_solr c:testOtherReplicasAreNotActive s:shard1 r:core_node2 x:testOtherReplicasAreNotActive_shard1_replica_n1 t:null-13522] o.a.s.s.HttpSolrCall 500 Exception
2> =>org.apache.solr.common.SolrException: Random tragedy fail
2> at org.apache.solr.util.TestInjection.injectLeaderTragedy(TestInjection.java:407)
2>
2> 229278 INFO (TEST-LeaderTragicEventTest.testOtherReplicasAreNotActive-seed#[AD78A15A1F79C597]) [] o.a.s.c.LeaderTragicEventTest Tragic event triggered on attempt 1
2> 229278 INFO (TEST-LeaderTragicEventTest.testOtherReplicasAreNotActive-seed#[AD78A15A1F79C597]) [] o.a.s.e.JettySolrRunner Start Jetty (configured port=0, binding port=38937)
2> 229279 INFO (TEST-LeaderTragicEventTest.testOtherReplicasAreNotActive-seed#[AD78A15A1F79C597]) [] o.a.s.e.JettySolrRunner Trying to start Jetty on port 38937 try number 2 ...
2> 229279 INFO (TEST-LeaderTragicEventTest.testOtherReplicasAreNotActive-seed#[AD78A15A1F79C597]) [] o.e.j.s.Server jetty-12.0.27; built: 2025-09-10T23:47:49.595Z; git: 3569a3e83ad136ee44e26b370b74c1c5e9f33e61; jvm 21.0.4+7-LTS
2> 229280 INFO (TEST-LeaderTragicEventTest.testOtherReplicasAreNotActive-seed#[AD78A15A1F79C597]) [] o.e.j.s.DefaultSessionIdManager Session workerName=node0
2> 229280 WARN (TEST-LeaderTragicEventTest.testOtherReplicasAreNotActive-seed#[AD78A15A1F79C597]) [] o.e.j.e.s.ServletContextHandler BaseResource file:///home/jenkins/jenkins-agent/workspace/Solr/Solr-Test-10.0/solr/core/build/tmp/tests-cwd/./ is aliased to file:///home/jenkins/jenkins-agent/workspace/Solr/Solr-Test-10.0/solr/core/build/tmp/tests-cwd/ in oeje10s.ServletContextHandler@10a00784{/solr,/solr,b=file:///home/jenkins/jenkins-agent/workspace/Solr/Solr-Test-10.0/solr/core/build/tmp/tests-cwd/./,a=STOPPED,h=oeje10s.SessionHandler@13fbbe6b{STOPPED}}. May not be supported in future releases.
2> 229280 INFO (TEST-LeaderTragicEventTest.testOtherReplicasAreNotActive-seed#[AD78A15A1F79C597]) [] o.e.j.s.h.ContextHandler /solr Base Resource is an alias: file:///home/jenkins/jenkins-agent/workspace/Solr/Solr-Test-10.0/solr/core/build/tmp/tests-cwd/./ -> file:///home/jenkins/jenkins-agent/workspace/Solr/Solr-Test-10.0/solr/core/build/tmp/tests-cwd/
2> 229281 INFO (TEST-LeaderTragicEventTest.testOtherReplicasAreNotActive-seed#[AD78A15A1F79C597]) [] o.e.j.s.h.ContextHandler Started oeje10s.ServletContextHandler@10a00784{/solr,/solr,b=file:///home/jenkins/jenkins-agent/workspace/Solr/Solr-Test-10.0/solr/core/build/tmp/tests-cwd/,a=AVAILABLE,h=oeje10s.SessionHandler@13fbbe6b{STARTED}}
2> 229281 INFO (TEST-LeaderTragicEventTest.testOtherReplicasAreNotActive-seed#[AD78A15A1F79C597]) [] o.a.s.e.JettySolrRunner Jetty properties: {hostPort=38937, zkHost=127.0.0.1:45879/solr}
2> 229281 ERROR (TEST-LeaderTragicEventTest.testOtherReplicasAreNotActive-s
[...truncated too long message...]
ava.net.URLPermission:
java.util.ServiceConfigurationError: Locale provider adapter "CLDR"cannot be instantiated.
java.security.policy: error adding Permission, java.net.URLPermission:
java.util.ServiceConfigurationError: Locale provider adapter "CLDR"cannot be instantiated.
java.security.policy: error adding Permission, java.net.URLPermission:
java.util.ServiceConfigurationError: Locale provider adapter "CLDR"cannot be instantiated.
java.security.policy: error adding Permission, java.net.URLPermission:
java.util.ServiceConfigurationError: Locale provider adapter "CLDR"cannot be instantiated.
java.security.policy: error adding Permission, java.net.URLPermission:
java.util.ServiceConfigurationError: Locale provider adapter "CLDR"cannot be instantiated.
java.security.policy: error adding Permission, java.net.URLPermission:
java.util.ServiceConfigurationError: Locale provider adapter "CLDR"cannot be instantiated.
:solr:modules:s3-repository:test (SUCCESS): 53 test(s), 1 skipped
> Task :solr:modules:s3-repository:wipeTaskTemp
> Task :solr:modules:scripting:compileJava
Note: Some input files use or override a deprecated API.
Note: Recompile with -Xlint:deprecation for details.
> Task :solr:modules:scripting:processResources NO-SOURCE
> Task :solr:modules:scripting:classes
> Task :solr:modules:scripting:compileTestJava
Note: Some input files use or override a deprecated API.
Note: Recompile with -Xlint:deprecation for details.
> Task :solr:modules:scripting:processTestResources
> Task :solr:modules:scripting:testClasses
> Task :solr:modules:scripting:test
WARNING: Using incubator modules: jdk.incubator.vector
WARNING: Using incubator modules: jdk.incubator.vector
WARNING: Using incubator modules: jdk.incubator.vector
WARNING: Using incubator modules: jdk.incubator.vector
WARNING: A command line option has enabled the Security Manager
WARNING: The Security Manager is deprecated and will be removed in a future release
WARNING: A command line option has enabled the Security Manager
WARNING: The Security Manager is deprecated and will be removed in a future release
WARNING: A command line option has enabled the Security Manager
WARNING: The Security Manager is deprecated and will be removed in a future release
WARNING: A command line option has enabled the Security Manager
WARNING: The Security Manager is deprecated and will be removed in a future release
java.security.policy: error adding Permission, java.net.URLPermission:
java.util.ServiceConfigurationError: Locale provider adapter "CLDR"cannot be instantiated.
java.security.policy: error adding Permission, java.net.URLPermission:
java.util.ServiceConfigurationError: Locale provider adapter "CLDR"cannot be instantiated.
java.security.policy: error adding Permission, java.net.URLPermission:
java.util.ServiceConfigurationError: Locale provider adapter "CLDR"cannot be instantiated.
java.security.policy: error adding Permission, java.net.URLPermission:
java.util.ServiceConfigurationError: Locale provider adapter "CLDR"cannot be instantiated.
java.security.policy: error adding Permission, java.net.URLPermission:
java.util.ServiceConfigurationError: Locale provider adapter "CLDR"cannot be instantiated.
java.security.policy: error adding Permission, java.net.URLPermission:
java.util.ServiceConfigurationError: Locale provider adapter "CLDR"cannot be instantiated.
java.security.policy: error adding Permission, java.net.URLPermission:
java.util.ServiceConfigurationError: Locale provider adapter "CLDR"cannot be instantiated.
java.security.policy: error adding Permission, java.net.URLPermission:
java.util.ServiceConfigurationError: Locale provider adapter "CLDR"cannot be instantiated.
java.security.policy: error adding Permission, java.net.URLPermission:
java.util.ServiceConfigurationError: Locale provider adapter "CLDR"cannot be instantiated.
java.security.policy: error adding Permission, java.net.URLPermission:
java.util.ServiceConfigurationError: Locale provider adapter "CLDR"cannot be instantiated.
java.security.policy: error adding Permission, java.net.URLPermission:
java.util.ServiceConfigurationError: Locale provider adapter "CLDR"cannot be instantiated.
java.security.policy: error adding Permission, java.net.URLPermission:
java.util.ServiceConfigurationError: Locale provider adapter "CLDR"cannot be instantiated.
:solr:modules:scripting:test (SUCCESS): 22 test(s), 17 skipped
> Task :solr:modules:scripting:wipeTaskTemp
> Task :solr:modules:sql:compileTestJava
Note: Some input files use or override a deprecated API.
Note: Recompile with -Xlint:deprecation for details.
> Task :solr:modules:sql:copySolrCoreTestResources
> Task :solr:modules:sql:processTestResources
> Task :solr:modules:sql:testClasses
> Task :solr:modules:sql:test
WARNING: Using incubator modules: jdk.incubator.vector
WARNING: Using incubator modules: jdk.incubator.vector
WARNING: Using incubator modules: jdk.incubator.vector
WARNING: A command line option has enabled the Security Manager
WARNING: The Security Manager is deprecated and will be removed in a future release
WARNING: A command line option has enabled the Security Manager
WARNING: The Security Manager is deprecated and will be removed in a future release
WARNING: A command line option has enabled the Security Manager
WARNING: The Security Manager is deprecated and will be removed in a future release
java.security.policy: error adding Permission, java.net.URLPermission:
java.util.ServiceConfigurationError: Locale provider adapter "CLDR"cannot be instantiated.
java.security.policy: error adding Permission, java.net.URLPermission:
java.util.ServiceConfigurationError: Locale provider adapter "CLDR"cannot be instantiated.
java.security.policy: error adding Permission, java.net.URLPermission:
java.util.ServiceConfigurationError: Locale provider adapter "CLDR"cannot be instantiated.
java.security.policy: error adding Permission, java.net.URLPermission:
java.util.ServiceConfigurationError: Locale provider adapter "CLDR"cannot be instantiated.
java.security.policy: error adding Permission, java.net.URLPermission:
java.util.ServiceConfigurationError: Locale provider adapter "CLDR"cannot be instantiated.
java.security.policy: error adding Permission, java.net.URLPermission:
java.util.ServiceConfigurationError: Locale provider adapter "CLDR"cannot be instantiated.
java.security.policy: error adding Permission, java.net.URLPermission:
java.util.ServiceConfigurationError: Locale provider adapter "CLDR"cannot be instantiated.
java.security.policy: error adding Permission, java.net.URLPermission:
java.util.ServiceConfigurationError: Locale provider adapter "CLDR"cannot be instantiated.
java.security.policy: error adding Permission, java.net.URLPermission:
java.util.ServiceConfigurationError: Locale provider adapter "CLDR"cannot be instantiated.
:solr:modules:sql:test (SUCCESS): 33 test(s)
> Task :solr:modules:sql:wipeTaskTemp
The slowest tests (exceeding 500 ms) during this run:
89.75s BasicDistributedZkTest.test (:solr:core)
66.40s TestCpuAllowedLimit.testDistribLimit (:solr:core)
54.92s TestCpuAllowedLimit.testDistribLimit2 (:solr:core)
50.60s PeerSyncReplicationTest.test (:solr:core)
49.04s ReplicationFactorTest.test (:solr:core)
48.84s TestRandomCollapseQParserPlugin.testRandomCollapseWithSort (:solr:core)
48.01s SyncSliceTest.test (:solr:core)
40.15s HttpJettySolrClientTest.testIdleTimeoutWithHttpClient (:solr:solrj-jetty)
39.01s UnloadDistributedZkTest.test (:solr:core)
37.96s TestRandomFaceting.testRandomFaceting (:solr:core)
The slowest suites (exceeding 1s) during this run:
130.10s TestCpuAllowedLimit (:solr:core)
90.00s BasicDistributedZkTest (:solr:core)
71.31s TestCoordinatorRole (:solr:core)
70.87s KnnQParserTest (:solr:core)
67.27s TestTlogReplica (:solr:core)
63.59s ReindexCollectionTest (:solr:core)
63.04s TestRecovery (:solr:core)
61.93s TestPullReplica (:solr:core)
61.20s MultiThreadedOCPTest (:solr:core)
60.94s TestCloudConsistency (:solr:core)
ERROR: The following test(s) have failed:
- org.apache.solr.cloud.LeaderTragicEventTest (:solr:core)
Test history: https://develocity.apache.org/scans/tests?search.rootProjectNames=solr-root&tests.container=org.apache.solr.cloud.LeaderTragicEventTest
Test output: /home/jenkins/jenkins-agent/workspace/Solr/Solr-Test-10.0/solr/core/build/test-results/test/outputs/OUTPUT-org.apache.solr.cloud.LeaderTragicEventTest.txt
Reproduce with: ./gradlew :solr:core:test --tests "org.apache.solr.cloud.LeaderTragicEventTest" -Ptests.haltonfailure=false "-Ptests.jvmargs=-XX:TieredStopAtLevel=1 -XX:+UseParallelGC -XX:ActiveProcessorCount=1 -XX:ReservedCodeCacheSize=120m" -Ptests.seed=AD78A15A1F79C597 -Ptests.multiplier=2 -Ptests.useSecurityManager=true -Ptests.badapples=false -Ptests.file.encoding=ISO-8859-1
Deprecated Gradle features were used in this build, making it incompatible with Gradle 9.0.
You can use '--warning-mode all' to show the individual deprecation warnings and determine if they come from your own scripts or plugins.
For more on this, please refer to https://docs.gradle.org/8.10/userguide/command_line_interface.html#sec:command_line_warnings in the Gradle documentation.
BUILD SUCCESSFUL in 39m 57s
153 actionable tasks: 153 executed
Publishing build scan...
The Develocity server (develocity.apache.org) rejected the access key with prefix '7x3jzizm4zpygv7psbkg6byvm4'.
Your credential has expired.
Build step 'Invoke Gradle script' changed build result to SUCCESS
Archiving artifacts
‘**/*.events’ doesn’t match anything: ‘**’ exists but not ‘**/*.events’
No artifacts found that match the file pattern "**/*.events,heapdumps/**,**/hs_err_pid*". Configuration error?
Recording test results
[Checks API] No suitable checks publisher found.
Build step 'Publish JUnit test result report' changed build result to UNSTABLE
Email was triggered for: Unstable (Test Failures)
Sending email for trigger: Unstable (Test Failures)