You are viewing a plain text version of this content. The canonical link for it is here.
Posted to dev@kafka.apache.org by Apache Jenkins Server <je...@builds.apache.org> on 2019/01/08 20:21:42 UTC

Build failed in Jenkins: kafka-trunk-jdk11 #190

See <https://builds.apache.org/job/kafka-trunk-jdk11/190/display/redirect?page=changes>

Changes:

[jason] KAFKA-7253; The returned connector type is always null when creating

------------------------------------------
[...truncated 2.26 MB...]
org.apache.kafka.connect.transforms.TimestampConverterTest > testKey STARTED

org.apache.kafka.connect.transforms.TimestampConverterTest > testKey PASSED

org.apache.kafka.connect.transforms.TimestampConverterTest > testSchemalessDateToTimestamp STARTED

org.apache.kafka.connect.transforms.TimestampConverterTest > testSchemalessDateToTimestamp PASSED

org.apache.kafka.connect.transforms.TimestampConverterTest > testSchemalessTimestampToString STARTED

org.apache.kafka.connect.transforms.TimestampConverterTest > testSchemalessTimestampToString PASSED

org.apache.kafka.connect.transforms.TimestampConverterTest > testSchemalessTimeToTimestamp STARTED

org.apache.kafka.connect.transforms.TimestampConverterTest > testSchemalessTimeToTimestamp PASSED

org.apache.kafka.connect.transforms.TimestampConverterTest > testWithSchemaTimestampToDate STARTED

org.apache.kafka.connect.transforms.TimestampConverterTest > testWithSchemaTimestampToDate PASSED

org.apache.kafka.connect.transforms.TimestampConverterTest > testWithSchemaTimestampToTime STARTED

org.apache.kafka.connect.transforms.TimestampConverterTest > testWithSchemaTimestampToTime PASSED

org.apache.kafka.connect.transforms.TimestampConverterTest > testWithSchemaTimestampToUnix STARTED

org.apache.kafka.connect.transforms.TimestampConverterTest > testWithSchemaTimestampToUnix PASSED

org.apache.kafka.connect.transforms.TimestampConverterTest > testWithSchemaUnixToTimestamp STARTED

org.apache.kafka.connect.transforms.TimestampConverterTest > testWithSchemaUnixToTimestamp PASSED

org.apache.kafka.connect.transforms.TimestampConverterTest > testSchemalessIdentity STARTED

org.apache.kafka.connect.transforms.TimestampConverterTest > testSchemalessIdentity PASSED

org.apache.kafka.connect.transforms.TimestampConverterTest > testWithSchemaFieldConversion STARTED

org.apache.kafka.connect.transforms.TimestampConverterTest > testWithSchemaFieldConversion PASSED

org.apache.kafka.connect.transforms.TimestampConverterTest > testWithSchemaDateToTimestamp STARTED

org.apache.kafka.connect.transforms.TimestampConverterTest > testWithSchemaDateToTimestamp PASSED

org.apache.kafka.connect.transforms.TimestampConverterTest > testWithSchemaIdentity STARTED

org.apache.kafka.connect.transforms.TimestampConverterTest > testWithSchemaIdentity PASSED

org.apache.kafka.connect.transforms.TimestampConverterTest > testSchemalessTimestampToDate STARTED

org.apache.kafka.connect.transforms.TimestampConverterTest > testSchemalessTimestampToDate PASSED

org.apache.kafka.connect.transforms.TimestampConverterTest > testSchemalessTimestampToTime STARTED

org.apache.kafka.connect.transforms.TimestampConverterTest > testSchemalessTimestampToTime PASSED

org.apache.kafka.connect.transforms.TimestampConverterTest > testSchemalessTimestampToUnix STARTED

org.apache.kafka.connect.transforms.TimestampConverterTest > testSchemalessTimestampToUnix PASSED

org.apache.kafka.connect.transforms.TimestampConverterTest > testConfigMissingFormat STARTED

org.apache.kafka.connect.transforms.TimestampConverterTest > testConfigMissingFormat PASSED

org.apache.kafka.connect.transforms.TimestampConverterTest > testConfigNoTargetType STARTED

org.apache.kafka.connect.transforms.TimestampConverterTest > testConfigNoTargetType PASSED

org.apache.kafka.connect.transforms.TimestampConverterTest > testWithSchemaStringToTimestamp STARTED

org.apache.kafka.connect.transforms.TimestampConverterTest > testWithSchemaStringToTimestamp PASSED

org.apache.kafka.connect.transforms.TimestampConverterTest > testWithSchemaTimeToTimestamp STARTED

org.apache.kafka.connect.transforms.TimestampConverterTest > testWithSchemaTimeToTimestamp PASSED

org.apache.kafka.connect.transforms.TimestampConverterTest > testSchemalessUnixToTimestamp STARTED

org.apache.kafka.connect.transforms.TimestampConverterTest > testSchemalessUnixToTimestamp PASSED

org.apache.kafka.connect.transforms.TimestampConverterTest > testWithSchemaTimestampToString STARTED

org.apache.kafka.connect.transforms.TimestampConverterTest > testWithSchemaTimestampToString PASSED

org.apache.kafka.connect.transforms.TimestampConverterTest > testConfigInvalidFormat STARTED

org.apache.kafka.connect.transforms.TimestampConverterTest > testConfigInvalidFormat PASSED

org.apache.kafka.connect.transforms.TimestampRouterTest > defaultConfiguration STARTED

org.apache.kafka.connect.transforms.TimestampRouterTest > defaultConfiguration PASSED

org.apache.kafka.connect.transforms.RegexRouterTest > doesntMatch STARTED

org.apache.kafka.connect.transforms.RegexRouterTest > doesntMatch PASSED

org.apache.kafka.connect.transforms.RegexRouterTest > identity STARTED

org.apache.kafka.connect.transforms.RegexRouterTest > identity PASSED

org.apache.kafka.connect.transforms.RegexRouterTest > addPrefix STARTED

org.apache.kafka.connect.transforms.RegexRouterTest > addPrefix PASSED

org.apache.kafka.connect.transforms.RegexRouterTest > addSuffix STARTED

org.apache.kafka.connect.transforms.RegexRouterTest > addSuffix PASSED

org.apache.kafka.connect.transforms.RegexRouterTest > slice STARTED

org.apache.kafka.connect.transforms.RegexRouterTest > slice PASSED

org.apache.kafka.connect.transforms.RegexRouterTest > staticReplacement STARTED

org.apache.kafka.connect.transforms.RegexRouterTest > staticReplacement PASSED

org.apache.kafka.connect.transforms.ValueToKeyTest > withSchema STARTED

org.apache.kafka.connect.transforms.ValueToKeyTest > withSchema PASSED

org.apache.kafka.connect.transforms.ValueToKeyTest > schemaless STARTED

org.apache.kafka.connect.transforms.ValueToKeyTest > schemaless PASSED

org.apache.kafka.connect.transforms.InsertFieldTest > schemalessInsertConfiguredFields STARTED

org.apache.kafka.connect.transforms.InsertFieldTest > schemalessInsertConfiguredFields PASSED

org.apache.kafka.connect.transforms.InsertFieldTest > topLevelStructRequired STARTED

org.apache.kafka.connect.transforms.InsertFieldTest > topLevelStructRequired PASSED

org.apache.kafka.connect.transforms.InsertFieldTest > copySchemaAndInsertConfiguredFields STARTED

org.apache.kafka.connect.transforms.InsertFieldTest > copySchemaAndInsertConfiguredFields PASSED

org.apache.kafka.connect.transforms.ReplaceFieldTest > withSchema STARTED

org.apache.kafka.connect.transforms.ReplaceFieldTest > withSchema PASSED

org.apache.kafka.connect.transforms.ReplaceFieldTest > schemaless STARTED

org.apache.kafka.connect.transforms.ReplaceFieldTest > schemaless PASSED

org.apache.kafka.connect.transforms.MaskFieldTest > withSchema STARTED

org.apache.kafka.connect.transforms.MaskFieldTest > withSchema PASSED

org.apache.kafka.connect.transforms.MaskFieldTest > schemaless STARTED

org.apache.kafka.connect.transforms.MaskFieldTest > schemaless PASSED

org.apache.kafka.connect.transforms.util.NonEmptyListValidatorTest > testNullList STARTED

org.apache.kafka.connect.transforms.util.NonEmptyListValidatorTest > testNullList PASSED

org.apache.kafka.connect.transforms.util.NonEmptyListValidatorTest > testEmptyList STARTED

org.apache.kafka.connect.transforms.util.NonEmptyListValidatorTest > testEmptyList PASSED

org.apache.kafka.connect.transforms.util.NonEmptyListValidatorTest > testValidList STARTED

org.apache.kafka.connect.transforms.util.NonEmptyListValidatorTest > testValidList PASSED

org.apache.kafka.connect.transforms.FlattenTest > testKey STARTED

org.apache.kafka.connect.transforms.FlattenTest > testKey PASSED

org.apache.kafka.connect.transforms.FlattenTest > testOptionalAndDefaultValuesNested STARTED

org.apache.kafka.connect.transforms.FlattenTest > testOptionalAndDefaultValuesNested PASSED

org.apache.kafka.connect.transforms.FlattenTest > topLevelMapRequired STARTED

org.apache.kafka.connect.transforms.FlattenTest > topLevelMapRequired PASSED

org.apache.kafka.connect.transforms.FlattenTest > topLevelStructRequired STARTED

org.apache.kafka.connect.transforms.FlattenTest > topLevelStructRequired PASSED

org.apache.kafka.connect.transforms.FlattenTest > testOptionalFieldStruct STARTED

org.apache.kafka.connect.transforms.FlattenTest > testOptionalFieldStruct PASSED

org.apache.kafka.connect.transforms.FlattenTest > testNestedMapWithDelimiter STARTED

org.apache.kafka.connect.transforms.FlattenTest > testNestedMapWithDelimiter PASSED

org.apache.kafka.connect.transforms.FlattenTest > testOptionalFieldMap STARTED

org.apache.kafka.connect.transforms.FlattenTest > testOptionalFieldMap PASSED

org.apache.kafka.connect.transforms.FlattenTest > testUnsupportedTypeInMap STARTED

org.apache.kafka.connect.transforms.FlattenTest > testUnsupportedTypeInMap PASSED

org.apache.kafka.connect.transforms.FlattenTest > testNestedStruct STARTED

org.apache.kafka.connect.transforms.FlattenTest > testNestedStruct PASSED

org.apache.kafka.connect.transforms.SetSchemaMetadataTest > schemaNameUpdate STARTED

org.apache.kafka.connect.transforms.SetSchemaMetadataTest > schemaNameUpdate PASSED

org.apache.kafka.connect.transforms.SetSchemaMetadataTest > schemaNameAndVersionUpdateWithStruct STARTED

org.apache.kafka.connect.transforms.SetSchemaMetadataTest > schemaNameAndVersionUpdateWithStruct PASSED

org.apache.kafka.connect.transforms.SetSchemaMetadataTest > updateSchemaOfStruct STARTED

org.apache.kafka.connect.transforms.SetSchemaMetadataTest > updateSchemaOfStruct PASSED

org.apache.kafka.connect.transforms.SetSchemaMetadataTest > schemaNameAndVersionUpdate STARTED

org.apache.kafka.connect.transforms.SetSchemaMetadataTest > schemaNameAndVersionUpdate PASSED

org.apache.kafka.connect.transforms.SetSchemaMetadataTest > updateSchemaOfNull STARTED

org.apache.kafka.connect.transforms.SetSchemaMetadataTest > updateSchemaOfNull PASSED

org.apache.kafka.connect.transforms.SetSchemaMetadataTest > schemaVersionUpdate STARTED

org.apache.kafka.connect.transforms.SetSchemaMetadataTest > schemaVersionUpdate PASSED

org.apache.kafka.connect.transforms.SetSchemaMetadataTest > updateSchemaOfNonStruct STARTED

org.apache.kafka.connect.transforms.SetSchemaMetadataTest > updateSchemaOfNonStruct PASSED

FAILURE: Build failed with an exception.

* What went wrong:
Execution failed for task ':streams:test'.
> There were failing tests. See the report at: file://<https://builds.apache.org/job/kafka-trunk-jdk11/ws/streams/build/reports/tests/test/index.html>

* Try:
Run with --stacktrace option to get the stack trace. Run with --info or --debug option to get more log output. Run with --scan to get full insights.

* Get more help at https://help.gradle.org

Deprecated Gradle features were used in this build, making it incompatible with Gradle 6.0.
Use '--warning-mode all' to show the individual deprecation warnings.
See https://docs.gradle.org/5.0/userguide/command_line_interface.html#sec:command_line_warnings

BUILD FAILED in 2h 29m 20s
165 actionable tasks: 141 executed, 24 up-to-date
Build step 'Execute shell' marked build as failure
Recording test results
Setting GRADLE_4_10_2_HOME=/home/jenkins/tools/gradle/4.10.2
Setting GRADLE_4_10_2_HOME=/home/jenkins/tools/gradle/4.10.2

Jenkins build is back to normal : kafka-trunk-jdk11 #192

Posted by Apache Jenkins Server <je...@builds.apache.org>.
See <https://builds.apache.org/job/kafka-trunk-jdk11/192/display/redirect?page=changes>


Build failed in Jenkins: kafka-trunk-jdk11 #191

Posted by Apache Jenkins Server <je...@builds.apache.org>.
See <https://builds.apache.org/job/kafka-trunk-jdk11/191/display/redirect?page=changes>

Changes:

[github] MINOR: code cleanup (#6056)

[wangguoz] MINOR: Put states in proper order, increase timeout for starting (#6105)

------------------------------------------
[...truncated 2.25 MB...]

org.apache.kafka.connect.runtime.isolation.PluginUtilsTest > testPluginUrlsWithRelativeSymlinkForwards PASSED

org.apache.kafka.connect.runtime.isolation.PluginUtilsTest > testOrderOfPluginUrlsWithJars STARTED

org.apache.kafka.connect.runtime.isolation.PluginUtilsTest > testOrderOfPluginUrlsWithJars PASSED

org.apache.kafka.connect.runtime.isolation.PluginUtilsTest > testPluginUrlsWithClasses STARTED

org.apache.kafka.connect.runtime.isolation.PluginUtilsTest > testPluginUrlsWithClasses PASSED

org.apache.kafka.connect.runtime.isolation.PluginUtilsTest > testConnectFrameworkClasses STARTED

org.apache.kafka.connect.runtime.isolation.PluginUtilsTest > testConnectFrameworkClasses PASSED

org.apache.kafka.connect.runtime.isolation.PluginUtilsTest > testThirdPartyClasses STARTED

org.apache.kafka.connect.runtime.isolation.PluginUtilsTest > testThirdPartyClasses PASSED

org.apache.kafka.connect.runtime.isolation.PluginUtilsTest > testClientConfigProvider STARTED

org.apache.kafka.connect.runtime.isolation.PluginUtilsTest > testClientConfigProvider PASSED

org.apache.kafka.connect.runtime.isolation.PluginUtilsTest > testAllowedConnectFrameworkClasses STARTED

org.apache.kafka.connect.runtime.isolation.PluginUtilsTest > testAllowedConnectFrameworkClasses PASSED

org.apache.kafka.connect.runtime.isolation.PluginUtilsTest > testJavaLibraryClasses STARTED

org.apache.kafka.connect.runtime.isolation.PluginUtilsTest > testJavaLibraryClasses PASSED

org.apache.kafka.connect.runtime.isolation.PluginUtilsTest > testEmptyPluginUrls STARTED

org.apache.kafka.connect.runtime.isolation.PluginUtilsTest > testEmptyPluginUrls PASSED

org.apache.kafka.connect.runtime.isolation.PluginUtilsTest > testPluginUrlsWithJars STARTED

org.apache.kafka.connect.runtime.isolation.PluginUtilsTest > testPluginUrlsWithJars PASSED

org.apache.kafka.connect.runtime.isolation.PluginUtilsTest > testPluginUrlsWithZips STARTED

org.apache.kafka.connect.runtime.isolation.PluginUtilsTest > testPluginUrlsWithZips PASSED

org.apache.kafka.connect.runtime.isolation.PluginUtilsTest > testPluginUrlsWithRelativeSymlinkBackwards STARTED

org.apache.kafka.connect.runtime.isolation.PluginUtilsTest > testPluginUrlsWithRelativeSymlinkBackwards PASSED

org.apache.kafka.connect.runtime.isolation.PluginUtilsTest > testPluginUrlsWithAbsoluteSymlink STARTED

org.apache.kafka.connect.runtime.isolation.PluginUtilsTest > testPluginUrlsWithAbsoluteSymlink PASSED

org.apache.kafka.connect.runtime.isolation.PluginUtilsTest > testEmptyStructurePluginUrls STARTED

org.apache.kafka.connect.runtime.isolation.PluginUtilsTest > testEmptyStructurePluginUrls PASSED

org.apache.kafka.connect.runtime.isolation.PluginDescTest > testPluginDescWithNullVersion STARTED

org.apache.kafka.connect.runtime.isolation.PluginDescTest > testPluginDescWithNullVersion PASSED

org.apache.kafka.connect.runtime.isolation.PluginDescTest > testPluginDescComparison STARTED

org.apache.kafka.connect.runtime.isolation.PluginDescTest > testPluginDescComparison PASSED

org.apache.kafka.connect.runtime.isolation.PluginDescTest > testRegularPluginDesc STARTED

org.apache.kafka.connect.runtime.isolation.PluginDescTest > testRegularPluginDesc PASSED

org.apache.kafka.connect.runtime.isolation.PluginDescTest > testPluginDescEquality STARTED

org.apache.kafka.connect.runtime.isolation.PluginDescTest > testPluginDescEquality PASSED

org.apache.kafka.connect.runtime.isolation.PluginDescTest > testPluginDescWithSystemClassLoader STARTED

org.apache.kafka.connect.runtime.isolation.PluginDescTest > testPluginDescWithSystemClassLoader PASSED

org.apache.kafka.connect.runtime.isolation.DelegatingClassLoaderTest > testWhiteListedManifestResources STARTED

org.apache.kafka.connect.runtime.isolation.DelegatingClassLoaderTest > testWhiteListedManifestResources PASSED

org.apache.kafka.connect.runtime.isolation.DelegatingClassLoaderTest > testOtherResources STARTED

org.apache.kafka.connect.runtime.isolation.DelegatingClassLoaderTest > testOtherResources PASSED

org.apache.kafka.connect.runtime.ConnectorConfigTest > unconfiguredTransform STARTED

org.apache.kafka.connect.runtime.ConnectorConfigTest > unconfiguredTransform PASSED

org.apache.kafka.connect.runtime.ConnectorConfigTest > multipleTransformsOneDangling STARTED

org.apache.kafka.connect.runtime.ConnectorConfigTest > multipleTransformsOneDangling PASSED

org.apache.kafka.connect.runtime.ConnectorConfigTest > misconfiguredTransform STARTED

org.apache.kafka.connect.runtime.ConnectorConfigTest > misconfiguredTransform PASSED

org.apache.kafka.connect.runtime.ConnectorConfigTest > noTransforms STARTED

org.apache.kafka.connect.runtime.ConnectorConfigTest > noTransforms PASSED

org.apache.kafka.connect.runtime.ConnectorConfigTest > danglingTransformAlias STARTED

org.apache.kafka.connect.runtime.ConnectorConfigTest > danglingTransformAlias PASSED

org.apache.kafka.connect.runtime.ConnectorConfigTest > emptyConnectorName STARTED

org.apache.kafka.connect.runtime.ConnectorConfigTest > emptyConnectorName PASSED

org.apache.kafka.connect.runtime.ConnectorConfigTest > multipleTransforms STARTED

org.apache.kafka.connect.runtime.ConnectorConfigTest > multipleTransforms PASSED

org.apache.kafka.connect.runtime.ConnectorConfigTest > singleTransform STARTED

org.apache.kafka.connect.runtime.ConnectorConfigTest > singleTransform PASSED

org.apache.kafka.connect.runtime.ConnectorConfigTest > wrongTransformationType STARTED

org.apache.kafka.connect.runtime.ConnectorConfigTest > wrongTransformationType PASSED

org.apache.kafka.connect.runtime.WorkerTaskTest > stopBeforeStarting STARTED

org.apache.kafka.connect.runtime.WorkerTaskTest > stopBeforeStarting PASSED

org.apache.kafka.connect.runtime.WorkerTaskTest > standardStartup STARTED

org.apache.kafka.connect.runtime.WorkerTaskTest > standardStartup PASSED

org.apache.kafka.connect.runtime.WorkerTaskTest > cancelBeforeStopping STARTED

org.apache.kafka.connect.runtime.WorkerTaskTest > cancelBeforeStopping PASSED

org.apache.kafka.connect.runtime.WorkerTaskTest > updateMetricsOnListenerEventsForStartupPauseResumeAndShutdown STARTED

org.apache.kafka.connect.runtime.WorkerTaskTest > updateMetricsOnListenerEventsForStartupPauseResumeAndShutdown PASSED

org.apache.kafka.connect.runtime.WorkerTaskTest > updateMetricsOnListenerEventsForStartupPauseResumeAndFailure STARTED

org.apache.kafka.connect.runtime.WorkerTaskTest > updateMetricsOnListenerEventsForStartupPauseResumeAndFailure PASSED

org.apache.kafka.connect.runtime.ErrorHandlingTaskTest > testErrorHandlingInSourceTasks STARTED

org.apache.kafka.connect.runtime.ErrorHandlingTaskTest > testErrorHandlingInSourceTasks PASSED

org.apache.kafka.connect.runtime.ErrorHandlingTaskTest > testErrorHandlingInSourceTasksWthBadConverter STARTED

org.apache.kafka.connect.runtime.ErrorHandlingTaskTest > testErrorHandlingInSourceTasksWthBadConverter PASSED

org.apache.kafka.connect.runtime.ErrorHandlingTaskTest > testErrorHandlingInSinkTasks STARTED

org.apache.kafka.connect.runtime.ErrorHandlingTaskTest > testErrorHandlingInSinkTasks PASSED

org.apache.kafka.connect.runtime.StateTrackerTest > calculateDurations STARTED

org.apache.kafka.connect.runtime.StateTrackerTest > calculateDurations PASSED

org.apache.kafka.connect.runtime.StateTrackerTest > currentState STARTED

org.apache.kafka.connect.runtime.StateTrackerTest > currentState PASSED

org.apache.kafka.connect.runtime.StateTrackerTest > currentStateIsNullWhenNotInitialized STARTED

org.apache.kafka.connect.runtime.StateTrackerTest > currentStateIsNullWhenNotInitialized PASSED

org.apache.kafka.connect.runtime.AbstractHerderTest > taskStatus STARTED

org.apache.kafka.connect.runtime.AbstractHerderTest > taskStatus PASSED

org.apache.kafka.connect.runtime.AbstractHerderTest > connectorStatus STARTED

org.apache.kafka.connect.runtime.AbstractHerderTest > connectorStatus PASSED

org.apache.kafka.connect.runtime.AbstractHerderTest > testConfigValidationEmptyConfig STARTED

org.apache.kafka.connect.runtime.AbstractHerderTest > testConfigValidationEmptyConfig PASSED

org.apache.kafka.connect.runtime.AbstractHerderTest > testConfigValidationMissingName STARTED

org.apache.kafka.connect.runtime.AbstractHerderTest > testConfigValidationMissingName PASSED

org.apache.kafka.connect.runtime.AbstractHerderTest > testConfigValidationInvalidTopics STARTED

org.apache.kafka.connect.runtime.AbstractHerderTest > testConfigValidationInvalidTopics PASSED

org.apache.kafka.connect.runtime.AbstractHerderTest > testConfigValidationTransformsExtendResults STARTED

org.apache.kafka.connect.runtime.AbstractHerderTest > testConfigValidationTransformsExtendResults PASSED

org.apache.kafka.connect.runtime.AbstractHerderTest > testReverseTransformConfigs STARTED

org.apache.kafka.connect.runtime.AbstractHerderTest > testReverseTransformConfigs PASSED

382 tests completed, 1 failed

> Task :connect:runtime:test FAILED

> Task :log4j-appender:test

org.apache.kafka.log4jappender.KafkaLog4jAppenderTest > testLog4jAppendsWithSyncSendWithoutIgnoringExceptionsShouldNotThrowException STARTED
WARNING: An illegal reflective access operation has occurred
WARNING: Illegal reflective access by org.easymock.cglib.core.ReflectUtils$1 (file:/home/jenkins/.gradle/caches/modules-2/files-2.1/org.easymock/easymock/4.0.1/26f1c39bd323b6ac7fe0c4c8e33bfdffcdde03a2/easymock-4.0.1.jar) to method java.lang.ClassLoader.defineClass(java.lang.String,byte[],int,int,java.security.ProtectionDomain)
WARNING: Please consider reporting this to the maintainers of org.easymock.cglib.core.ReflectUtils$1
WARNING: Use --illegal-access=warn to enable warnings of further illegal reflective access operations
WARNING: All illegal access operations will be denied in a future release

org.apache.kafka.log4jappender.KafkaLog4jAppenderTest > testLog4jAppendsWithSyncSendWithoutIgnoringExceptionsShouldNotThrowException PASSED

org.apache.kafka.log4jappender.KafkaLog4jAppenderTest > testLog4jAppendsWithRealProducerConfigWithSyncSendAndNotIgnoringExceptionsShouldThrowException STARTED

org.apache.kafka.log4jappender.KafkaLog4jAppenderTest > testLog4jAppendsWithRealProducerConfigWithSyncSendAndNotIgnoringExceptionsShouldThrowException PASSED

org.apache.kafka.log4jappender.KafkaLog4jAppenderTest > testLog4jAppends STARTED

org.apache.kafka.log4jappender.KafkaLog4jAppenderTest > testLog4jAppends PASSED

org.apache.kafka.log4jappender.KafkaLog4jAppenderTest > testKafkaLog4jConfigs STARTED

org.apache.kafka.log4jappender.KafkaLog4jAppenderTest > testKafkaLog4jConfigs PASSED

org.apache.kafka.log4jappender.KafkaLog4jAppenderTest > testLog4jAppendsWithSyncSendAndSimulateProducerFailShouldThrowException STARTED

org.apache.kafka.log4jappender.KafkaLog4jAppenderTest > testLog4jAppendsWithSyncSendAndSimulateProducerFailShouldThrowException PASSED

org.apache.kafka.log4jappender.KafkaLog4jAppenderTest > testLog4jAppendsWithRealProducerConfigWithSyncSendShouldNotThrowException STARTED

org.apache.kafka.log4jappender.KafkaLog4jAppenderTest > testLog4jAppendsWithRealProducerConfigWithSyncSendShouldNotThrowException PASSED

FAILURE: Build failed with an exception.

* What went wrong:
Execution failed for task ':connect:runtime:test'.
> There were failing tests. See the report at: file://<https://builds.apache.org/job/kafka-trunk-jdk11/ws/connect/runtime/build/reports/tests/test/index.html>

* Try:
Run with --stacktrace option to get the stack trace. Run with --info or --debug option to get more log output. Run with --scan to get full insights.

* Get more help at https://help.gradle.org

Deprecated Gradle features were used in this build, making it incompatible with Gradle 6.0.
Use '--warning-mode all' to show the individual deprecation warnings.
See https://docs.gradle.org/5.0/userguide/command_line_interface.html#sec:command_line_warnings

BUILD FAILED in 2h 23m 4s
165 actionable tasks: 141 executed, 24 up-to-date
Build step 'Execute shell' marked build as failure
Recording test results
Setting GRADLE_4_10_2_HOME=/home/jenkins/tools/gradle/4.10.2
Setting GRADLE_4_10_2_HOME=/home/jenkins/tools/gradle/4.10.2
Not sending mail to unregistered user noreply@github.com
Not sending mail to unregistered user wangguoz@gmail.com