You are viewing a plain text version of this content. The canonical link for it is here.
Posted to notifications@qpid.apache.org by Apache Jenkins Server <je...@builds.apache.org> on 2025/04/24 03:22:28 UTC

Build failed in Jenkins: Qpid » Qpid-Broker-J-Checks » Apache Qpid Broker-J Protocol Tests Core #268

See <https://ci-builds.apache.org/job/Qpid/job/Qpid-Broker-J-Checks/org.apache.qpid$protocol-tests-core/268/display/redirect?page=changes>

Changes:

[github] QPID-8664: [Broker-J] Guava removal (10/10) (#276)


------------------------------------------
[INFO] 
[INFO] ------------------------------------------------------------------------
[INFO] Skipping Apache Qpid Broker-J System Test Utils
[INFO] This project has been banned from the build due to previous failures.
[INFO] ------------------------------------------------------------------------
[INFO] 
[INFO] ------------------------------------------------------------------------
[INFO] Skipping Apache Qpid Broker-J JMS System Tests Core
[INFO] This project has been banned from the build due to previous failures.
[INFO] ------------------------------------------------------------------------
[INFO] 
[INFO] ------------------------------------------------------------------------
[INFO] Skipping Apache Qpid Broker-J JMS 1.1 System Tests
[INFO] This project has been banned from the build due to previous failures.
[INFO] ------------------------------------------------------------------------
[INFO] 
[INFO] ------------------------------------------------------------------------
[INFO] Skipping Apache Qpid Broker-J JMS 2.0 System Tests
[INFO] This project has been banned from the build due to previous failures.
[INFO] ------------------------------------------------------------------------
[INFO] 
[INFO] ------------------------------------------------------------------------
[INFO] Skipping Apache Qpid Broker-J HTTP system tests
[INFO] This project has been banned from the build due to previous failures.
[INFO] ------------------------------------------------------------------------
[INFO] 
[INFO] ----------------< org.apache.qpid:protocol-tests-core >-----------------
[INFO] Building Apache Qpid Broker-J Protocol Tests Core 10.0.0-SNAPSHOT [6/52]
[INFO]   from systests/protocol-tests-core/pom.xml
[INFO] --------------------------------[ jar ]---------------------------------
[INFO] 
[INFO] --- clean:3.3.2:clean (default-clean) @ protocol-tests-core ---
[INFO] 
[INFO] --- apache-rat:0.16.1:check (default-cli) @ protocol-tests-core ---
[INFO] Rat check: Summary over all files. Unapproved: 0, unknown: 0, generated: 0, approved: 13 licenses.
[INFO] 
[INFO] --- buildnumber:3.2.1:create (default) @ protocol-tests-core ---
[INFO] Executing: /bin/sh -c cd '<https://ci-builds.apache.org/job/Qpid/job/Qpid-Broker-J-Checks/org.apache.qpid$protocol-tests-core/ws/'> && 'git' 'log' '-1' '--no-merges' '--format=format:%H %aI %aE %aN'
[INFO] Working directory: <https://ci-builds.apache.org/job/Qpid/job/Qpid-Broker-J-Checks/org.apache.qpid$protocol-tests-core/ws/>
[INFO] Storing buildNumber: 777dab25b11a2eb28fc9e4298046bd0cb7005d58 at timestamp: 1745464759318
[INFO] Executing: /bin/sh -c cd '<https://ci-builds.apache.org/job/Qpid/job/Qpid-Broker-J-Checks/org.apache.qpid$protocol-tests-core/ws/'> && 'git' 'symbolic-ref' 'HEAD'
[INFO] Working directory: <https://ci-builds.apache.org/job/Qpid/job/Qpid-Broker-J-Checks/org.apache.qpid$protocol-tests-core/ws/>
[WARNING] Cannot get the branch information from the git repository: 
Detecting the current branch failed: fatal: ref HEAD is not a symbolic ref

[INFO] Executing: /bin/sh -c cd '<https://ci-builds.apache.org/job/Qpid/job/Qpid-Broker-J-Checks/org.apache.qpid$protocol-tests-core/ws/'> && 'git' 'log' '-1' '--no-merges' '--format=format:%H %aI %aE %aN'
[INFO] Working directory: <https://ci-builds.apache.org/job/Qpid/job/Qpid-Broker-J-Checks/org.apache.qpid$protocol-tests-core/ws/>
[INFO] Storing scmBranch: UNKNOWN
[INFO] 
[INFO] --- antrun:3.1.0:run (output-test-properties) @ protocol-tests-core ---
[INFO] Executing tasks
[WARNING]      [echo] Qpid Test Profile Properties
[WARNING]      [echo] [profile] java-mms.1-0
[WARNING]      [echo] [profile.broker.version] 1.0
[WARNING]      [echo] [profile.virtualhostnode.type] Memory
[WARNING]      [echo] [profile.virtualhostnode.context.blueprint] {"type":"ProvidedStore","globalAddressDomains":"${qpid.globalAddressDomains}"}
[WARNING]      [echo] [profile.test_receive_timeout] 1000
[INFO] Executed tasks
[INFO] 
[INFO] --- enforcer:3.5.0:enforce (enforce-maven-version) @ protocol-tests-core ---
[INFO] Skipping Rule Enforcement.
[INFO] 
[INFO] --- enforcer:3.5.0:enforce (enforce-java-version) @ protocol-tests-core ---
[INFO] Skipping Rule Enforcement.
[INFO] 
[INFO] --- enforcer:3.5.0:enforce (enforce-minimum-versions) @ protocol-tests-core ---
[INFO] Skipping Rule Enforcement.
[INFO] 
[INFO] --- enforcer:3.5.0:enforce (enforce-versions-standard-properties) @ protocol-tests-core ---
[INFO] Skipping Rule Enforcement.
[INFO] 
[INFO] --- enforcer:3.5.0:enforce (enforce-enableAmqp0x) @ protocol-tests-core ---
[INFO] Skipping Rule Enforcement.
[INFO] 
[INFO] --- jacoco:0.8.12:prepare-agent (default-prepare-agent) @ protocol-tests-core ---
[INFO] Skipping JaCoCo execution because property jacoco.skip is set.
[INFO] 
[INFO] --- remote-resources:3.1.0:process (process-resource-bundles) @ protocol-tests-core ---
[INFO] Preparing remote bundle org.apache.apache.resources:apache-jar-resource-bundle:1.5
[INFO] Copying 3 resources from 1 bundle.
[INFO] 
[INFO] --- resources:3.3.1:resources (default-resources) @ protocol-tests-core ---
[INFO] skip non existing resourceDirectory <https://ci-builds.apache.org/job/Qpid/job/Qpid-Broker-J-Checks/org.apache.qpid$protocol-tests-core/ws/src/main/resources>
[INFO] Copying 3 resources from target/maven-shared-archive-resources to target/classes
[INFO] 
[INFO] --- compiler:3.13.0:compile (default-compile) @ protocol-tests-core ---
[INFO] Compiling 12 source files with javac [forked debug deprecation target 17] to target/classes
[INFO] -------------------------------------------------------------
[ERROR] COMPILATION ERROR : 
[INFO] -------------------------------------------------------------
[ERROR] error: invalid target release: 17
[INFO] 1 error
[INFO] -------------------------------------------------------------
[JENKINS] Archiving disabled

Build failed in Jenkins: Qpid » Qpid-Broker-J-Checks » Apache Qpid Broker-J Protocol Tests Core #269

Posted by Apache Jenkins Server <je...@builds.apache.org>.
See <https://ci-builds.apache.org/job/Qpid/job/Qpid-Broker-J-Checks/org.apache.qpid$protocol-tests-core/269/display/redirect>

Changes:


------------------------------------------
[INFO] 
[INFO] ------------------------------------------------------------------------
[INFO] Skipping Apache Qpid Broker-J System Test Utils
[INFO] This project has been banned from the build due to previous failures.
[INFO] ------------------------------------------------------------------------
[INFO] 
[INFO] ------------------------------------------------------------------------
[INFO] Skipping Apache Qpid Broker-J JMS System Tests Core
[INFO] This project has been banned from the build due to previous failures.
[INFO] ------------------------------------------------------------------------
[INFO] 
[INFO] ------------------------------------------------------------------------
[INFO] Skipping Apache Qpid Broker-J JMS 1.1 System Tests
[INFO] This project has been banned from the build due to previous failures.
[INFO] ------------------------------------------------------------------------
[INFO] 
[INFO] ------------------------------------------------------------------------
[INFO] Skipping Apache Qpid Broker-J JMS 2.0 System Tests
[INFO] This project has been banned from the build due to previous failures.
[INFO] ------------------------------------------------------------------------
[INFO] 
[INFO] ------------------------------------------------------------------------
[INFO] Skipping Apache Qpid Broker-J HTTP system tests
[INFO] This project has been banned from the build due to previous failures.
[INFO] ------------------------------------------------------------------------
[INFO] 
[INFO] ----------------< org.apache.qpid:protocol-tests-core >-----------------
[INFO] Building Apache Qpid Broker-J Protocol Tests Core 10.0.0-SNAPSHOT [6/52]
[INFO]   from systests/protocol-tests-core/pom.xml
[INFO] --------------------------------[ jar ]---------------------------------
[INFO] 
[INFO] --- clean:3.3.2:clean (default-clean) @ protocol-tests-core ---
[INFO] 
[INFO] --- apache-rat:0.16.1:check (default-cli) @ protocol-tests-core ---
[INFO] Rat check: Summary over all files. Unapproved: 0, unknown: 0, generated: 0, approved: 13 licenses.
[INFO] 
[INFO] --- buildnumber:3.2.1:create (default) @ protocol-tests-core ---
[INFO] Executing: /bin/sh -c cd '<https://ci-builds.apache.org/job/Qpid/job/Qpid-Broker-J-Checks/org.apache.qpid$protocol-tests-core/ws/'> && 'git' 'log' '-1' '--no-merges' '--format=format:%H %aI %aE %aN'
[INFO] Working directory: <https://ci-builds.apache.org/job/Qpid/job/Qpid-Broker-J-Checks/org.apache.qpid$protocol-tests-core/ws/>
[INFO] Storing buildNumber: 97ddef8de909d4b595173081f8c19487689886ed at timestamp: 1745551150263
[INFO] Executing: /bin/sh -c cd '<https://ci-builds.apache.org/job/Qpid/job/Qpid-Broker-J-Checks/org.apache.qpid$protocol-tests-core/ws/'> && 'git' 'symbolic-ref' 'HEAD'
[INFO] Working directory: <https://ci-builds.apache.org/job/Qpid/job/Qpid-Broker-J-Checks/org.apache.qpid$protocol-tests-core/ws/>
[WARNING] Cannot get the branch information from the git repository: 
Detecting the current branch failed: fatal: ref HEAD is not a symbolic ref

[INFO] Executing: /bin/sh -c cd '<https://ci-builds.apache.org/job/Qpid/job/Qpid-Broker-J-Checks/org.apache.qpid$protocol-tests-core/ws/'> && 'git' 'log' '-1' '--no-merges' '--format=format:%H %aI %aE %aN'
[INFO] Working directory: <https://ci-builds.apache.org/job/Qpid/job/Qpid-Broker-J-Checks/org.apache.qpid$protocol-tests-core/ws/>
[INFO] Storing scmBranch: UNKNOWN
[INFO] 
[INFO] --- antrun:3.1.0:run (output-test-properties) @ protocol-tests-core ---
[INFO] Executing tasks
[WARNING]      [echo] Qpid Test Profile Properties
[WARNING]      [echo] [profile] java-mms.1-0
[WARNING]      [echo] [profile.broker.version] 1.0
[WARNING]      [echo] [profile.virtualhostnode.type] Memory
[WARNING]      [echo] [profile.virtualhostnode.context.blueprint] {"type":"ProvidedStore","globalAddressDomains":"${qpid.globalAddressDomains}"}
[WARNING]      [echo] [profile.test_receive_timeout] 1000
[INFO] Executed tasks
[INFO] 
[INFO] --- enforcer:3.5.0:enforce (enforce-maven-version) @ protocol-tests-core ---
[INFO] Skipping Rule Enforcement.
[INFO] 
[INFO] --- enforcer:3.5.0:enforce (enforce-java-version) @ protocol-tests-core ---
[INFO] Skipping Rule Enforcement.
[INFO] 
[INFO] --- enforcer:3.5.0:enforce (enforce-minimum-versions) @ protocol-tests-core ---
[INFO] Skipping Rule Enforcement.
[INFO] 
[INFO] --- enforcer:3.5.0:enforce (enforce-versions-standard-properties) @ protocol-tests-core ---
[INFO] Skipping Rule Enforcement.
[INFO] 
[INFO] --- enforcer:3.5.0:enforce (enforce-enableAmqp0x) @ protocol-tests-core ---
[INFO] Skipping Rule Enforcement.
[INFO] 
[INFO] --- jacoco:0.8.12:prepare-agent (default-prepare-agent) @ protocol-tests-core ---
[INFO] Skipping JaCoCo execution because property jacoco.skip is set.
[INFO] 
[INFO] --- remote-resources:3.1.0:process (process-resource-bundles) @ protocol-tests-core ---
[INFO] Preparing remote bundle org.apache.apache.resources:apache-jar-resource-bundle:1.5
[INFO] Copying 3 resources from 1 bundle.
[INFO] 
[INFO] --- resources:3.3.1:resources (default-resources) @ protocol-tests-core ---
[INFO] skip non existing resourceDirectory <https://ci-builds.apache.org/job/Qpid/job/Qpid-Broker-J-Checks/org.apache.qpid$protocol-tests-core/ws/src/main/resources>
[INFO] Copying 3 resources from target/maven-shared-archive-resources to target/classes
[INFO] 
[INFO] --- compiler:3.13.0:compile (default-compile) @ protocol-tests-core ---
[INFO] Compiling 12 source files with javac [forked debug deprecation target 17] to target/classes
[INFO] -------------------------------------------------------------
[ERROR] COMPILATION ERROR : 
[INFO] -------------------------------------------------------------
[ERROR] error: invalid target release: 17
[INFO] 1 error
[INFO] -------------------------------------------------------------
[JENKINS] Archiving disabled