You are viewing a plain text version of this content. The canonical link for it is here.
Posted to dev@lucene.apache.org by Policeman Jenkins Server <je...@thetaphi.de> on 2017/09/17 07:23:26 UTC

[JENKINS] Lucene-Solr-7.x-Solaris (64bit/jdk1.8.0) - Build # 187 - Still Unstable!

Build: https://jenkins.thetaphi.de/job/Lucene-Solr-7.x-Solaris/187/
Java: 64bit/jdk1.8.0 -XX:+UseCompressedOops -XX:+UseConcMarkSweepGC

2 tests failed.
FAILED:  org.apache.solr.cloud.TestAuthenticationFramework.testBasics

Error Message:
Error from server at http://127.0.0.1:51193/solr/testcollection_shard1_replica_n3: Expected mime type application/octet-stream but got text/html. <html> <head> <meta http-equiv="Content-Type" content="text/html;charset=ISO-8859-1"/> <title>Error 404 </title> </head> <body> <h2>HTTP ERROR: 404</h2> <p>Problem accessing /solr/testcollection_shard1_replica_n3/update. Reason: <pre>    Can not find: /solr/testcollection_shard1_replica_n3/update</pre></p> <hr /><a href="http://eclipse.org/jetty">Powered by Jetty:// 9.3.20.v20170531</a><hr/> </body> </html> 

Stack Trace:
org.apache.solr.client.solrj.impl.CloudSolrClient$RouteException: Error from server at http://127.0.0.1:51193/solr/testcollection_shard1_replica_n3: Expected mime type application/octet-stream but got text/html. <html>
<head>
<meta http-equiv="Content-Type" content="text/html;charset=ISO-8859-1"/>
<title>Error 404 </title>
</head>
<body>
<h2>HTTP ERROR: 404</h2>
<p>Problem accessing /solr/testcollection_shard1_replica_n3/update. Reason:
<pre>    Can not find: /solr/testcollection_shard1_replica_n3/update</pre></p>
<hr /><a href="http://eclipse.org/jetty">Powered by Jetty:// 9.3.20.v20170531</a><hr/>
</body>
</html>

	at __randomizedtesting.SeedInfo.seed([C40CD8A653B12A21:F9D4768A6B5F7451]:0)
	at org.apache.solr.client.solrj.impl.CloudSolrClient.directUpdate(CloudSolrClient.java:539)
	at org.apache.solr.client.solrj.impl.CloudSolrClient.sendRequest(CloudSolrClient.java:993)
	at org.apache.solr.client.solrj.impl.CloudSolrClient.requestWithRetryOnStaleState(CloudSolrClient.java:862)
	at org.apache.solr.client.solrj.impl.CloudSolrClient.request(CloudSolrClient.java:793)
	at org.apache.solr.client.solrj.SolrRequest.process(SolrRequest.java:178)
	at org.apache.solr.client.solrj.request.UpdateRequest.commit(UpdateRequest.java:233)
	at org.apache.solr.cloud.TestAuthenticationFramework.collectionCreateSearchDeleteTwice(TestAuthenticationFramework.java:126)
	at org.apache.solr.cloud.TestAuthenticationFramework.testBasics(TestAuthenticationFramework.java:74)
	at sun.reflect.NativeMethodAccessorImpl.invoke0(Native Method)
	at sun.reflect.NativeMethodAccessorImpl.invoke(NativeMethodAccessorImpl.java:62)
	at sun.reflect.DelegatingMethodAccessorImpl.invoke(DelegatingMethodAccessorImpl.java:43)
	at java.lang.reflect.Method.invoke(Method.java:498)
	at com.carrotsearch.randomizedtesting.RandomizedRunner.invoke(RandomizedRunner.java:1737)
	at com.carrotsearch.randomizedtesting.RandomizedRunner$8.evaluate(RandomizedRunner.java:934)
	at com.carrotsearch.randomizedtesting.RandomizedRunner$9.evaluate(RandomizedRunner.java:970)
	at com.carrotsearch.randomizedtesting.RandomizedRunner$10.evaluate(RandomizedRunner.java:984)
	at com.carrotsearch.randomizedtesting.rules.SystemPropertiesRestoreRule$1.evaluate(SystemPropertiesRestoreRule.java:57)
	at org.apache.lucene.util.TestRuleSetupTeardownChained$1.evaluate(TestRuleSetupTeardownChained.java:49)
	at org.apache.lucene.util.AbstractBeforeAfterRule$1.evaluate(AbstractBeforeAfterRule.java:45)
	at org.apache.lucene.util.TestRuleThreadAndTestName$1.evaluate(TestRuleThreadAndTestName.java:48)
	at org.apache.lucene.util.TestRuleIgnoreAfterMaxFailures$1.evaluate(TestRuleIgnoreAfterMaxFailures.java:64)
	at org.apache.lucene.util.TestRuleMarkFailure$1.evaluate(TestRuleMarkFailure.java:47)
	at com.carrotsearch.randomizedtesting.rules.StatementAdapter.evaluate(StatementAdapter.java:36)
	at com.carrotsearch.randomizedtesting.ThreadLeakControl$StatementRunner.run(ThreadLeakControl.java:368)
	at com.carrotsearch.randomizedtesting.ThreadLeakControl.forkTimeoutingTask(ThreadLeakControl.java:817)
	at com.carrotsearch.randomizedtesting.ThreadLeakControl$3.evaluate(ThreadLeakControl.java:468)
	at com.carrotsearch.randomizedtesting.RandomizedRunner.runSingleTest(RandomizedRunner.java:943)
	at com.carrotsearch.randomizedtesting.RandomizedRunner$5.evaluate(RandomizedRunner.java:829)
	at com.carrotsearch.randomizedtesting.RandomizedRunner$6.evaluate(RandomizedRunner.java:879)
	at com.carrotsearch.randomizedtesting.RandomizedRunner$7.evaluate(RandomizedRunner.java:890)
	at com.carrotsearch.randomizedtesting.rules.StatementAdapter.evaluate(StatementAdapter.java:36)
	at com.carrotsearch.randomizedtesting.rules.SystemPropertiesRestoreRule$1.evaluate(SystemPropertiesRestoreRule.java:57)
	at org.apache.lucene.util.AbstractBeforeAfterRule$1.evaluate(AbstractBeforeAfterRule.java:45)
	at com.carrotsearch.randomizedtesting.rules.StatementAdapter.evaluate(StatementAdapter.java:36)
	at org.apache.lucene.util.TestRuleStoreClassName$1.evaluate(TestRuleStoreClassName.java:41)
	at com.carrotsearch.randomizedtesting.rules.NoShadowingOrOverridesOnMethodsRule$1.evaluate(NoShadowingOrOverridesOnMethodsRule.java:40)
	at com.carrotsearch.randomizedtesting.rules.NoShadowingOrOverridesOnMethodsRule$1.evaluate(NoShadowingOrOverridesOnMethodsRule.java:40)
	at com.carrotsearch.randomizedtesting.rules.StatementAdapter.evaluate(StatementAdapter.java:36)
	at com.carrotsearch.randomizedtesting.rules.StatementAdapter.evaluate(StatementAdapter.java:36)
	at com.carrotsearch.randomizedtesting.rules.StatementAdapter.evaluate(StatementAdapter.java:36)
	at org.apache.lucene.util.TestRuleAssertionsRequired$1.evaluate(TestRuleAssertionsRequired.java:53)
	at org.apache.lucene.util.TestRuleMarkFailure$1.evaluate(TestRuleMarkFailure.java:47)
	at org.apache.lucene.util.TestRuleIgnoreAfterMaxFailures$1.evaluate(TestRuleIgnoreAfterMaxFailures.java:64)
	at org.apache.lucene.util.TestRuleIgnoreTestSuites$1.evaluate(TestRuleIgnoreTestSuites.java:54)
	at com.carrotsearch.randomizedtesting.rules.StatementAdapter.evaluate(StatementAdapter.java:36)
	at com.carrotsearch.randomizedtesting.ThreadLeakControl$StatementRunner.run(ThreadLeakControl.java:368)
	at java.lang.Thread.run(Thread.java:748)
Caused by: org.apache.solr.client.solrj.impl.HttpSolrClient$RemoteSolrException: Error from server at http://127.0.0.1:51193/solr/testcollection_shard1_replica_n3: Expected mime type application/octet-stream but got text/html. <html>
<head>
<meta http-equiv="Content-Type" content="text/html;charset=ISO-8859-1"/>
<title>Error 404 </title>
</head>
<body>
<h2>HTTP ERROR: 404</h2>
<p>Problem accessing /solr/testcollection_shard1_replica_n3/update. Reason:
<pre>    Can not find: /solr/testcollection_shard1_replica_n3/update</pre></p>
<hr /><a href="http://eclipse.org/jetty">Powered by Jetty:// 9.3.20.v20170531</a><hr/>
</body>
</html>

	at org.apache.solr.client.solrj.impl.HttpSolrClient.executeMethod(HttpSolrClient.java:591)
	at org.apache.solr.client.solrj.impl.HttpSolrClient.request(HttpSolrClient.java:253)
	at org.apache.solr.client.solrj.impl.HttpSolrClient.request(HttpSolrClient.java:242)
	at org.apache.solr.client.solrj.impl.LBHttpSolrClient.doRequest(LBHttpSolrClient.java:483)
	at org.apache.solr.client.solrj.impl.LBHttpSolrClient.request(LBHttpSolrClient.java:413)
	at org.apache.solr.client.solrj.impl.CloudSolrClient.lambda$directUpdate$0(CloudSolrClient.java:516)
	at java.util.concurrent.FutureTask.run(FutureTask.java:266)
	at org.apache.solr.common.util.ExecutorUtil$MDCAwareThreadPoolExecutor.lambda$execute$0(ExecutorUtil.java:188)
	at java.util.concurrent.ThreadPoolExecutor.runWorker(ThreadPoolExecutor.java:1149)
	at java.util.concurrent.ThreadPoolExecutor$Worker.run(ThreadPoolExecutor.java:624)
	... 1 more


FAILED:  org.apache.solr.client.solrj.io.stream.StreamExpressionTest.testPoissonDistribution

Error Message:
expected:<99.9817> but was:<96.92565767576801>

Stack Trace:
java.lang.AssertionError: expected:<99.9817> but was:<96.92565767576801>
	at __randomizedtesting.SeedInfo.seed([41088374A0026D27:D9187CD502BB155B]:0)
	at org.junit.Assert.fail(Assert.java:93)
	at org.junit.Assert.failNotEquals(Assert.java:647)
	at org.junit.Assert.assertEquals(Assert.java:443)
	at org.junit.Assert.assertEquals(Assert.java:512)
	at org.apache.solr.client.solrj.io.stream.StreamExpressionTest.testPoissonDistribution(StreamExpressionTest.java:6318)
	at sun.reflect.NativeMethodAccessorImpl.invoke0(Native Method)
	at sun.reflect.NativeMethodAccessorImpl.invoke(NativeMethodAccessorImpl.java:62)
	at sun.reflect.DelegatingMethodAccessorImpl.invoke(DelegatingMethodAccessorImpl.java:43)
	at java.lang.reflect.Method.invoke(Method.java:498)
	at com.carrotsearch.randomizedtesting.RandomizedRunner.invoke(RandomizedRunner.java:1737)
	at com.carrotsearch.randomizedtesting.RandomizedRunner$8.evaluate(RandomizedRunner.java:934)
	at com.carrotsearch.randomizedtesting.RandomizedRunner$9.evaluate(RandomizedRunner.java:970)
	at com.carrotsearch.randomizedtesting.RandomizedRunner$10.evaluate(RandomizedRunner.java:984)
	at com.carrotsearch.randomizedtesting.rules.SystemPropertiesRestoreRule$1.evaluate(SystemPropertiesRestoreRule.java:57)
	at org.apache.lucene.util.TestRuleSetupTeardownChained$1.evaluate(TestRuleSetupTeardownChained.java:49)
	at org.apache.lucene.util.AbstractBeforeAfterRule$1.evaluate(AbstractBeforeAfterRule.java:45)
	at org.apache.lucene.util.TestRuleThreadAndTestName$1.evaluate(TestRuleThreadAndTestName.java:48)
	at org.apache.lucene.util.TestRuleIgnoreAfterMaxFailures$1.evaluate(TestRuleIgnoreAfterMaxFailures.java:64)
	at org.apache.lucene.util.TestRuleMarkFailure$1.evaluate(TestRuleMarkFailure.java:47)
	at com.carrotsearch.randomizedtesting.rules.StatementAdapter.evaluate(StatementAdapter.java:36)
	at com.carrotsearch.randomizedtesting.ThreadLeakControl$StatementRunner.run(ThreadLeakControl.java:368)
	at com.carrotsearch.randomizedtesting.ThreadLeakControl.forkTimeoutingTask(ThreadLeakControl.java:817)
	at com.carrotsearch.randomizedtesting.ThreadLeakControl$3.evaluate(ThreadLeakControl.java:468)
	at com.carrotsearch.randomizedtesting.RandomizedRunner.runSingleTest(RandomizedRunner.java:943)
	at com.carrotsearch.randomizedtesting.RandomizedRunner$5.evaluate(RandomizedRunner.java:829)
	at com.carrotsearch.randomizedtesting.RandomizedRunner$6.evaluate(RandomizedRunner.java:879)
	at com.carrotsearch.randomizedtesting.RandomizedRunner$7.evaluate(RandomizedRunner.java:890)
	at com.carrotsearch.randomizedtesting.rules.StatementAdapter.evaluate(StatementAdapter.java:36)
	at com.carrotsearch.randomizedtesting.rules.SystemPropertiesRestoreRule$1.evaluate(SystemPropertiesRestoreRule.java:57)
	at org.apache.lucene.util.AbstractBeforeAfterRule$1.evaluate(AbstractBeforeAfterRule.java:45)
	at com.carrotsearch.randomizedtesting.rules.StatementAdapter.evaluate(StatementAdapter.java:36)
	at org.apache.lucene.util.TestRuleStoreClassName$1.evaluate(TestRuleStoreClassName.java:41)
	at com.carrotsearch.randomizedtesting.rules.NoShadowingOrOverridesOnMethodsRule$1.evaluate(NoShadowingOrOverridesOnMethodsRule.java:40)
	at com.carrotsearch.randomizedtesting.rules.NoShadowingOrOverridesOnMethodsRule$1.evaluate(NoShadowingOrOverridesOnMethodsRule.java:40)
	at com.carrotsearch.randomizedtesting.rules.StatementAdapter.evaluate(StatementAdapter.java:36)
	at com.carrotsearch.randomizedtesting.rules.StatementAdapter.evaluate(StatementAdapter.java:36)
	at com.carrotsearch.randomizedtesting.rules.StatementAdapter.evaluate(StatementAdapter.java:36)
	at org.apache.lucene.util.TestRuleAssertionsRequired$1.evaluate(TestRuleAssertionsRequired.java:53)
	at org.apache.lucene.util.TestRuleMarkFailure$1.evaluate(TestRuleMarkFailure.java:47)
	at org.apache.lucene.util.TestRuleIgnoreAfterMaxFailures$1.evaluate(TestRuleIgnoreAfterMaxFailures.java:64)
	at org.apache.lucene.util.TestRuleIgnoreTestSuites$1.evaluate(TestRuleIgnoreTestSuites.java:54)
	at com.carrotsearch.randomizedtesting.rules.StatementAdapter.evaluate(StatementAdapter.java:36)
	at com.carrotsearch.randomizedtesting.ThreadLeakControl$StatementRunner.run(ThreadLeakControl.java:368)
	at java.lang.Thread.run(Thread.java:748)




Build Log:
[...truncated 12845 lines...]
   [junit4] Suite: org.apache.solr.cloud.TestAuthenticationFramework
   [junit4]   2> Creating dataDir: /export/home/jenkins/workspace/Lucene-Solr-7.x-Solaris/solr/build/solr-core/test/J1/temp/solr.cloud.TestAuthenticationFramework_C40CD8A653B12A21-001/init-core-data-001
   [junit4]   2> 3064008 INFO  (SUITE-TestAuthenticationFramework-seed#[C40CD8A653B12A21]-worker) [    ] o.a.s.SolrTestCaseJ4 Using PointFields (NUMERIC_POINTS_SYSPROP=true) w/NUMERIC_DOCVALUES_SYSPROP=true
   [junit4]   2> 3064010 INFO  (SUITE-TestAuthenticationFramework-seed#[C40CD8A653B12A21]-worker) [    ] o.a.s.SolrTestCaseJ4 Randomized ssl (false) and clientAuth (false) via: @org.apache.solr.util.RandomizeSSL(reason=, value=NaN, ssl=NaN, clientAuth=NaN)
   [junit4]   2> 3064010 INFO  (SUITE-TestAuthenticationFramework-seed#[C40CD8A653B12A21]-worker) [    ] o.a.s.SolrTestCaseJ4 SecureRandom sanity checks: test.solr.allowed.securerandom=null & java.security.egd=file:/dev/./urandom
   [junit4]   2> 3064013 INFO  (TEST-TestAuthenticationFramework.testBasics-seed#[C40CD8A653B12A21]) [    ] o.a.s.c.MiniSolrCloudCluster Starting cluster of 2 servers in /export/home/jenkins/workspace/Lucene-Solr-7.x-Solaris/solr/build/solr-core/test/J1/temp/solr.cloud.TestAuthenticationFramework_C40CD8A653B12A21-001/tempDir-001
   [junit4]   2> 3064013 INFO  (TEST-TestAuthenticationFramework.testBasics-seed#[C40CD8A653B12A21]) [    ] o.a.s.c.ZkTestServer STARTING ZK TEST SERVER
   [junit4]   2> 3064013 INFO  (Thread-4823) [    ] o.a.s.c.ZkTestServer client port:0.0.0.0/0.0.0.0:0
   [junit4]   2> 3064013 INFO  (Thread-4823) [    ] o.a.s.c.ZkTestServer Starting server
   [junit4]   2> 3064016 ERROR (Thread-4823) [    ] o.a.z.s.ZooKeeperServer ZKShutdownHandler is not registered, so ZooKeeper server won't take any action on ERROR or SHUTDOWN server state changes
   [junit4]   2> 3064113 INFO  (TEST-TestAuthenticationFramework.testBasics-seed#[C40CD8A653B12A21]) [    ] o.a.s.c.ZkTestServer start zk server on port:62513
   [junit4]   2> 3064121 INFO  (jetty-launcher-5028-thread-1) [    ] o.e.j.s.Server jetty-9.3.20.v20170531
   [junit4]   2> 3064121 INFO  (jetty-launcher-5028-thread-2) [    ] o.e.j.s.Server jetty-9.3.20.v20170531
   [junit4]   2> 3064124 INFO  (jetty-launcher-5028-thread-1) [    ] o.e.j.s.h.ContextHandler Started o.e.j.s.ServletContextHandler@18b32334{/solr,null,AVAILABLE}
   [junit4]   2> 3064124 INFO  (jetty-launcher-5028-thread-2) [    ] o.e.j.s.h.ContextHandler Started o.e.j.s.ServletContextHandler@2202461e{/solr,null,AVAILABLE}
   [junit4]   2> 3064127 INFO  (jetty-launcher-5028-thread-2) [    ] o.e.j.s.AbstractConnector Started ServerConnector@37b537de{HTTP/1.1,[http/1.1]}{127.0.0.1:40797}
   [junit4]   2> 3064127 INFO  (jetty-launcher-5028-thread-2) [    ] o.e.j.s.Server Started @3067218ms
   [junit4]   2> 3064128 INFO  (jetty-launcher-5028-thread-2) [    ] o.a.s.c.s.e.JettySolrRunner Jetty properties: {hostContext=/solr, hostPort=40797}
   [junit4]   2> 3064128 INFO  (jetty-launcher-5028-thread-1) [    ] o.e.j.s.AbstractConnector Started ServerConnector@38e51ebc{HTTP/1.1,[http/1.1]}{127.0.0.1:51193}
   [junit4]   2> 3064128 ERROR (jetty-launcher-5028-thread-2) [    ] o.a.s.u.StartupLoggingUtils Missing Java Option solr.log.dir. Logging may be missing or incomplete.
   [junit4]   2> 3064128 INFO  (jetty-launcher-5028-thread-1) [    ] o.e.j.s.Server Started @3067218ms
   [junit4]   2> 3064128 INFO  (jetty-launcher-5028-thread-2) [    ] o.a.s.s.SolrDispatchFilter  ___      _       Welcome to Apache Solr™ version 7.1.0
   [junit4]   2> 3064128 INFO  (jetty-launcher-5028-thread-1) [    ] o.a.s.c.s.e.JettySolrRunner Jetty properties: {hostContext=/solr, hostPort=51193}
   [junit4]   2> 3064128 INFO  (jetty-launcher-5028-thread-2) [    ] o.a.s.s.SolrDispatchFilter / __| ___| |_ _   Starting in cloud mode on port null
   [junit4]   2> 3064128 INFO  (jetty-launcher-5028-thread-2) [    ] o.a.s.s.SolrDispatchFilter \__ \/ _ \ | '_|  Install dir: null, Default config dir: null
   [junit4]   2> 3064128 INFO  (jetty-launcher-5028-thread-2) [    ] o.a.s.s.SolrDispatchFilter |___/\___/_|_|    Start time: 2017-09-17T06:47:24.858Z
   [junit4]   2> 3064128 ERROR (jetty-launcher-5028-thread-1) [    ] o.a.s.u.StartupLoggingUtils Missing Java Option solr.log.dir. Logging may be missing or incomplete.
   [junit4]   2> 3064129 INFO  (jetty-launcher-5028-thread-1) [    ] o.a.s.s.SolrDispatchFilter  ___      _       Welcome to Apache Solr™ version 7.1.0
   [junit4]   2> 3064129 INFO  (jetty-launcher-5028-thread-1) [    ] o.a.s.s.SolrDispatchFilter / __| ___| |_ _   Starting in cloud mode on port null
   [junit4]   2> 3064129 INFO  (jetty-launcher-5028-thread-1) [    ] o.a.s.s.SolrDispatchFilter \__ \/ _ \ | '_|  Install dir: null, Default config dir: null
   [junit4]   2> 3064129 INFO  (jetty-launcher-5028-thread-1) [    ] o.a.s.s.SolrDispatchFilter |___/\___/_|_|    Start time: 2017-09-17T06:47:24.859Z
   [junit4]   2> 3064139 INFO  (jetty-launcher-5028-thread-2) [    ] o.a.s.s.SolrDispatchFilter solr.xml found in ZooKeeper. Loading...
   [junit4]   2> 3064140 INFO  (jetty-launcher-5028-thread-1) [    ] o.a.s.s.SolrDispatchFilter solr.xml found in ZooKeeper. Loading...
   [junit4]   2> 3064159 INFO  (jetty-launcher-5028-thread-2) [    ] o.a.s.c.ZkContainer Zookeeper client=127.0.0.1:62513/solr
   [junit4]   2> 3064159 INFO  (jetty-launcher-5028-thread-1) [    ] o.a.s.c.ZkContainer Zookeeper client=127.0.0.1:62513/solr
   [junit4]   2> 3064419 INFO  (jetty-launcher-5028-thread-1) [n:127.0.0.1:51193_solr    ] o.a.s.c.Overseer Overseer (id=null) closing
   [junit4]   2> 3064420 INFO  (jetty-launcher-5028-thread-1) [n:127.0.0.1:51193_solr    ] o.a.s.c.OverseerElectionContext I am going to be the leader 127.0.0.1:51193_solr
   [junit4]   2> 3064423 INFO  (jetty-launcher-5028-thread-2) [n:127.0.0.1:40797_solr    ] o.a.s.c.Overseer Overseer (id=null) closing
   [junit4]   2> 3064423 INFO  (jetty-launcher-5028-thread-1) [n:127.0.0.1:51193_solr    ] o.a.s.c.Overseer Overseer (id=98673023041208325-127.0.0.1:51193_solr-n_0000000000) starting
   [junit4]   2> 3064429 INFO  (jetty-launcher-5028-thread-2) [n:127.0.0.1:40797_solr    ] o.a.s.c.ZkController Register node as live in ZooKeeper:/live_nodes/127.0.0.1:40797_solr
   [junit4]   2> 3064434 INFO  (zkCallback-5040-thread-1-processing-n:127.0.0.1:51193_solr) [n:127.0.0.1:51193_solr    ] o.a.s.c.c.ZkStateReader Updated live nodes from ZooKeeper... (0) -> (1)
   [junit4]   2> 3064437 INFO  (zkCallback-5039-thread-1-processing-n:127.0.0.1:40797_solr) [n:127.0.0.1:40797_solr    ] o.a.s.c.c.ZkStateReader Updated live nodes from ZooKeeper... (0) -> (1)
   [junit4]   2> 3064457 INFO  (jetty-launcher-5028-thread-1) [n:127.0.0.1:51193_solr    ] o.a.s.c.ZkController Register node as live in ZooKeeper:/live_nodes/127.0.0.1:51193_solr
   [junit4]   2> 3064460 INFO  (zkCallback-5040-thread-1-processing-n:127.0.0.1:51193_solr) [n:127.0.0.1:51193_solr    ] o.a.s.c.c.ZkStateReader Updated live nodes from ZooKeeper... (1) -> (2)
   [junit4]   2> 3064474 INFO  (jetty-launcher-5028-thread-2) [n:127.0.0.1:40797_solr    ] o.a.s.c.CoreContainer Initializing authentication plugin: org.apache.solr.cloud.TestAuthenticationFramework$MockAuthenticationPlugin
   [junit4]   2> 3064519 INFO  (jetty-launcher-5028-thread-2) [n:127.0.0.1:40797_solr    ] o.a.s.m.r.SolrJmxReporter JMX monitoring for 'solr_40797.solr.node' (registry 'solr.node') enabled at server: com.sun.jmx.mbeanserver.JmxMBeanServer@3a49a450
   [junit4]   2> 3064526 INFO  (jetty-launcher-5028-thread-2) [n:127.0.0.1:40797_solr    ] o.a.s.m.r.SolrJmxReporter JMX monitoring for 'solr_40797.solr.jvm' (registry 'solr.jvm') enabled at server: com.sun.jmx.mbeanserver.JmxMBeanServer@3a49a450
   [junit4]   2> 3064526 INFO  (jetty-launcher-5028-thread-2) [n:127.0.0.1:40797_solr    ] o.a.s.m.r.SolrJmxReporter JMX monitoring for 'solr_40797.solr.jetty' (registry 'solr.jetty') enabled at server: com.sun.jmx.mbeanserver.JmxMBeanServer@3a49a450
   [junit4]   2> 3064527 INFO  (jetty-launcher-5028-thread-2) [n:127.0.0.1:40797_solr    ] o.a.s.c.CorePropertiesLocator Found 0 core definitions underneath /export/home/jenkins/workspace/Lucene-Solr-7.x-Solaris/solr/build/solr-core/test/J1/temp/solr.cloud.TestAuthenticationFramework_C40CD8A653B12A21-001/tempDir-001/node2/.
   [junit4]   2> 3064528 INFO  (zkCallback-5039-thread-1-processing-n:127.0.0.1:40797_solr) [n:127.0.0.1:40797_solr    ] o.a.s.c.c.ZkStateReader Updated live nodes from ZooKeeper... (1) -> (2)
   [junit4]   2> 3064588 INFO  (jetty-launcher-5028-thread-1) [n:127.0.0.1:51193_solr    ] o.a.s.c.CoreContainer Initializing authentication plugin: org.apache.solr.cloud.TestAuthenticationFramework$MockAuthenticationPlugin
   [junit4]   2> 3064626 INFO  (jetty-launcher-5028-thread-1) [n:127.0.0.1:51193_solr    ] o.a.s.m.r.SolrJmxReporter JMX monitoring for 'solr_51193.solr.node' (registry 'solr.node') enabled at server: com.sun.jmx.mbeanserver.JmxMBeanServer@3a49a450
   [junit4]   2> 3064634 INFO  (jetty-launcher-5028-thread-1) [n:127.0.0.1:51193_solr    ] o.a.s.m.r.SolrJmxReporter JMX monitoring for 'solr_51193.solr.jvm' (registry 'solr.jvm') enabled at server: com.sun.jmx.mbeanserver.JmxMBeanServer@3a49a450
   [junit4]   2> 3064635 INFO  (jetty-launcher-5028-thread-1) [n:127.0.0.1:51193_solr    ] o.a.s.m.r.SolrJmxReporter JMX monitoring for 'solr_51193.solr.jetty' (registry 'solr.jetty') enabled at server: com.sun.jmx.mbeanserver.JmxMBeanServer@3a49a450
   [junit4]   2> 3064636 INFO  (jetty-launcher-5028-thread-1) [n:127.0.0.1:51193_solr    ] o.a.s.c.CorePropertiesLocator Found 0 core definitions underneath /export/home/jenkins/workspace/Lucene-Solr-7.x-Solaris/solr/build/solr-core/test/J1/temp/solr.cloud.TestAuthenticationFramework_C40CD8A653B12A21-001/tempDir-001/node1/.
   [junit4]   2> 3064665 WARN  (NIOServerCxn.Factory:0.0.0.0/0.0.0.0:0) [    ] o.a.z.s.NIOServerCnxn caught end of stream exception
   [junit4]   2> EndOfStreamException: Unable to read additional data from client sessionid 0x15e8e9777490007, likely client has closed socket
   [junit4]   2> 	at org.apache.zookeeper.server.NIOServerCnxn.doIO(NIOServerCnxn.java:239)
   [junit4]   2> 	at org.apache.zookeeper.server.NIOServerCnxnFactory.run(NIOServerCnxnFactory.java:203)
   [junit4]   2> 	at java.lang.Thread.run(Thread.java:748)
   [junit4]   2> 3064685 INFO  (TEST-TestAuthenticationFramework.testBasics-seed#[C40CD8A653B12A21]) [    ] o.a.s.c.c.ZkStateReader Updated live nodes from ZooKeeper... (0) -> (2)
   [junit4]   2> 3064686 INFO  (TEST-TestAuthenticationFramework.testBasics-seed#[C40CD8A653B12A21]) [    ] o.a.s.c.s.i.ZkClientClusterStateProvider Cluster at 127.0.0.1:62513/solr ready
   [junit4]   2> 3064691 INFO  (TEST-TestAuthenticationFramework.testBasics-seed#[C40CD8A653B12A21]) [    ] o.a.s.SolrTestCaseJ4 ###Starting testBasics
   [junit4]   2> 3064694 INFO  (qtp1235440196-24195) [n:127.0.0.1:51193_solr    ] o.a.s.h.a.CollectionsHandler Invoked Collection Action :create with params replicationFactor=2&collection.configName=solrCloudCollectionConfig&maxShardsPerNode=2&name=testcollection&nrtReplicas=2&action=CREATE&numShards=2&wt=javabin&version=2 and sendToOCPQueue=true
   [junit4]   2> 3064697 INFO  (OverseerThreadFactory-10259-thread-1-processing-n:127.0.0.1:51193_solr) [n:127.0.0.1:51193_solr    ] o.a.s.c.CreateCollectionCmd Create collection testcollection
   [junit4]   2> 3064820 INFO  (OverseerStateUpdate-98673023041208325-127.0.0.1:51193_solr-n_0000000000) [n:127.0.0.1:51193_solr    ] o.a.s.c.o.SliceMutator createReplica() {
   [junit4]   2>   "operation":"ADDREPLICA",
   [junit4]   2>   "collection":"testcollection",
   [junit4]   2>   "shard":"shard1",
   [junit4]   2>   "core":"testcollection_shard1_replica_n1",
   [junit4]   2>   "state":"down",
   [junit4]   2>   "base_url":"http://127.0.0.1:40797/solr",
   [junit4]   2>   "type":"NRT"} 
   [junit4]   2> 3064827 INFO  (OverseerStateUpdate-98673023041208325-127.0.0.1:51193_solr-n_0000000000) [n:127.0.0.1:51193_solr    ] o.a.s.c.o.SliceMutator createReplica() {
   [junit4]   2>   "operation":"ADDREPLICA",
   [junit4]   2>   "collection":"testcollection",
   [junit4]   2>   "shard":"shard1",
   [junit4]   2>   "core":"testcollection_shard1_replica_n3",
   [junit4]   2>   "state":"down",
   [junit4]   2>   "base_url":"http://127.0.0.1:51193/solr",
   [junit4]   2>   "type":"NRT"} 
   [junit4]   2> 3064831 INFO  (OverseerStateUpdate-98673023041208325-127.0.0.1:51193_solr-n_0000000000) [n:127.0.0.1:51193_solr    ] o.a.s.c.o.SliceMutator createReplica() {
   [junit4]   2>   "operation":"ADDREPLICA",
   [junit4]   2>   "collection":"testcollection",
   [junit4]   2>   "shard":"shard2",
   [junit4]   2>   "core":"testcollection_shard2_replica_n4",
   [junit4]   2>   "state":"down",
   [junit4]   2>   "base_url":"http://127.0.0.1:40797/solr",
   [junit4]   2>   "type":"NRT"} 
   [junit4]   2> 3064835 INFO  (OverseerStateUpdate-98673023041208325-127.0.0.1:51193_solr-n_0000000000) [n:127.0.0.1:51193_solr    ] o.a.s.c.o.SliceMutator createReplica() {
   [junit4]   2>   "operation":"ADDREPLICA",
   [junit4]   2>   "collection":"testcollection",
   [junit4]   2>   "shard":"shard2",
   [junit4]   2>   "core":"testcollection_shard2_replica_n6",
   [junit4]   2>   "state":"down",
   [junit4]   2>   "base_url":"http://127.0.0.1:51193/solr",
   [junit4]   2>   "type":"NRT"} 
   [junit4]   2> 3065076 INFO  (qtp837027100-24198) [n:127.0.0.1:40797_solr    ] o.a.s.h.a.CoreAdminOperation core create command qt=/admin/cores&coreNodeName=core_node2&collection.configName=solrCloudCollectionConfig&newCollection=true&name=testcollection_shard1_replica_n1&action=CREATE&numShards=2&collection=testcollection&shard=shard1&wt=javabin&version=2&replicaType=NRT
   [junit4]   2> 3065077 INFO  (qtp837027100-24198) [n:127.0.0.1:40797_solr    ] o.a.s.c.TransientSolrCoreCacheDefault Allocating transient cache for 2147483647 transient cores
   [junit4]   2> 3065077 INFO  (qtp1235440196-24201) [n:127.0.0.1:51193_solr    ] o.a.s.h.a.CoreAdminOperation core create command qt=/admin/cores&coreNodeName=core_node8&collection.configName=solrCloudCollectionConfig&newCollection=true&name=testcollection_shard2_replica_n6&action=CREATE&numShards=2&collection=testcollection&shard=shard2&wt=javabin&version=2&replicaType=NRT
   [junit4]   2> 3065077 INFO  (qtp1235440196-24201) [n:127.0.0.1:51193_solr    ] o.a.s.c.TransientSolrCoreCacheDefault Allocating transient cache for 2147483647 transient cores
   [junit4]   2> 3065078 INFO  (qtp1235440196-24204) [n:127.0.0.1:51193_solr    ] o.a.s.h.a.CoreAdminOperation core create command qt=/admin/cores&coreNodeName=core_node5&collection.configName=solrCloudCollectionConfig&newCollection=true&name=testcollection_shard1_replica_n3&action=CREATE&numShards=2&collection=testcollection&shard=shard1&wt=javabin&version=2&replicaType=NRT
   [junit4]   2> 3065078 INFO  (qtp837027100-24196) [n:127.0.0.1:40797_solr    ] o.a.s.h.a.CoreAdminOperation core create command qt=/admin/cores&coreNodeName=core_node7&collection.configName=solrCloudCollectionConfig&newCollection=true&name=testcollection_shard2_replica_n4&action=CREATE&numShards=2&collection=testcollection&shard=shard2&wt=javabin&version=2&replicaType=NRT
   [junit4]   2> 3065193 INFO  (zkCallback-5039-thread-1-processing-n:127.0.0.1:40797_solr) [n:127.0.0.1:40797_solr    ] o.a.s.c.c.ZkStateReader A cluster state change: [WatchedEvent state:SyncConnected type:NodeDataChanged path:/collections/testcollection/state.json] for collection [testcollection] has occurred - updating... (live nodes size: [2])
   [junit4]   2> 3065193 INFO  (zkCallback-5040-thread-1-processing-n:127.0.0.1:51193_solr) [n:127.0.0.1:51193_solr    ] o.a.s.c.c.ZkStateReader A cluster state change: [WatchedEvent state:SyncConnected type:NodeDataChanged path:/collections/testcollection/state.json] for collection [testcollection] has occurred - updating... (live nodes size: [2])
   [junit4]   2> 3065193 INFO  (zkCallback-5039-thread-2-processing-n:127.0.0.1:40797_solr) [n:127.0.0.1:40797_solr    ] o.a.s.c.c.ZkStateReader A cluster state change: [WatchedEvent state:SyncConnected type:NodeDataChanged path:/collections/testcollection/state.json] for collection [testcollection] has occurred - updating... (live nodes size: [2])
   [junit4]   2> 3065194 INFO  (zkCallback-5040-thread-2-processing-n:127.0.0.1:51193_solr) [n:127.0.0.1:51193_solr    ] o.a.s.c.c.ZkStateReader A cluster state change: [WatchedEvent state:SyncConnected type:NodeDataChanged path:/collections/testcollection/state.json] for collection [testcollection] has occurred - updating... (live nodes size: [2])
   [junit4]   2> 3066124 INFO  (qtp837027100-24196) [n:127.0.0.1:40797_solr c:testcollection s:shard2 r:core_node7 x:testcollection_shard2_replica_n4] o.a.s.c.SolrConfig Using Lucene MatchVersion: 7.1.0
   [junit4]   2> 3066128 INFO  (qtp1235440196-24201) [n:127.0.0.1:51193_solr c:testcollection s:shard2 r:core_node8 x:testcollection_shard2_replica_n6] o.a.s.c.SolrConfig Using Lucene MatchVersion: 7.1.0
   [junit4]   2> 3066212 INFO  (qtp1235440196-24204) [n:127.0.0.1:51193_solr c:testcollection s:shard1 r:core_node5 x:testcollection_shard1_replica_n3] o.a.s.c.SolrConfig Using Lucene MatchVersion: 7.1.0
   [junit4]   2> 3066218 INFO  (qtp837027100-24198) [n:127.0.0.1:40797_solr c:testcollection s:shard1 r:core_node2 x:testcollection_shard1_replica_n1] o.a.s.c.SolrConfig Using Lucene MatchVersion: 7.1.0
   [junit4]   2> 3066222 INFO  (qtp837027100-24196) [n:127.0.0.1:40797_solr c:testcollection s:shard2 r:core_node7 x:testcollection_shard2_replica_n4] o.a.s.s.IndexSchema [testcollection_shard2_replica_n4] Schema name=minimal
   [junit4]   2> 3066224 INFO  (qtp837027100-24196) [n:127.0.0.1:40797_solr c:testcollection s:shard2 r:core_node7 x:testcollection_shard2_replica_n4] o.a.s.s.IndexSchema Loaded schema minimal/1.1 with uniqueid field id
   [junit4]   2> 3066224 INFO  (qtp837027100-24196) [n:127.0.0.1:40797_solr c:testcollection s:shard2 r:core_node7 x:testcollection_shard2_replica_n4] o.a.s.c.CoreContainer Creating SolrCore 'testcollection_shard2_replica_n4' using configuration from collection testcollection, trusted=true
   [junit4]   2> 3066225 INFO  (qtp837027100-24196) [n:127.0.0.1:40797_solr c:testcollection s:shard2 r:core_node7 x:testcollection_shard2_replica_n4] o.a.s.m.r.SolrJmxReporter JMX monitoring for 'solr_40797.solr.core.testcollection.shard2.replica_n4' (registry 'solr.core.testcollection.shard2.replica_n4') enabled at server: com.sun.jmx.mbeanserver.JmxMBeanServer@3a49a450
   [junit4]   2> 3066225 INFO  (qtp837027100-24196) [n:127.0.0.1:40797_solr c:testcollection s:shard2 r:core_node7 x:testcollection_shard2_replica_n4] o.a.s.c.SolrCore solr.RecoveryStrategy.Builder
   [junit4]   2> 3066225 INFO  (qtp837027100-24196) [n:127.0.0.1:40797_solr c:testcollection s:shard2 r:core_node7 x:testcollection_shard2_replica_n4] o.a.s.c.SolrCore [[testcollection_shard2_replica_n4] ] Opening new SolrCore at [/export/home/jenkins/workspace/Lucene-Solr-7.x-Solaris/solr/build/solr-core/test/J1/temp/solr.cloud.TestAuthenticationFramework_C40CD8A653B12A21-001/tempDir-001/node2/testcollection_shard2_replica_n4], dataDir=[/export/home/jenkins/workspace/Lucene-Solr-7.x-Solaris/solr/build/solr-core/test/J1/temp/solr.cloud.TestAuthenticationFramework_C40CD8A653B12A21-001/tempDir-001/node2/./testcollection_shard2_replica_n4/data/]
   [junit4]   2> 3066240 INFO  (qtp1235440196-24204) [n:127.0.0.1:51193_solr c:testcollection s:shard1 r:core_node5 x:testcollection_shard1_replica_n3] o.a.s.s.IndexSchema [testcollection_shard1_replica_n3] Schema name=minimal
   [junit4]   2> 3066242 INFO  (qtp1235440196-24204) [n:127.0.0.1:51193_solr c:testcollection s:shard1 r:core_node5 x:testcollection_shard1_replica_n3] o.a.s.s.IndexSchema Loaded schema minimal/1.1 with uniqueid field id
   [junit4]   2> 3066242 INFO  (qtp1235440196-24204) [n:127.0.0.1:51193_solr c:testcollection s:shard1 r:core_node5 x:testcollection_shard1_replica_n3] o.a.s.c.CoreContainer Creating SolrCore 'testcollection_shard1_replica_n3' using configuration from collection testcollection, trusted=true
   [junit4]   2> 3066242 INFO  (qtp1235440196-24204) [n:127.0.0.1:51193_solr c:testcollection s:shard1 r:core_node5 x:testcollection_shard1_replica_n3] o.a.s.m.r.SolrJmxReporter JMX monitoring for 'solr_51193.solr.core.testcollection.shard1.replica_n3' (registry 'solr.core.testcollection.shard1.replica_n3') enabled at server: com.sun.jmx.mbeanserver.JmxMBeanServer@3a49a450
   [junit4]   2> 3066243 INFO  (qtp1235440196-24204) [n:127.0.0.1:51193_solr c:testcollection s:shard1 r:core_node5 x:testcollection_shard1_replica_n3] o.a.s.c.SolrCore solr.RecoveryStrategy.Builder
   [junit4]   2> 3066243 INFO  (qtp1235440196-24204) [n:127.0.0.1:51193_solr c:testcollection s:shard1 r:core_node5 x:testcollection_shard1_replica_n3] o.a.s.c.SolrCore [[testcollection_shard1_replica_n3] ] Opening new SolrCore at [/export/home/jenkins/workspace/Lucene-Solr-7.x-Solaris/solr/build/solr-core/test/J1/temp/solr.cloud.TestAuthenticationFramework_C40CD8A653B12A21-001/tempDir-001/node1/testcollection_shard1_replica_n3], dataDir=[/export/home/jenkins/workspace/Lucene-Solr-7.x-Solaris/solr/build/solr-core/test/J1/temp/solr.cloud.TestAuthenticationFramework_C40CD8A653B12A21-001/tempDir-001/node1/./testcollection_shard1_replica_n3/data/]
   [junit4]   2> 3066250 INFO  (qtp837027100-24198) [n:127.0.0.1:40797_solr c:testcollection s:shard1 r:core_node2 x:testcollection_shard1_replica_n1] o.a.s.s.IndexSchema [testcollection_shard1_replica_n1] Schema name=minimal
   [junit4]   2> 3066253 INFO  (qtp837027100-24198) [n:127.0.0.1:40797_solr c:testcollection s:shard1 r:core_node2 x:testcollection_shard1_replica_n1] o.a.s.s.IndexSchema Loaded schema minimal/1.1 with uniqueid field id
   [junit4]   2> 3066254 INFO  (qtp837027100-24198) [n:127.0.0.1:40797_solr c:testcollection s:shard1 r:core_node2 x:testcollection_shard1_replica_n1] o.a.s.c.CoreContainer Creating SolrCore 'testcollection_shard1_replica_n1' using configuration from collection testcollection, trusted=true
   [junit4]   2> 3066254 INFO  (qtp837027100-24198) [n:127.0.0.1:40797_solr c:testcollection s:shard1 r:core_node2 x:testcollection_shard1_replica_n1] o.a.s.m.r.SolrJmxReporter JMX monitoring for 'solr_40797.solr.core.testcollection.shard1.replica_n1' (registry 'solr.core.testcollection.shard1.replica_n1') enabled at server: com.sun.jmx.mbeanserver.JmxMBeanServer@3a49a450
   [junit4]   2> 3066254 INFO  (qtp837027100-24198) [n:127.0.0.1:40797_solr c:testcollection s:shard1 r:core_node2 x:testcollection_shard1_replica_n1] o.a.s.c.SolrCore solr.RecoveryStrategy.Builder
   [junit4]   2> 3066254 INFO  (qtp1235440196-24201) [n:127.0.0.1:51193_solr c:testcollection s:shard2 r:core_node8 x:testcollection_shard2_replica_n6] o.a.s.s.IndexSchema [testcollection_shard2_replica_n6] Schema name=minimal
   [junit4]   2> 3066254 INFO  (qtp837027100-24198) [n:127.0.0.1:40797_solr c:testcollection s:shard1 r:core_node2 x:testcollection_shard1_replica_n1] o.a.s.c.SolrCore [[testcollection_shard1_replica_n1] ] Opening new SolrCore at [/export/home/jenkins/workspace/Lucene-Solr-7.x-Solaris/solr/build/solr-core/test/J1/temp/solr.cloud.TestAuthenticationFramework_C40CD8A653B12A21-001/tempDir-001/node2/testcollection_shard1_replica_n1], dataDir=[/export/home/jenkins/workspace/Lucene-Solr-7.x-Solaris/solr/build/solr-core/test/J1/temp/solr.cloud.TestAuthenticationFramework_C40CD8A653B12A21-001/tempDir-001/node2/./testcollection_shard1_replica_n1/data/]
   [junit4]   2> 3066256 INFO  (qtp1235440196-24201) [n:127.0.0.1:51193_solr c:testcollection s:shard2 r:core_node8 x:testcollection_shard2_replica_n6] o.a.s.s.IndexSchema Loaded schema minimal/1.1 with uniqueid field id
   [junit4]   2> 3066256 INFO  (qtp1235440196-24201) [n:127.0.0.1:51193_solr c:testcollection s:shard2 r:core_node8 x:testcollection_shard2_replica_n6] o.a.s.c.CoreContainer Creating SolrCore 'testcollection_shard2_replica_n6' using configuration from collection testcollection, trusted=true
   [junit4]   2> 3066257 INFO  (qtp1235440196-24201) [n:127.0.0.1:51193_solr c:testcollection s:shard2 r:core_node8 x:testcollection_shard2_replica_n6] o.a.s.m.r.SolrJmxReporter JMX monitoring for 'solr_51193.solr.core.testcollection.shard2.replica_n6' (registry 'solr.core.testcollection.shard2.replica_n6') enabled at server: com.sun.jmx.mbeanserver.JmxMBeanServer@3a49a450
   [junit4]   2> 3066257 INFO  (qtp1235440196-24201) [n:127.0.0.1:51193_solr c:testcollection s:shard2 r:core_node8 x:testcollection_shard2_replica_n6] o.a.s.c.SolrCore solr.RecoveryStrategy.Builder
   [junit4]   2> 3066257 INFO  (qtp1235440196-24201) [n:127.0.0.1:51193_solr c:testcollection s:shard2 r:core_node8 x:testcollection_shard2_replica_n6] o.a.s.c.SolrCore [[testcollection_shard2_replica_n6] ] Opening new SolrCore at [/export/home/jenkins/workspace/Lucene-Solr-7.x-Solaris/solr/build/solr-core/test/J1/temp/solr.cloud.TestAuthenticationFramework_C40CD8A653B12A21-001/tempDir-001/node1/testcollection_shard2_replica_n6], dataDir=[/export/home/jenkins/workspace/Lucene-Solr-7.x-Solaris/solr/build/solr-core/test/J1/temp/solr.cloud.TestAuthenticationFramework_C40CD8A653B12A21-001/tempDir-001/node1/./testcollection_shard2_replica_n6/data/]
   [junit4]   2> 3066385 INFO  (qtp1235440196-24204) [n:127.0.0.1:51193_solr c:testcollection s:shard1 r:core_node5 x:testcollection_shard1_replica_n3] o.a.s.u.UpdateHandler Using UpdateLog implementation: org.apache.solr.update.UpdateLog
   [junit4]   2> 3066385 INFO  (qtp1235440196-24204) [n:127.0.0.1:51193_solr c:testcollection s:shard1 r:core_node5 x:testcollection_shard1_replica_n3] o.a.s.u.UpdateLog Initializing UpdateLog: dataDir=null defaultSyncLevel=FLUSH numRecordsToKeep=100 maxNumLogsToKeep=10 numVersionBuckets=65536
   [junit4]   2> 3066387 INFO  (qtp1235440196-24204) [n:127.0.0.1:51193_solr c:testcollection s:shard1 r:core_node5 x:testcollection_shard1_replica_n3] o.a.s.u.CommitTracker Hard AutoCommit: disabled
   [junit4]   2> 3066387 INFO  (qtp1235440196-24204) [n:127.0.0.1:51193_solr c:testcollection s:shard1 r:core_node5 x:testcollection_shard1_replica_n3] o.a.s.u.CommitTracker Soft AutoCommit: disabled
   [junit4]   2> 3066390 INFO  (qtp1235440196-24204) [n:127.0.0.1:51193_solr c:testcollection s:shard1 r:core_node5 x:testcollection_shard1_replica_n3] o.a.s.s.SolrIndexSearcher Opening [Searcher@4891c3cc[testcollection_shard1_replica_n3] main]
   [junit4]   2> 3066402 INFO  (qtp837027100-24198) [n:127.0.0.1:40797_solr c:testcollection s:shard1 r:core_node2 x:testcollection_shard1_replica_n1] o.a.s.u.UpdateHandler Using UpdateLog implementation: org.apache.solr.update.UpdateLog
   [junit4]   2> 3066402 INFO  (qtp837027100-24198) [n:127.0.0.1:40797_solr c:testcollection s:shard1 r:core_node2 x:testcollection_shard1_replica_n1] o.a.s.u.UpdateLog Initializing UpdateLog: dataDir=null defaultSyncLevel=FLUSH numRecordsToKeep=100 maxNumLogsToKeep=10 numVersionBuckets=65536
   [junit4]   2> 3066403 INFO  (qtp1235440196-24204) [n:127.0.0.1:51193_solr c:testcollection s:shard1 r:core_node5 x:testcollection_shard1_replica_n3] o.a.s.r.ManagedResourceStorage Configured ZooKeeperStorageIO with znodeBase: /configs/solrCloudCollectionConfig
   [junit4]   2> 3066403 INFO  (qtp837027100-24198) [n:127.0.0.1:40797_solr c:testcollection s:shard1 r:core_node2 x:testcollection_shard1_replica_n1] o.a.s.u.CommitTracker Hard AutoCommit: disabled
   [junit4]   2> 3066403 INFO  (qtp837027100-24198) [n:127.0.0.1:40797_solr c:testcollection s:shard1 r:core_node2 x:testcollection_shard1_replica_n1] o.a.s.u.CommitTracker Soft AutoCommit: disabled
   [junit4]   2> 3066404 INFO  (qtp1235440196-24204) [n:127.0.0.1:51193_solr c:testcollection s:shard1 r:core_node5 x:testcollection_shard1_replica_n3] o.a.s.r.ManagedResourceStorage Loaded null at path _rest_managed.json using ZooKeeperStorageIO:path=/configs/solrCloudCollectionConfig
   [junit4]   2> 3066404 INFO  (qtp1235440196-24204) [n:127.0.0.1:51193_solr c:testcollection s:shard1 r:core_node5 x:testcollection_shard1_replica_n3] o.a.s.h.ReplicationHandler Commits will be reserved for  10000
   [junit4]   2> 3066405 INFO  (searcherExecutor-10265-thread-1-processing-n:127.0.0.1:51193_solr x:testcollection_shard1_replica_n3 s:shard1 c:testcollection r:core_node5) [n:127.0.0.1:51193_solr c:testcollection s:shard1 r:core_node5 x:testcollection_shard1_replica_n3] o.a.s.c.SolrCore [testcollection_shard1_replica_n3] Registered new searcher Searcher@4891c3cc[testcollection_shard1_replica_n3] main{ExitableDirectoryReader(UninvertingDirectoryReader())}
   [junit4]   2> 3066405 INFO  (qtp1235440196-24204) [n:127.0.0.1:51193_solr c:testcollection s:shard1 r:core_node5 x:testcollection_shard1_replica_n3] o.a.s.u.UpdateLog Could not find max version in index or recent updates, using new clock 1578768371165429760
   [junit4]   2> 3066406 INFO  (qtp837027100-24196) [n:127.0.0.1:40797_solr c:testcollection s:shard2 r:core_node7 x:testcollection_shard2_replica_n4] o.a.s.u.UpdateHandler Using UpdateLog implementation: org.apache.solr.update.UpdateLog
   [junit4]   2> 3066407 INFO  (qtp837027100-24196) [n:127.0.0.1:40797_solr c:testcollection s:shard2 r:core_node7 x:testcollection_shard2_replica_n4] o.a.s.u.UpdateLog Initializing UpdateLog: dataDir=null defaultSyncLevel=FLUSH numRecordsToKeep=100 maxNumLogsToKeep=10 numVersionBuckets=65536
   [junit4]   2> 3066408 INFO  (qtp837027100-24196) [n:127.0.0.1:40797_solr c:testcollection s:shard2 r:core_node7 x:testcollection_shard2_replica_n4] o.a.s.u.CommitTracker Hard AutoCommit: disabled
   [junit4]   2> 3066408 INFO  (qtp837027100-24196) [n:127.0.0.1:40797_solr c:testcollection s:shard2 r:core_node7 x:testcollection_shard2_replica_n4] o.a.s.u.CommitTracker Soft AutoCommit: disabled
   [junit4]   2> 3066410 INFO  (qtp837027100-24198) [n:127.0.0.1:40797_solr c:testcollection s:shard1 r:core_node2 x:testcollection_shard1_replica_n1] o.a.s.s.SolrIndexSearcher Opening [Searcher@257e2734[testcollection_shard1_replica_n1] main]
   [junit4]   2> 3066410 INFO  (qtp837027100-24196) [n:127.0.0.1:40797_solr c:testcollection s:shard2 r:core_node7 x:testcollection_shard2_replica_n4] o.a.s.s.SolrIndexSearcher Opening [Searcher@7e158a06[testcollection_shard2_replica_n4] main]
   [junit4]   2> 3066412 INFO  (qtp837027100-24198) [n:127.0.0.1:40797_solr c:testcollection s:shard1 r:core_node2 x:testcollection_shard1_replica_n1] o.a.s.r.ManagedResourceStorage Configured ZooKeeperStorageIO with znodeBase: /configs/solrCloudCollectionConfig
   [junit4]   2> 3066413 INFO  (qtp1235440196-24201) [n:127.0.0.1:51193_solr c:testcollection s:shard2 r:core_node8 x:testcollection_shard2_replica_n6] o.a.s.u.UpdateHandler Using UpdateLog implementation: org.apache.solr.update.UpdateLog
   [junit4]   2> 3066413 INFO  (qtp1235440196-24201) [n:127.0.0.1:51193_solr c:testcollection s:shard2 r:core_node8 x:testcollection_shard2_replica_n6] o.a.s.u.UpdateLog Initializing UpdateLog: dataDir=null defaultSyncLevel=FLUSH numRecordsToKeep=100 maxNumLogsToKeep=10 numVersionBuckets=65536
   [junit4]   2> 3066413 INFO  (qtp837027100-24198) [n:127.0.0.1:40797_solr c:testcollection s:shard1 r:core_node2 x:testcollection_shard1_replica_n1] o.a.s.r.ManagedResourceStorage Loaded null at path _rest_managed.json using ZooKeeperStorageIO:path=/configs/solrCloudCollectionConfig
   [junit4]   2> 3066414 INFO  (qtp837027100-24196) [n:127.0.0.1:40797_solr c:testcollection s:shard2 r:core_node7 x:testcollection_shard2_replica_n4] o.a.s.r.ManagedResourceStorage Configured ZooKeeperStorageIO with znodeBase: /configs/solrCloudCollectionConfig
   [junit4]   2> 3066414 INFO  (qtp837027100-24198) [n:127.0.0.1:40797_solr c:testcollection s:shard1 r:core_node2 x:testcollection_shard1_replica_n1] o.a.s.h.ReplicationHandler Commits will be reserved for  10000
   [junit4]   2> 3066414 INFO  (qtp837027100-24196) [n:127.0.0.1:40797_solr c:testcollection s:shard2 r:core_node7 x:testcollection_shard2_replica_n4] o.a.s.r.ManagedResourceStorage Loaded null at path _rest_managed.json using ZooKeeperStorageIO:path=/configs/solrCloudCollectionConfig
   [junit4]   2> 3066414 INFO  (qtp837027100-24198) [n:127.0.0.1:40797_solr c:testcollection s:shard1 r:core_node2 x:testcollection_shard1_replica_n1] o.a.s.u.UpdateLog Could not find max version in index or recent updates, using new clock 1578768371174866944
   [junit4]   2> 3066414 INFO  (qtp1235440196-24201) [n:127.0.0.1:51193_solr c:testcollection s:shard2 r:core_node8 x:testcollection_shard2_replica_n6] o.a.s.u.CommitTracker Hard AutoCommit: disabled
   [junit4]   2> 3066415 INFO  (qtp1235440196-24201) [n:127.0.0.1:51193_solr c:testcollection s:shard2 r:core_node8 x:testcollection_shard2_replica_n6] o.a.s.u.CommitTracker Soft AutoCommit: disabled
   [junit4]   2> 3066415 INFO  (qtp837027100-24196) [n:127.0.0.1:40797_solr c:testcollection s:shard2 r:core_node7 x:testcollection_shard2_replica_n4] o.a.s.h.ReplicationHandler Commits will be reserved for  10000
   [junit4]   2> 3066415 INFO  (qtp837027100-24196) [n:127.0.0.1:40797_solr c:testcollection s:shard2 r:core_node7 x:testcollection_shard2_replica_n4] o.a.s.u.UpdateLog Could not find max version in index or recent updates, using new clock 1578768371175915520
   [junit4]   2> 3066427 INFO  (qtp1235440196-24201) [n:127.0.0.1:51193_solr c:testcollection s:shard2 r:core_node8 x:testcollection_shard2_replica_n6] o.a.s.s.SolrIndexSearcher Opening [Searcher@70587a0d[testcollection_shard2_replica_n6] main]
   [junit4]   2> 3066428 INFO  (qtp1235440196-24204) [n:127.0.0.1:51193_solr c:testcollection s:shard1 r:core_node5 x:testcollection_shard1_replica_n3] o.a.s.c.ShardLeaderElectionContext Enough replicas found to continue.
   [junit4]   2> 3066429 INFO  (qtp1235440196-24204) [n:127.0.0.1:51193_solr c:testcollection s:shard1 r:core_node5 x:testcollection_shard1_replica_n3] o.a.s.c.ShardLeaderElectionContext I may be the new leader - try and sync
   [junit4]   2> 3066429 INFO  (qtp1235440196-24204) [n:127.0.0.1:51193_solr c:testcollection s:shard1 r:core_node5 x:testcollection_shard1_replica_n3] o.a.s.c.SyncStrategy Sync replicas to http://127.0.0.1:51193/solr/testcollection_shard1_replica_n3/
   [junit4]   2> 3066429 INFO  (searcherExecutor-10264-thread-1-processing-n:127.0.0.1:40797_solr x:testcollection_shard2_replica_n4 s:shard2 c:testcollection r:core_node7) [n:127.0.0.1:40797_solr c:testcollection s:shard2 r:core_node7 x:testcollection_shard2_replica_n4] o.a.s.c.SolrCore [testcollection_shard2_replica_n4] Registered new searcher Searcher@7e158a06[testcollection_shard2_replica_n4] main{ExitableDirectoryReader(UninvertingDirectoryReader())}
   [junit4]   2> 3066430 INFO  (qtp1235440196-24204) [n:127.0.0.1:51193_solr c:testcollection s:shard1 r:core_node5 x:testcollection_shard1_replica_n3] o.a.s.u.PeerSync PeerSync: core=testcollection_shard1_replica_n3 url=http://127.0.0.1:51193/solr START replicas=[http://127.0.0.1:40797/solr/testcollection_shard1_replica_n1/] nUpdates=100
   [junit4]   2> 3066430 INFO  (qtp1235440196-24201) [n:127.0.0.1:51193_solr c:testcollection s:shard2 r:core_node8 x:testcollection_shard2_replica_n6] o.a.s.r.ManagedResourceStorage Configured ZooKeeperStorageIO with znodeBase: /configs/solrCloudCollectionConfig
   [junit4]   2> 3066431 INFO  (searcherExecutor-10266-thread-1-processing-n:127.0.0.1:40797_solr x:testcollection_shard1_replica_n1 s:shard1 c:testcollection r:core_node2) [n:127.0.0.1:40797_solr c:testcollection s:shard1 r:core_node2 x:testcollection_shard1_replica_n1] o.a.s.c.SolrCore [testcollection_shard1_replica_n1] Registered new searcher Searcher@257e2734[testcollection_shard1_replica_n1] main{ExitableDirectoryReader(UninvertingDirectoryReader())}
   [junit4]   2> 3066437 INFO  (qtp837027100-24199) [n:127.0.0.1:40797_solr c:testcollection s:shard1 r:core_node2 x:testcollection_shard1_replica_n1] o.a.s.c.S.Request [testcollection_shard1_replica_n1]  webapp=/solr path=/get params={distrib=false&qt=/get&fingerprint=false&getVersions=100&wt=javabin&version=2} status=0 QTime=0
   [junit4]   2> 3066437 INFO  (qtp837027100-24196) [n:127.0.0.1:40797_solr c:testcollection s:shard2 r:core_node7 x:testcollection_shard2_replica_n4] o.a.s.c.ShardLeaderElectionContext Waiting until we see more replicas up for shard shard2: total=2 found=1 timeoutin=9999ms
   [junit4]   2> 3066438 INFO  (qtp1235440196-24201) [n:127.0.0.1:51193_solr c:testcollection s:shard2 r:core_node8 x:testcollection_shard2_replica_n6] o.a.s.r.ManagedResourceStorage Loaded null at path _rest_managed.json using ZooKeeperStorageIO:path=/configs/solrCloudCollectionConfig
   [junit4]   2> 3066439 INFO  (qtp1235440196-24201) [n:127.0.0.1:51193_solr c:testcollection s:shard2 r:core_node8 x:testcollection_shard2_replica_n6] o.a.s.h.ReplicationHandler Commits will be reserved for  10000
   [junit4]   2> 3066439 INFO  (qtp1235440196-24201) [n:127.0.0.1:51193_solr c:testcollection s:shard2 r:core_node8 x:testcollection_shard2_replica_n6] o.a.s.u.UpdateLog Could not find max version in index or recent updates, using new clock 1578768371201081344
   [junit4]   2> 3066440 INFO  (searcherExecutor-10267-thread-1-processing-n:127.0.0.1:51193_solr x:testcollection_shard2_replica_n6 s:shard2 c:testcollection r:core_node8) [n:127.0.0.1:51193_solr c:testcollection s:shard2 r:core_node8 x:testcollection_shard2_replica_n6] o.a.s.c.SolrCore [testcollection_shard2_replica_n6] Registered new searcher Searcher@70587a0d[testcollection_shard2_replica_n6] main{ExitableDirectoryReader(UninvertingDirectoryReader())}
   [junit4]   2> 3066544 INFO  (zkCallback-5040-thread-2-processing-n:127.0.0.1:51193_solr) [n:127.0.0.1:51193_solr    ] o.a.s.c.c.ZkStateReader A cluster state change: [WatchedEvent state:SyncConnected type:NodeDataChanged path:/collections/testcollection/state.json] for collection [testcollection] has occurred - updating... (live nodes size: [2])
   [junit4]   2> 3066544 INFO  (zkCallback-5040-thread-1-processing-n:127.0.0.1:51193_solr) [n:127.0.0.1:51193_solr    ] o.a.s.c.c.ZkStateReader A cluster state change: [WatchedEvent state:SyncConnected type:NodeDataChanged path:/collections/testcollection/state.json] for collection [testcollection] has occurred - updating... (live nodes size: [2])
   [junit4]   2> 3066544 INFO  (zkCallback-5039-thread-1-processing-n:127.0.0.1:40797_solr) [n:127.0.0.1:40797_solr    ] o.a.s.c.c.ZkStateReader A cluster state change: [WatchedEvent state:SyncConnected type:NodeDataChanged path:/collections/testcollection/state.json] for collection [testcollection] has occurred - updating... (live nodes size: [2])
   [junit4]   2> 3066544 INFO  (zkCallback-5039-thread-2-processing-n:127.0.0.1:40797_solr) [n:127.0.0.1:40797_solr    ] o.a.s.c.c.ZkStateReader A cluster state change: [WatchedEvent state:SyncConnected type:NodeDataChanged path:/collections/testcollection/state.json] for collection [testcollection] has occurred - updating... (live nodes size: [2])
   [junit4]   2> 3066731 INFO  (qtp1235440196-24204) [n:127.0.0.1:51193_solr c:testcollection s:shard1 r:core_node5 x:testcollection_shard1_replica_n3] o.a.s.u.PeerSync PeerSync: core=testcollection_shard1_replica_n3 url=http://127.0.0.1:51193/solr DONE.  We have no versions.  sync failed.
   [junit4]   2> 3066731 INFO  (qtp1235440196-24204) [n:127.0.0.1:51193_solr c:testcollection s:shard1 r:core_node5 x:testcollection_shard1_replica_n3] o.a.s.c.SyncStrategy Leader's attempt to sync with shard failed, moving to the next candidate
   [junit4]   2> 3066732 INFO  (qtp1235440196-24204) [n:127.0.0.1:51193_solr c:testcollection s:shard1 r:core_node5 x:testcollection_shard1_replica_n3] o.a.s.c.ShardLeaderElectionContext We failed sync, but we have no versions - we can't sync in that case - we were active before, so become leader anyway
   [junit4]   2> 3066732 INFO  (qtp1235440196-24204) [n:127.0.0.1:51193_solr c:testcollection s:shard1 r:core_node5 x:testcollection_shard1_replica_n3] o.a.s.c.ShardLeaderElectionContext Found all replicas participating in election, clear LIR
   [junit4]   2> 3066740 INFO  (qtp1235440196-24204) [n:127.0.0.1:51193_solr c:testcollection s:shard1 r:core_node5 x:testcollection_shard1_replica_n3] o.a.s.c.ShardLeaderElectionContext I am the new leader: http://127.0.0.1:51193/solr/testcollection_shard1_replica_n3/ shard1
   [junit4]   2> 3066850 INFO  (zkCallback-5039-thread-1-processing-n:127.0.0.1:40797_solr) [n:127.0.0.1:40797_solr    ] o.a.s.c.c.ZkStateReader A cluster state change: [WatchedEvent state:SyncConnected type:NodeDataChanged path:/collections/testcollection/state.json] for collection [testcollection] has occurred - updating... (live nodes size: [2])
   [junit4]   2> 3066850 INFO  (zkCallback-5039-thread-2-processing-n:127.0.0.1:40797_solr) [n:127.0.0.1:40797_solr    ] o.a.s.c.c.ZkStateReader A cluster state change: [WatchedEvent state:SyncConnected type:NodeDataChanged path:/collections/testcollection/state.json] for collection [testcollection] has occurred - updating... (live nodes size: [2])
   [junit4]   2> 3066851 INFO  (zkCallback-5040-thread-1-processing-n:127.0.0.1:51193_solr) [n:127.0.0.1:51193_solr    ] o.a.s.c.c.ZkStateReader A cluster state change: [WatchedEvent state:SyncConnected type:NodeDataChanged path:/collections/testcollection/state.json] for collection [testcollection] has occurred - updating... (live nodes size: [2])
   [junit4]   2> 3066851 INFO  (zkCallback-5040-thread-2-processing-n:127.0.0.1:51193_solr) [n:127.0.0.1:51193_solr    ] o.a.s.c.c.ZkStateReader A cluster state change: [WatchedEvent state:SyncConnected type:NodeDataChanged path:/collections/testcollection/state.json] for collection [testcollection] has occurred - updating... (live nodes size: [2])
   [junit4]   2> 3066904 INFO  (qtp1235440196-24204) [n:127.0.0.1:51193_solr c:testcollection s:shard1 r:core_node5 x:testcollection_shard1_replica_n3] o.a.s.c.ZkController I am the leader, no recovery necessary
   [junit4]   2> 3066926 INFO  (qtp1235440196-24204) [n:127.0.0.1:51193_solr c:testcollection s:shard1 r:core_node5 x:testcollection_shard1_replica_n3] o.a.s.s.HttpSolrCall [admin] webapp=null path=/admin/cores params={qt=/admin/cores&coreNodeName=core_node5&collection.configName=solrCloudCollectionConfig&newCollection=true&name=testcollection_shard1_replica_n3&action=CREATE&numShards=2&collection=testcollection&shard=shard1&wt=javabin&version=2&replicaType=NRT} status=0 QTime=1849
   [junit4]   2> 3066941 INFO  (qtp837027100-24196) [n:127.0.0.1:40797_solr c:testcollection s:shard2 r:core_node7 x:testcollection_shard2_replica_n4] o.a.s.c.ShardLeaderElectionContext Enough replicas found to continue.
   [junit4]   2> 3066941 INFO  (qtp837027100-24196) [n:127.0.0.1:40797_solr c:testcollection s:shard2 r:core_node7 x:testcollection_shard2_replica_n4] o.a.s.c.ShardLeaderElectionContext I may be the new leader - try and sync
   [junit4]   2> 3066942 INFO  (qtp837027100-24196) [n:127.0.0.1:40797_solr c:testcollection s:shard2 r:core_node7 x:testcollection_shard2_replica_n4] o.a.s.c.SyncStrategy Sync replicas to http://127.0.0.1:40797/solr/testcollection_shard2_replica_n4/
   [junit4]   2> 3066942 INFO  (qtp837027100-24196) [n:127.0.0.1:40797_solr c:testcollection s:shard2 r:core_node7 x:testcollection_shard2_replica_n4] o.a.s.u.PeerSync PeerSync: core=testcollection_shard2_replica_n4 url=http://127.0.0.1:40797/solr START replicas=[http://127.0.0.1:51193/solr/testcollection_shard2_replica_n6/] nUpdates=100
   [junit4]   2> 3066945 INFO  (qtp1235440196-24206) [n:127.0.0.1:51193_solr c:testcollection s:shard2 r:core_node8 x:testcollection_shard2_replica_n6] o.a.s.c.S.Request [testcollection_shard2_replica_n6]  webapp=/solr path=/get params={distrib=false&qt=/get&fingerprint=false&getVersions=100&wt=javabin&version=2} status=0 QTime=0
   [junit4]   2> 3067045 INFO  (zkCallback-5040-thread-1-processing-n:127.0.0.1:51193_solr) [n:127.0.0.1:51193_solr    ] o.a.s.c.c.ZkStateReader A cluster state change: [WatchedEvent state:SyncConnected type:NodeDataChanged path:/collections/testcollection/state.json] for collection [testcollection] has occurred - updating... (live nodes size: [2])
   [junit4]   2> 3067045 INFO  (zkCallback-5040-thread-2-processing-n:127.0.0.1:51193_solr) [n:127.0.0.1:51193_solr    ] o.a.s.c.c.ZkStateReader A cluster state change: [WatchedEvent state:SyncConnected type:NodeDataChanged path:/collections/testcollection/state.json] for collection [testcollection] has occurred - updating... (live nodes size: [2])
   [junit4]   2> 3067046 INFO  (zkCallback-5039-thread-2-processing-n:127.0.0.1:40797_solr) [n:127.0.0.1:40797_solr    ] o.a.s.c.c.ZkStateReader A cluster state change: [WatchedEvent state:SyncConnected type:NodeDataChanged path:/collections/testcollection/state.json] for collection [testcollection] has occurred - updating... (live nodes size: [2])
   [junit4]   2> 3067046 INFO  (zkCallback-5039-thread-1-processing-n:127.0.0.1:40797_solr) [n:127.0.0.1:40797_solr    ] o.a.s.c.c.ZkStateReader A cluster state change: [WatchedEvent state:SyncConnected type:NodeDataChanged path:/collections/testcollection/state.json] for collection [testcollection] has occurred - updating... (live nodes size: [2])
   [junit4]   2> 3067243 INFO  (qtp837027100-24196) [n:127.0.0.1:40797_solr c:testcollection s:shard2 r:core_node7 x:testcollection_shard2_replica_n4] o.a.s.u.PeerSync PeerSync: core=testcollection_shard2_replica_n4 url=http://127.0.0.1:40797/solr DONE.  We have no versions.  sync failed.
   [junit4]   2> 3067244 INFO  (qtp837027100-24196) [n:127.0.0.1:40797_solr c:testcollection s:shard2 r:core_node7 x:testcollection_shard2_replica_n4] o.a.s.c.SyncStrategy Leader's attempt to sync with shard failed, moving to the next candidate
   [junit4]   2> 3067244 INFO  (qtp837027100-24196) [n:127.0.0.1:40797_solr c:testcollection s:shard2 r:core_node7 x:testcollection_shard2_replica_n4] o.a.s.c.ShardLeaderElectionContext We failed sync, but we have no versions - we can't sync in that case - we were active before, so become leader anyway
   [junit4]   2> 3067244 INFO  (qtp837027100-24196) [n:127.0.0.1:40797_solr c:testcollection s:shard2 r:core_node7 x:testcollection_shard2_replica_n4] o.a.s.c.ShardLeaderElectionContext Found all replicas participating in election, clear LIR
   [junit4]   2> 3067251 INFO  (qtp837027100-24196) [n:127.0.0.1:40797_solr c:testcollection s:shard2 r:core_node7 x:testcollection_shard2_replica_n4] o.a.s.c.ShardLeaderElectionContext I am the new leader: http://127.0.0.1:40797/solr/testcollection_shard2_replica_n4/ shard2
   [junit4]   2> 3067359 INFO  (zkCallback-5040-thread-1-processing-n:127.0.0.1:51193_solr) [n:127.0.0.1:51193_solr    ] o.a.s.c.c.ZkStateReader A cluster state change: [WatchedEvent state:SyncConnected type:NodeDataChanged path:/collections/testcollection/state.json] for collection [testcollection] has occurred - updating... (live nodes size: [2])
   [junit4]   2> 3067359 INFO  (zkCallback-5040-thread-2-processing-n:127.0.0.1:51193_solr) [n:127.0.0.1:51193_solr    ] o.a.s.c.c.ZkStateReader A cluster state change: [WatchedEvent state:SyncConnected type:NodeDataChanged path:/collections/testcollection/state.json] for collection [testcollection] has occurred - updating... (live nodes size: [2])
   [junit4]   2> 3067359 INFO  (zkCallback-5039-thread-2-processing-n:127.0.0.1:40797_solr) [n:127.0.0.1:40797_solr    ] o.a.s.c.c.ZkStateReader A cluster state change: [WatchedEvent state:SyncConnected type:NodeDataChanged path:/collections/testcollection/state.json] for collection [testcollection] has occurred - updating... (live nodes size: [2])
   [junit4]   2> 3067359 INFO  (zkCallback-5039-thread-1-processing-n:127.0.0.1:40797_solr) [n:127.0.0.1:40797_solr    ] o.a.s.c.c.ZkStateReader A cluster state change: [WatchedEvent state:SyncConnected type:NodeDataChanged path:/collections/testcollection/state.json] for collection [testcollection] has occurred - updating... (live nodes size: [2])
   [junit4]   2> 3067405 INFO  (qtp837027100-24196) [n:127.0.0.1:40797_solr c:testcollection s:shard2 r:core_node7 x:testcollection_shard2_replica_n4] o.a.s.c.ZkController I am the leader, no recovery necessary
   [junit4]   2> 3067407 INFO  (qtp837027100-24196) [n:127.0.0.1:40797_solr c:testcollection s:shard2 r:core_node7 x:testcollection_shard2_replica_n4] o.a.s.s.HttpSolrCall [admin] webapp=null path=/admin/cores params={qt=/admin/cores&coreNodeName=core_node7&collection.configName=solrCloudCollectionConfig&newCollection=true&name=testcollection_shard2_replica_n4&action=CREATE&numShards=2&collection=testcollection&shard=shard2&wt=javabin&version=2&replicaType=NRT} status=0 QTime=2329
   [junit4]   2> 3067444 INFO  (qtp837027100-24198) [n:127.0.0.1:40797_solr c:testcollection s:shard1 r:core_node2 x:testcollection_shard1_replica_n1] o.a.s.s.HttpSolrCall [admin] webapp=null path=/admin/cores params={qt=/admin/cores&coreNodeName=core_node2&collection.configName=solrCloudCollectionConfig&newCollection=true&name=testcollection_shard1_replica_n1&action=CREATE&numShards=2&collection=testcollection&shard=shard1&wt=javabin&version=2&replicaType=NRT} status=0 QTime=2368
   [junit4]   2> 3067449 INFO  (qtp1235440196-24201) [n:127.0.0.1:51193_solr c:testcollection s:shard2 r:core_node8 x:testcollection_shard2_replica_n6] o.a.s.s.HttpSolrCall [admin] webapp=null path=/admin/cores params={qt=/admin/cores&coreNodeName=core_node8&collection.configName=solrCloudCollectionConfig&newCollection=true&name=testcollection_shard2_replica_n6&action=CREATE&numShards=2&collection=testcollection&shard=shard2&wt=javabin&version=2&replicaType=NRT} status=0 QTime=2373
   [junit4]   2> 3067456 INFO  (qtp1235440196-24195) [n:127.0.0.1:51193_solr    ] o.a.s.h.a.CollectionsHandler Wait for new collection to be active for at most 30 seconds. Check all shard replicas
   [junit4]   2> 3067554 INFO  (zkCallback-5039-thread-1-processing-n:127.0.0.1:40797_solr) [n:127.0.0.1:40797_solr    ] o.a.s.c.c.ZkStateReader A cluster state change: [WatchedEvent state:SyncConnected type:NodeDataChanged path:/collections/testcollection/state.json] for collection [testcollection] has occurred - updating... (live nodes size: [2])
   [junit4]   2> 3067554 INFO  (zkCallback-5040-thread-2-processing-n:127.0.0.1:51193_solr) [n:127.0.0.1:51193_solr    ] o.a.s.c.c.ZkStateReader A cluster state change: [WatchedEvent state:SyncConnected type:NodeDataChanged path:/collections/testcollection/state.json] for collection [testcollection] has occurred - updating... (live nodes size: [2])
   [junit4]   2> 3067554 INFO  (zkCallback-5040-thread-1-processing-n:127.0.0.1:51193_solr) [n:127.0.0.1:51193_solr    ] o.a.s.c.c.ZkStateReader A cluster state change: [WatchedEvent state:SyncConnected type:NodeDataChanged path:/collections/testcollection/state.json] for collection [testcollection] has occurred - updating... (live nodes size: [2])
   [junit4]   2> 3067554 INFO  (zkCallback-5039-thread-2-processing-n:127.0.0.1:40797_solr) [n:127.0.0.1:40797_solr    ] o.a.s.c.c.ZkStateReader A cluster state change: [WatchedEvent state:SyncConnected type:NodeDataChanged path:/collections/testcollection/state.json] for collection [testcollection] has occurred - updating... (live nodes size: [2])
   [junit4]   2> 3068457 INFO  (qtp1235440196-24195) [n:127.0.0.1:51193_solr    ] o.a.s.s.HttpSolrCall [admin] webapp=null path=/admin/collections params={replicationFactor=2&collection.configName=solrCloudCollectionConfig&maxShardsPerNode=2&name=testcollection&nrtReplicas=2&action=CREATE&numShards=2&wt=javabin&version=2} status=0 QTime=3764
   [junit4]   2> 3068457 INFO  (TEST-TestAuthenticationFramework.testBasics-seed#[C40CD8A653B12A21]) [    ] o.a.s.c.AbstractDistribZkTestBase Wait for recoveries to finish - collection: testcollection failOnTimeout:true timeout (sec):330
   [junit4]   1> -
   [junit4]   1> replica:core_node2 rstate:active live:true
   [junit4]   1> replica:core_node5 rstate:active live:true
   [junit4]   1> replica:core_node7 rstate:active live:true
   [junit4]   1> replica:core_node8 rstate:active live:true
   [junit4]   1> no one is recoverying
   [junit4]   2> 3068458 INFO  (TEST-TestAuthenticationFramework.testBasics-seed#[C40CD8A653B12A21]) [    ] o.a.s.c.AbstractDistribZkTestBase Recoveries finished - collection: testcollection
   [junit4]   2> 3068463 INFO  (qtp1235440196-24202) [n:127.0.0.1:51193_solr c:testcollection s:shard2 r:core_node8 x:testcollection_shard2_replica_n6] o.a.s.c.S.Request [testcollection_shard2_replica_n6]  webapp=/solr path=/select params={df=text&distrib=false&_stateVer_=testcollection:7&fl=id&fl=score&shards.purpose=4&start=0&fsv=true&shard.url=http://127.0.0.1:51193/solr/testcollection_shard2_replica_n6/|http://127.0.0.1:40797/solr/testcollection_shard2_replica_n4/&rows=10&version=2&q=*:*&NOW=1505630849191&isShard=true&wt=javabin} hits=0 status=0 QTime=0
   [junit4]   2> 3068463 INFO  (qtp1235440196-24203) [n:127.0.0.1:51193_solr c:testcollection s:shard1 r:core_node5 x:testcollection_shard1_replica_n3] o.a.s.c.S.Request [testcollection_shard1_replica_n3]  webapp=/solr path=/select params={df=text&distrib=false&_stateVer_=testcollection:7&fl=id&fl=score&shards.purpose=4&start=0&fsv=true&shard.url=http://127.0.0.1:51193/solr/testcollection_shard1_replica_n3/|http://127.0.0.1:40797/solr/testcollection_shard1_replica_n1/&rows=10&version=2&q=*:*&NOW=1505630849191&isShard=true&wt=javabin} hits=0 status=0 QTime=0
   [junit4]   2> 3068463 INFO  (qtp837027100-24197) [n:127.0.0.1:40797_solr c:testcollection s:shard2 r:core_node7 x:testcollection_shard2_replica_n4] o.a.s.c.S.Request [testcollection_shard2_replica_n4]  webapp=/solr path=/select params={q=*:*&_stateVer_=testcollection:7&wt=javabin&version=2} hits=0 status=0 QTime=2
   [junit4]   2> 3068469 INFO  (qtp837027100-24193) [n:127.0.0.1:40797_solr c:testcollection s:shard1 r:core_node2 x:testcollection_shard1_replica_n1] o.a.s.u.p.LogUpdateProcessorFactory [testcollection_shard1_replica_n1]  webapp=/solr path=/update params={update.distrib=FROMLEADER&distrib.from=http://127.0.0.1:51193/solr/testcollection_shard1_replica_n3/&wt=javabin&version=2}{add=[1 (1578768373325496320)]} 0 1
   [junit4]   2> 3068471 INFO  (qtp1235440196-24204) [n:127.0.0.1:51193_solr c:testcollection s:shard1 r:core_node5 x:testcollection_shard1_replica_n3] o.a.s.u.p.LogUpdateProcessorFactory [testcollection_shard1_replica_n3]  webapp=/solr path=/update params={_stateVer_=testcollection:7&wt=javabin&version=2}{add=[1 (1578768373325496320)]} 0 6
   [junit4]   2> 3068473 INFO  (qtp837027100-24200) [n:127.0.0.1:40797_solr c:testcollection s:shard1 r:core_node2 x:testcollection_shard1_replica_n1] o.a.s.u.DirectUpdateHandler2 start commit{_version_=1578768373333884928,optimize=false,openSearcher=true,waitSearcher=true,expungeDeletes=false,softCommit=false,prepareCommit=false}
   [junit4]   2> 3068474 INFO  (qtp837027100-24200) [n:127.0.0.1:40797_solr c:testcollection s:shard1 r:core_node2 x:testcollection_shard1_replica_n1] o.a.s.u.SolrIndexWriter Calling setCommitData with IW:org.apache.solr.update.SolrIndexWriter@7c0bc1ea commitCommandVersion:1578768373333884928
   [junit4]   2> 3068475 INFO  (qtp1235440196-24201) [n:127.0.0.1:51193_solr c:testcollection s:shard2 r:core_node8 x:testcollection_shard2_replica_n6] o.a.s.u.DirectUpdateHandler2 start commit{_version_=1578768373335982080,optimize=false,openSearcher=true,waitSearcher=true,expungeDeletes=false,softCommit=false,prepareCommit=false}
   [junit4]   2> 3068475 INFO  (qtp1235440196-24201) [n:127.0.0.1:51193_solr c:testcollection s:shard2 r:core_node8 x:testcollection_shard2_replica_n6] o.a.s.u.DirectUpdateHandler2 No uncommitted changes. Skipping IW.commit.
   [junit4]   2> 3068475 INFO  (qtp1235440196-24201) [n:127.0.0.1:51193_solr c:testcollection s:shard2 r:core_node8 x:testcollection_shard2_replica_n6] o.a.s.u.DirectUpdateHandler2 end_commit_flush
   [junit4]   2> 3068475 INFO  (qtp1235440196-24201) [n:127.0.0.1:51193_solr c:testcollection s:shard2 r:core_node8 x:testcollection_shard2_replica_n6] o.a.s.u.p.LogUpdateProcessorFactory [testcollection_shard2_replica_n6]  webapp=/solr path=/update params={update.distrib=FROMLEADER&waitSearcher=true&openSearcher=true&commit=true&softCommit=false&distrib.from=http://127.0.0.1:51193/solr/testcollection_shard1_replica_n3/&commit_end_point=true&wt=javabin&version=2&expungeDeletes=false}{commit=} 0 0
   [junit4]   2> 3068475 INFO  (qtp1235440196-24195) [n:127.0.0.1:51193_solr c:testcollection s:shard1 r:core_node5 x:testcollection_shard1_replica_n3] o.a.s.u.DirectUpdateHandler2 start commit{_version_=1578768373335982080,optimize=false,openSearcher=true,waitSearcher=true,expungeDeletes=false,softCommit=false,prepareCommit=false}
   [junit4]   2> 3068476 INFO  (qtp1235440196-24195) [n:127.0.0.1:51193_solr c:testcollection s:shard1 r:core_node5 x:testcollection_shard1_replica_n3] o.a.s.u.SolrIndexWriter Calling setCommitData with IW:org.apache.solr.update.SolrIndexWriter@481617a1 commitCommandVersion:1578768373335982080
   [junit4]   2> 3068477 INFO  (qtp837027100-24191) [n:127.0.0.1:40797_solr c:testcollection s:shard2 r:core_node7 x:testcollection_shard2_replica_n4] o.a.s.u.DirectUpdateHandler2 start commit{_version_=1578768373338079232,optimize=false,openSearcher=true,waitSearcher=true,expungeDeletes=false,softCommit=false,prepareCommit=false}
   [junit4]   2> 3068477 INFO  (qtp837027100-24191) [n:127.0.0.1:40797_solr c:testcollection s:shard2 r:core_node7 x:testcollection_shard2_replica_n4] o.a.s.u.DirectUpdateHandler2 No uncommitted changes. Skipping IW.commit.
   [junit4]   2> 3068480 INFO  (qtp837027100-24191) [n:127.0.0.1:40797_solr c:testcollection s:shard2 r:core_node7 x:testcollection_shard2_replica_n4] o.a.s.u.DirectUpdateHandler2 end_commit_flush
   [junit4]   2> 3068481 INFO  (qtp837027100-24191) [n:127.0.0.1:40797_solr c:testcollection s:shard2 r:core_node7 x:testcollection_shard2_replica_n4] o.a.s.u.p.LogUpdateProcessorFactory [testcollection_shard2_replica_n4]  webapp=/solr path=/update params={update.distrib=FROMLEADER&waitSearcher=true&openSearcher=true&commit=true&softCommit=false&distrib.from=http://127.0.0.1:51193/solr/testcollection_shard1_replica_n3/&commit_end_point=true&wt=javabin&version=2&expungeDeletes=false}{commit=} 0 4
   [junit4]   2> 3068500 INFO  (qtp1235440196-24195) [n:127.0.0.1:51193_solr c:testcollection s:shard1 r:core_node5 x:testcollection_shard1_replica_n3] o.a.s.s.SolrIndexSearcher Opening [Searcher@67aa6483[testcollection_shard1_replica_n3] main]
   [junit4]   2> 3068501 INFO  (qtp1235440196-24195) [n:127.0.0.1:51193_solr c:testcollection s:shard1 r:core_node5 x:testcollection_shard1_replica_n3] o.a.s.u.DirectUpdateHandler2 end_commit_flush
   [junit4]   2> 3068502 INFO  (qtp837027100-24200) [n:127.0.0.1:40797_solr c:testcollection s:shard1 r:core_node2 x:testcollection_shard1_replica_n1] o.a.s.s.SolrIndexSearcher Opening [Searcher@6a879b2b[testcollection_shard1_replica_n1] main]
   [junit4]   2> 3068503 INFO  (qtp837027100-24200) [n:127.0.0.1:40797_solr c:testcollection s:shard1 r:core_node2 x:testcollection_shard1_replica_n1] o.a.s.u.DirectUpdateHandler2 end_commit_flush
   [junit4]   2> 3068512 INFO  (searcherExecutor-10266-thread-1-processing-n:127.0.0.1:40797_solr x:testcollection_shard1_replica_n1 s:shard1 c:testcollection r:core_node2) [n:127.0.0.1:40797_solr c:testcollection s:shard1 r:core_node2 x:testcollection_shard1_replica_n1] o.a.s.c.SolrCore [testcollection_shard1_replica_n1] Registered new searcher Searcher@6a879b2b[testcollection_shard1_replica_n1] main{ExitableDirectoryReader(UninvertingDirectoryReader(Uninverting(_0(7.1.0):C1)))}
   [junit4]   2> 3068512 INFO  (qtp837027100-24200) [n:127.0.0.1:40797_solr c:testcollection s:shard1 r:core_node2 x:testcollection_shard1_replica_n1] o.a.s.u.p.LogUpdateProcessorFactory [testcollection_shard1_replica_n1]  webapp=/solr path=/update params={update.distrib=FROMLEADER&waitSearcher=true&openSearcher=true&commit=true&softCommit=false&distrib.from=http://127.0.0.1:51193/solr/testcollection_shard1_replica_n3/&commit_end_point=true&wt=javabin&version=2&expungeDeletes=false}{commit=} 0 38
   [junit4]   2> 3068512 INFO  (searcherExecutor-10265-thread-1-processing-n:127.0.0.1:51193_solr x:testcollection_shard1_replica_n3 s:shard1 c:testcollection r:core_node5) [n:127.0.0.1:51193_solr c:testcollection s:shard1 r:core_node5 x:testcollection_shard1_replica_n3] o.a.s.c.SolrCore [testcollection_shard1_replica_n3] Registered new searcher Searcher@67aa6483[testcollection_shard1_replica_n3] main{ExitableDirectoryReader(UninvertingDirectoryReader(Uninverting(_0(7.1.0):C1)))}
   [junit4]   2> 3068516 INFO  (qtp1235440196-24195) [n:127.0.0.1:51193_solr c:testcollection s:shard1 r:core_node5 x:testcollection_shard1_replica_n3] o.a.s.u.p.LogUpdateProcessorFactory [testcollection_shard1_replica_n3]  webapp=/solr path=/update params={update.distrib=FROMLEADER&waitSearcher=true&openSearcher=true&commit=true&softCommit=false&distrib.from=http://127.0.0.1:51193/solr/testcollection_shard1_replica_n3/&commit_end_point=true&wt=javabin&version=2&expungeDeletes=false}{commit=} 0 40
   [junit4]   2> 3068518 INFO  (qtp1235440196-24206) [n:127.0.0.1:51193_solr c:testcollection s:shard1 r:core_node5 x:testcollection_shard1_replica_n3] o.a.s.u.p.LogUpdateProcessorFactory [testcollection_shard1_replica_n3]  webapp=/solr path=/update params={_stateVer_=testcollection:7&commit=true&wt=javabin&version=2}{commit=} 0 46
   [junit4]   2> 3068524 INFO  (qtp837027100-24198) [n:127.0.0.1:40797_solr c:testcollection s:shard2 r:core_node7 x:testcollection_shard2_replica_n4] o.a.s.c.S.Request [testcollection_shard2_replica_n4]  webapp=/solr path=/select params={df=text&distrib=false&_stateVer_=testcollection:7&fl=id&fl=score&shards.purpose=4&start=0&fsv=true&shard.url=http://127.0.0.1:40797/solr/testcollection_shard2_replica_n4/|http://127.0.0.1:51193/solr/testcollection_shard2_replica_n6/&rows=10&version=2&q=*:*&NOW=1505630849249&isShard=true&wt=javabin} hits=0 status=0 QTime=1
   [junit4]   2> 3068524 INFO  (qtp837027100-24199) [n:127.0.0.1:40797_solr c:testcollection s:shard1 r:core_node2 x:testcollection_shard1_replica_n1] o.a.s.c.S.Request [testcollection_shard1_replica_n1]  webapp=/solr path=/select params={df=text&distrib=false&_stateVer_=testcollection:7&fl=id&fl=score&shards.purpose=4&start=0&fsv=true&shard.url=http://127.0.0.1:40797/solr/testcollection_shard1_replica_n1/|http://127.0.0.1:51193/solr/testcollection_shard1_replica_n3/&rows=10&version=2&q=*:*&NOW=1505630849249&isShard=true&wt=javabin} hits=1 status=0 QTime=0
   [junit4]   2> 3068527 INFO  (qtp837027100-24197) [n:127.0.0.1:40797_solr c:testcollection s:shard1 r:core_node2 x:testcollection_shard1_replica_n1] o.a.s.c.S.Request [testcollection_shard1_replica_n1]  webapp=/solr path=/select params={q=*:*&df=text&distrib=false&_stateVer_=testcollection:7&shards.purpose=64&NOW=1505630849249&ids=1&isShard=true&shard.url=http://127.0.0.1:40797/solr/testcollection_shard1_replica_n1/|http://127.0.0.1:51193/solr/testcollection_shard1_replica_n3/&wt=javabin&version=2} status=0 QTime=0
   [junit4]   2> 3068528 INFO  (qtp837027100-24196) [n:127.0.0.1:40797_solr c:testcollection s:shard2 r:core_node7 x:testcollection_shard2_replica_n4] o.a.s.c.S.Request [testcollection_shard2_replica_n4]  webapp=/solr path=/select params={q=*:*&_stateVer_=testcollection:7&wt=javabin&version=2} hits=1 status=0 QTime=8
   [junit4]   2> 3068529 INFO  (qtp1235440196-24201) [n:127.0.0.1:51193_solr    ] o.a.s.h.a.CollectionsHandler Invoked Collection Action :delete with params name=testcollection&action=DELETE&wt=javabin&version=2 and sendToOCPQueue=true
   [junit4]   2> 3068534 INFO  (OverseerCollectionConfigSetProcessor-98673023041208325-127.0.0.1:51193_solr-n_0000000000) [n:127.0.0.1:51193_solr    ] o.a.s.c.OverseerTaskQueue Response ZK path: /overseer/collection-queue-work/qnr-0000000000 doesn't exist.  Requestor may have disconnected from ZooKeeper
   [junit4]   2> 3068534 INFO  (OverseerThreadFactory-10259-thread-2-processing-n:127.0.0.1:51193_solr) [n:127.0.0.1:51193_solr    ] o.a.s.c.OverseerCollectionMessageHandler Executing Collection Cmd : action=UNLOAD&deleteInstanceDir=true&deleteDataDir=true
   [junit4]   2> 3068536 INFO  (qtp837027100-24191) [n:127.0.0.1:40797_solr    ] o.a.s.m.SolrMetricManager Closing metric reporters for registry=solr.core.testcollection.shard2.replica_n4, tag=null
   [junit4]   2> 3068536 INFO  (qtp837027100-24191) [n:127.0.0.1:40797_solr    ] o.a.s.m.r.SolrJmxReporter Closing reporter [org.apache.solr.metrics.reporters.SolrJmxReporter@65b1ab6: rootName = solr_40797, domain = solr.core.testcollection.shard2.replica_n4, service url = null, agent id = null] for registry solr.core.testcollection.shard2.replica_n4 / com.codahale.metrics.MetricRegistry@5d032034
   [junit4]   2> 3068537 INFO  (qtp1235440196-24203) [n:127.0.0.1:51193_solr    ] o.a.s.m.SolrMetricManager Closing metric reporters for registry=solr.core.testcollection.shard2.replica_n6, tag=null
   [junit4]   2> 3068537 INFO  (qtp1235440196-24203) [n:127.0.0.1:51193_solr    ] o.a.s.m.r.SolrJmxReporter Closing reporter [org.apache.solr.metrics.reporters.SolrJmxReporter@695ccb74: rootName = solr_51193, domain = solr.core.testcollection.shard2.replica_n6, service url = null, agent id = null] for registry solr.core.testcollection.shard2.replica_n6 / com.codahale.metrics.MetricRegistry@1619be17
   [junit4]   2> 3068589 INFO  (qtp1235440196-24202) [n:127.0.0.1:51193_solr    ] o.a.s.m.SolrMetricManager Closing metric reporters for registry=solr.core.testcollection.shard1.replica_n3, tag=null
   [junit4]   2> 3068589 INFO  (qtp1235440196-24202) [n:127.0.0.1:51193_solr    ] o.a.s.m.r.SolrJmxReporter Closing reporter [org.apache.solr.metrics.reporters.SolrJmxReporter@4ff0e00b: rootName = solr_51193, domain = solr.core.testcollection.shard1.replica_n3, service url = null, agent id = null] for registry solr.core.testcollection.shard1.replica_n3 / com.codahale.metrics.MetricRegistry@234b1eab
   [junit4]   2> 3068593 INFO  (qtp837027100-24191) [n:127.0.0.1:40797_solr    ] o.a.s.c.SolrCore [testcollection_shard2_replica_n4]  CLOSING SolrCore org.apache.solr.core.SolrCore@72d53a2a
   [junit4]   2> 3068594 INFO  (qtp837027100-24191) [n:127.0.0.1:40797_solr    ] o.a.s.m.SolrMetricManager Closing metric reporters for registry=solr.core.testcollection.shard2.replica_n4, tag=1926576682
   [junit4]   2> 3068594 INFO  (qtp837027100-24191) [n:127.0.0.1:40797_solr    ] o.a.s.m.SolrMetricManager Closing metric reporters for registry=solr.collection.testcollection.shard2.leader, tag=1926576682
   [junit4]   2> 3068595 INFO  (qtp1235440196-24203) [n:127.0.0.1:51193_solr    ] o.a.s.c.SolrCore [testcollection_shard2_replica_n6]  CLOSING SolrCore org.apache.solr.core.SolrCore@5b99623a
   [junit4]   2> 3068595 INFO  (qtp837027100-24200) [n:127.0.0.1:40797_solr    ] o.a.s.m.SolrMetricManager Closing metric reporters for registry=solr.core.testcollection.shard1.replica_n1, tag=null
   [junit4]   2> 3068595 INFO  (qtp837027100-24200) [n:127.0.0.1:40797_solr    ] o.a.s.m.r.SolrJmxReporter Closing reporter [org.apache.solr.metrics.reporters.SolrJmxReporter@142f09df: rootName = solr_40797, domain = solr.core.testcollection.shard1.replica_n1, service url = null, agent id = null] for registry solr.core.testcollection.shard1.replica_n1 / com.codahale.metrics.MetricRegistry@76775e08
   [junit4]   2> 3068610 INFO  (qtp837027100-24191) [n:127.0.0.1:40797_solr    ] o.a.s.s.HttpSolrCall [admin] webapp=null path=/admin/cores params={deleteInstanceDir=true&core=testcollection_shard2_replica_n4&qt=/admin/cores&deleteDataDir=true&action=UNLOAD&wt=javabin&version=2} status=0 QTime=74
   [junit4]   2> 3068611 WARN  (zkCallback-5040-thread-1-processing-n:127.0.0.1:51193_solr) [n:127.0.0.1:51193_solr    ] o.a.s.c.LeaderElector 
   [junit4]   2> org.apache.solr.common.SolrException: SolrCore not found:testcollection_shard2_replica_n6 in []
   [junit4]   2> 	at org.apache.solr.cloud.ShardLeaderElectionContext.runLeaderProcess(ElectionContext.java:297)
   [junit4]   2> 	at org.apache.solr.cloud.LeaderElector.runIamLeaderProcess(LeaderElector.java:170)
   [junit4]   2> 	at org.apache.solr.cloud.LeaderElector.checkIfIamLeader(LeaderElector.java:135)
   [junit4]   2> 	at org.apache.solr.cloud.LeaderElector.access$200(LeaderElector.java:56)
   [junit4]   2> 	at org.apache.solr.cloud.LeaderElector$ElectionWatcher.process(LeaderElector.java:348)
   [junit4]   2> 	at org.apache.solr.common.cloud.SolrZkClient$3.lambda$process$0(SolrZkClient.java:269)
   [junit4]   2> 	at java.util.concurrent.Executors$RunnableAdapter.call(Executors.java:511)
   [junit4]   2> 	at java.util.concurrent.FutureTask.run(FutureTask.java:266)
   [junit4]   2> 	at org.apache.solr.common.util.ExecutorUtil$MDCAwareThreadPoolExecutor.lambda$execute$0(ExecutorUtil.java:188)
   [junit4]   2> 	at java.util.concurrent.ThreadPoolExecutor.runWorker(ThreadPoolExecutor.java:1149)
   [junit4]   2> 	at java.util.concurrent.ThreadPoolExecutor$Worker.run(ThreadPoolExecutor.java:624)
   [junit4]   2> 	at java.lang.Thread.run(Thread.java:748)
   [junit4]   2> 3068621 INFO  (qtp1235440196-24202) [n:127.0.0.1:51193_solr    ] o.a.s.c.SolrCore [testcollection_shard1_replica_n3]  CLOSING SolrCore org.apache.solr.core.SolrCore@3941afeb
   [junit4]   2> 3068622 INFO  (qtp1235440196-24202) [n:127.0.0.1:51193_solr    ] o.a.s.m.SolrMetricManager Closing metric reporters for registry=solr.core.testcollection.shard1.replica_n3, tag=960606187
   [junit4]   2> 3068622 INFO  (qtp1235440196-24202) [n:127.0.0.1:51193_solr    ] o.a.s.m.SolrMetricManager Closing metric reporters for registry=solr.collection.testcollection.shard1.leader, tag=960606187
   [junit4]   2> 3068623 INFO  (qtp1235440196-24203) [n:127.0.0.1:51193_solr    ] o.a.s.m.SolrMetricManager Closing metric reporters for registry=solr.core.testcollection.shard2.replica_n6, tag=1536778810
   [junit4]   2> 3068623 INFO  (qtp1235440196-24203) [n:127.0.0.1:51193_solr    ] o.a.s.m.SolrMetricManager Closing metric reporters for registry=solr.collection.testcollection.shard2.leader, tag=1536778810
   [junit4]   2> 3068636 INFO  (qtp837027100-24200) [n:127.0.0.1:40797_solr    ] o.a.s.c.SolrCore [testcollection_shard1_replica_n1]  CLOSING SolrCore org.apache.solr.core.SolrCore@6fca6a09
   [junit4]   2> 3068636 INFO  (qtp837027100-24200) [n:127.0.0.1:40797_solr    ] o.a.s.m.SolrMetricManager Closing metric reporters for registry=solr.core.testcollection.shard1.replica_n1, tag=1875536393
   [junit4]   2> 3068637 INFO  (qtp1235440196-24203) [n:127.0.0.1:51193_solr    ] o.a.s.c.ShardLeaderElectionContextBase No version found for ephemeral leader parent node, won't remove previous leader registration.
   [junit4]   2> 3068636 INFO  (qtp837027100-24200) [n:127.0.0.1:40797_solr    ] o.a.s.m.SolrMetricManager Closing metric reporters for registry=solr.collection.testcollection.shard1.leader, tag=1875536393
   [junit4]   2> 3068638 INFO  (qtp1235440196-24203) [n:127.0.0.1:51193_solr    ] o.a.s.s.HttpSolrCall [admin] webapp=null path=/admin/cores params={deleteInstanceDir=true&core=testcollection_shard2_replica_n6&qt=/admin/cores&deleteDataDir=true&action=UNLOAD&wt=javabin&version=2} status=0 QTime=101
   [junit4]   2> 3068647 INFO  (qtp837027100-24200) [n:127.0.0.1:40797_solr    ] o.a.s.c.ShardLeaderElectionContextBase No version found for ephemeral leader parent node, won't remove previous leader registration.
   [junit4]   2> 3068648 WARN  (zkCallback-5039-thread-2-processing-n:127.0.0.1:40797_solr) [n:127.0.0.1:40797_solr    ] o.a.s.c.LeaderElector Our node is no longer in line to be leader
   [junit4]   2> 3068649 INFO  (qtp1235440196-24202) [n:127.0.0.1:51193_solr    ] o.a.s.s.HttpSolrCall [admin] webapp=null path=/admin/cores params={deleteInstanceDir=true&core=testcollection_shard1_replica_n3&qt=/admin/cores&deleteDataDir=true&action=UNLOAD&wt=javabin&version=2} status=0 QTime=113
   [junit4]   2> 3068651 INFO  (qtp837027100-24200) [n:127.0.0.1:40797_solr    ] o.a.s.s.HttpSolrCall [admin] webapp=null path=/admin/cores params={deleteInstanceDir=true&core=testcollection_shard1_replica_n1&qt=/admin/cores&deleteDataDir=true&action=UNLOAD&wt=javabin&version=2} status=0 QTime=115
   [junit4]   2> 3069525 INFO  (qtp1235440196-24201) [n:127.0.0.1:51193_solr    ] o.a.s.s.HttpSolrCall [admin] webapp=null path=/admin/collections params={name=testcollection&action=DELETE&wt=javabin&version=2} status=0 QTime=996
   [junit4]   2> 3069525 INFO  (TEST-TestAuthenticationFramework.testBasics-seed#[C40CD8A653B12A21]) [    ] o.a.s.c.AbstractDistribZkTestBase Wait for collection to disappear - collection: testcollection failOnTimeout:true timeout (sec):330
   [junit4]   1> -
   [junit4]   2> 3069525 INFO  (TEST-TestAuthenticationFramework.testBasics-seed#[C40CD8A653B12A21]) [    ] o.a.s.c.AbstractDistribZkTestBase Collection has disappeared - collection: testcollection
   [junit4]   2> 3069526 INFO  (qtp1235440196-24204) [n:127.0.0.1:51193_solr    ] o.a.s.h.a.CollectionsHandler Invoked Collection Action :create with params async=14822e06-de12-49a5-81c8-8c0c4edebb0b&replicationFactor=2&collection.configName=solrCloudCollectionConfig&maxShardsPerNode=2&name=testcollection&nrtReplicas=2&action=CREATE&numShards=2&wt=javabin&version=2 and sendToOCPQueue=true
   [junit4]   2> 3069528 INFO  (qtp1235440196-24204) [n:127.0.0.1:51193_solr    ] o.a.s.s.HttpSolrCall [admin] webapp=null path=/admin/collections params={async=14822e06-de12-49a5-81c8-8c0c4edebb0b&replicationFactor=2&collection.configName=solrCloudCollectionConfig&maxShardsPerNode=2&name=testcollection&nrtReplicas=2&action=CREATE&numShards=2&wt=javabin&version=2} status=0 QTime=2
   [junit4]   2> 3069529 INFO  (qtp1235440196-24190) [n:127.0.0.1:51193_solr    ] o.a.s.h.a.CollectionsHandler Invoked Collection Action :requeststatus with params requestid=14822e06-de12-49a5-81c8-8c0c4edebb0b&action=REQUESTSTATUS&wt=javabin&version=2 and sendToOCPQueue=true
   [junit4]   2> 3069541 INFO  (qtp1235440196-24190) [n:127.0.0.1:51193_solr    ] o.a.s.s.HttpSolrCall [admin] webapp=null path=/admin/collections params={requestid=14822e06-de12-49a5-81c8-8c0c4edebb0b&action=REQUESTSTATUS&wt=javabin&version=2} status=0 QTime=11
   [junit4]   2> 3069543 INFO  (OverseerThreadFactory-10259-thread-3-processing-n:127.0.0.1:51193_solr) [n:127.0.0.1:51193_solr    ] o.a.s.c.CreateCollectionCmd Create collection testcollection
   [junit4]   2> 3069545 INFO  (OverseerCollectionConfigSetProcessor-98673023041208325-127.0.0.1:51193_solr-n_0000000000) [n:127.0.0.1:51193_solr    ] o.a.s.c.OverseerTaskQueue Response ZK path: /overseer/collection-queue-work/qnr-0000000002 doesn't exist.  Requestor may have disconnected from ZooKeeper
   [junit4]   2> 3069808 INFO  (OverseerStateUpdate-98673023041208325-127.0.0.1:51193_solr-n_0000000000) [n:127.0.0.1:51193_solr    ] o.a.s.c.o.SliceMutator createReplica() {
   [junit4]   2>   "operation":"ADDREPLICA",
   [junit4]   2>   "collection":"testcollection",
   [junit4]   2>   "shard":"shard1",
   [junit4]   2>   "core":"testcollection_shard1_replica_n1",
   [junit4]   2>   "state":"down",
   [junit4]   2>   "base_url":"http://127.0.0.1:51193/solr",
   [junit4]   2>   "type":"NRT"} 
   [junit4]   2> 3069819 INFO  (OverseerStateUpdate-98673023041208325-127.0.0.1:51193_solr-n_0000000000) [n:127.0.0.1:51193_solr    ] o.a.s.c.o.SliceMutator createReplica() {
   [junit4]   2>   "operation":"ADDREPLICA",
   [junit4]   2>   "collection":"testcollection",
   [junit4]   2>   "shard":"shard1",
   [junit4]   2>   "core":"testcollection_shard1_replica_n2",
   [junit4]   2>   "state":"down",
   [junit4]   2>   "base_url":"http://127.0.0.1:40797/solr",
   [junit4]   2>   "type":"NRT"} 
   [junit4]   2> 3069833 INFO  (OverseerStateUpdate-98673023041208325-127.0.0.1:51193_solr-n_0000000000) [n:127.0.0.1:51193_solr    ] o.a.s.c.o.SliceMutator createReplica() {
   [junit4]   2>   "operation":"ADDREPLICA",
   [junit4]   2>   "collection":"testcollection",
   [junit4]   2>   "shard":"shard2",
   [junit4]   2>   "core":"testcollection_shard2_replica_n4",
   [junit4]   2>   "state":"down",
   [junit4]   2>   "base_url":"http://127.0.0.1:51193/solr",
   [junit4]   2>   "type":"NRT"} 
   [junit4]   2> 3069856 INFO  (OverseerStateUpdate-98673023041208325-127.0.0.1:51193_solr-n_0000000000) [n:127.0.0.1:51193_solr    ] o.a.s.c.o.SliceMutator createReplica() {
   [junit4]   2>   "operation":"ADDREPLICA",
   [junit4]   2>   "collection":"testcollection",
   [junit4]   2>   "shard":"shard2",
   [junit4]   2>   "core":"testcollection_shard2_replica_n5",
   [junit4]   2>   "state":"down",
   [junit4]   2>   "base_url":"http://127.0.0.1:40797/solr",
   [junit4]   2>   "type":"NRT"} 
   [junit4]   2> 3070030 INFO  (qtp837027100-24198) [n:127.0.0.1:40797_solr    ] o.a.s.s.HttpSolrCall [admin] webapp=null path=/admin/cores params={qt=/admin/cores&collection.configName=solrCloudCollectionConfig&newCollection=true&collection=testcollection&version=2&replicaType=NRT&async=14822e06-de12-49a5-81c8-8c0c4edebb0b2645424986868925&coreNodeName=core_node6&name=testcollection_shard1_replica_n2&action=CREATE&numShards=2&shard=shard1&wt=javabin} status=0 QTime=0
   [junit4]   2> 3070031 INFO  (qtp1235440196-24195) [n:127.0.0.1:51193_solr    ] o.a.s.s.HttpSolrCall [admin] webapp=null path=/admin/cores params={qt=/admin/cores&collection.configName=solrCloudCollectionConfig&newCollection=true&collection=testcollection&version=2&replicaType=NRT&async=14822e06-de12-49a5-81c8-8c0c4edebb0b2645424990635916&coreNodeName=core_node7&name=testcollection_shard2_replica_n4&action=CREATE&numShards=2&shard=shard2&wt=javabin} status=0 QTime=0
   [junit4]   2> 3070032 INFO  (parallelCoreAdminExecutor-10262-thread-1-processing-n:127.0.0.1:51193_solr 14822e06-de12-49a5-81c8-8c0c4edebb0b26454249

[...truncated too long message...]

olr c:collection1_collection s:shard2 r:core_node4 x:collection1_collection_shard2_replica_n2] o.a.s.c.SolrCore [collection1_collection_shard2_replica_n2]  CLOSING SolrCore org.apache.solr.core.SolrCore@3827497b
   [junit4]   2> 163851 INFO  (coreCloseExecutor-681-thread-1) [n:127.0.0.1:47732_solr c:collection1_collection s:shard2 r:core_node4 x:collection1_collection_shard2_replica_n2] o.a.s.m.SolrMetricManager Closing metric reporters for registry=solr.core.collection1_collection.shard2.replica_n2, tag=942098811
   [junit4]   2> 163851 INFO  (coreCloseExecutor-681-thread-1) [n:127.0.0.1:47732_solr c:collection1_collection s:shard2 r:core_node4 x:collection1_collection_shard2_replica_n2] o.a.s.m.r.SolrJmxReporter Closing reporter [org.apache.solr.metrics.reporters.SolrJmxReporter@7264e70a: rootName = solr_47732, domain = solr.core.collection1_collection.shard2.replica_n2, service url = null, agent id = null] for registry solr.core.collection1_collection.shard2.replica_n2 / com.codahale.metrics.MetricRegistry@7bf218b4
   [junit4]   2> 163853 INFO  (zkCallback-1646-thread-1-processing-n:127.0.0.1:53490_solr x:collection1_collection_shard1_replica_n1 s:shard1 c:collection1_collection r:core_node3) [n:127.0.0.1:53490_solr c:collection1_collection s:shard1 r:core_node3 x:collection1_collection_shard1_replica_n1] o.a.s.c.c.ZkStateReader Updated live nodes from ZooKeeper... (3) -> (2)
   [junit4]   2> 163854 INFO  (coreCloseExecutor-679-thread-1) [n:127.0.0.1:53490_solr c:collection1_collection s:shard1 r:core_node3 x:collection1_collection_shard1_replica_n1] o.a.s.m.SolrMetricManager Closing metric reporters for registry=solr.collection.collection1_collection.shard1.leader, tag=665268470
   [junit4]   2> 163864 INFO  (jetty-closer-141-thread-1) [    ] o.a.s.c.Overseer Overseer (id=98673109260173322-127.0.0.1:53490_solr-n_0000000000) closing
   [junit4]   2> 163866 INFO  (OverseerStateUpdate-98673109260173322-127.0.0.1:53490_solr-n_0000000000) [n:127.0.0.1:53490_solr    ] o.a.s.c.Overseer Overseer Loop exiting : 127.0.0.1:53490_solr
   [junit4]   2> 163871 INFO  (coreCloseExecutor-681-thread-1) [n:127.0.0.1:47732_solr c:collection1_collection s:shard2 r:core_node4 x:collection1_collection_shard2_replica_n2] o.a.s.m.SolrMetricManager Closing metric reporters for registry=solr.collection.collection1_collection.shard2.leader, tag=942098811
   [junit4]   2> 163875 INFO  (zkCallback-162-thread-2-processing-n:127.0.0.1:47732_solr) [n:127.0.0.1:47732_solr    ] o.a.s.c.OverseerElectionContext I am going to be the leader 127.0.0.1:47732_solr
   [junit4]   2> 163875 INFO  (zkCallback-162-thread-1-processing-n:127.0.0.1:47732_solr) [n:127.0.0.1:47732_solr    ] o.a.s.c.c.ZkStateReader Updated live nodes from ZooKeeper... (2) -> (1)
   [junit4]   2> 163875 WARN  (zkCallback-161-thread-2-processing-n:127.0.0.1:53490_solr) [n:127.0.0.1:53490_solr    ] o.a.s.c.c.ZkStateReader ZooKeeper watch triggered, but Solr cannot talk to ZK: [KeeperErrorCode = Session expired for /live_nodes]
   [junit4]   2> 163876 INFO  (jetty-closer-141-thread-1) [    ] o.e.j.s.h.ContextHandler Stopped o.e.j.s.ServletContextHandler@493017eb{/solr,null,UNAVAILABLE}
   [junit4]   2> 165327 WARN  (zkCallback-156-thread-1-processing-n:127.0.0.1:58872_solr) [n:127.0.0.1:58872_solr    ] o.a.s.c.c.ZkStateReader ZooKeeper watch triggered, but Solr cannot talk to ZK: [KeeperErrorCode = Session expired for /live_nodes]
   [junit4]   2> 165328 INFO  (jetty-closer-141-thread-2) [    ] o.e.j.s.h.ContextHandler Stopped o.e.j.s.ServletContextHandler@595dca15{/solr,null,UNAVAILABLE}
   [junit4]   2> 165347 WARN  (zkCallback-164-thread-1-processing-n:127.0.0.1:57239_solr) [n:127.0.0.1:57239_solr    ] o.a.s.c.c.ZkStateReader ZooKeeper watch triggered, but Solr cannot talk to ZK: [KeeperErrorCode = Session expired for /live_nodes]
   [junit4]   2> 165347 INFO  (jetty-closer-141-thread-4) [    ] o.e.j.s.h.ContextHandler Stopped o.e.j.s.ServletContextHandler@57ac351{/solr,null,UNAVAILABLE}
   [junit4]   2> 165386 WARN  (zkCallback-162-thread-2-processing-n:127.0.0.1:47732_solr) [n:127.0.0.1:47732_solr    ] o.a.s.c.c.ZkStateReader ZooKeeper watch triggered, but Solr cannot talk to ZK: [KeeperErrorCode = Session expired for /live_nodes]
   [junit4]   2> 165386 INFO  (jetty-closer-141-thread-3) [    ] o.e.j.s.h.ContextHandler Stopped o.e.j.s.ServletContextHandler@19e06067{/solr,null,UNAVAILABLE}
   [junit4]   2> 165390 ERROR (SUITE-StreamExpressionTest-seed#[41088374A0026D27]-worker) [    ] o.a.z.s.ZooKeeperServer ZKShutdownHandler is not registered, so ZooKeeper server won't take any action on ERROR or SHUTDOWN server state changes
   [junit4]   2> 165391 INFO  (SUITE-StreamExpressionTest-seed#[41088374A0026D27]-worker) [    ] o.a.s.c.ZkTestServer connecting to 127.0.0.1:59945 59945
   [junit4]   2> 171243 WARN  (NIOServerCxn.Factory:0.0.0.0/0.0.0.0:0) [    ] o.a.z.s.NIOServerCnxnFactory Ignoring unexpected runtime exception
   [junit4]   2> java.nio.channels.CancelledKeyException
   [junit4]   2> 	at sun.nio.ch.SelectionKeyImpl.ensureValid(SelectionKeyImpl.java:73)
   [junit4]   2> 	at sun.nio.ch.SelectionKeyImpl.readyOps(SelectionKeyImpl.java:87)
   [junit4]   2> 	at org.apache.zookeeper.server.NIOServerCnxnFactory.run(NIOServerCnxnFactory.java:182)
   [junit4]   2> 	at java.lang.Thread.run(Thread.java:748)
   [junit4]   2> 171245 INFO  (Thread-162) [    ] o.a.s.c.ZkTestServer connecting to 127.0.0.1:59945 59945
   [junit4]   2> 171248 WARN  (Thread-162) [    ] o.a.s.c.ZkTestServer Watch limit violations: 
   [junit4]   2> Maximum concurrent create/delete watches above limit:
   [junit4]   2> 
   [junit4]   2> 	74	/solr/aliases.json
   [junit4]   2> 	74	/solr/clusterprops.json
   [junit4]   2> 	13	/solr/configs/conf
   [junit4]   2> 	4	/solr/security.json
   [junit4]   2> 
   [junit4]   2> Maximum concurrent data watches above limit:
   [junit4]   2> 
   [junit4]   2> 	74	/solr/clusterstate.json
   [junit4]   2> 	20	/solr/collections/destination/state.json
   [junit4]   2> 	20	/solr/collections/parallelDestinationCollection/state.json
   [junit4]   2> 	20	/solr/collections/destinationCollection/state.json
   [junit4]   2> 	20	/solr/collections/mainCorpus/state.json
   [junit4]   2> 	18	/solr/collections/workQueue/state.json
   [junit4]   2> 	18	/solr/collections/parallelDestinationCollection1/state.json
   [junit4]   2> 	10	/solr/collections/collection1_collection/state.json
   [junit4]   2> 	2	/solr/overseer_elect/election/98673109260173322-127.0.0.1:53490_solr-n_0000000000
   [junit4]   2> 
   [junit4]   2> Maximum concurrent children watches above limit:
   [junit4]   2> 
   [junit4]   2> 	74	/solr/live_nodes
   [junit4]   2> 	74	/solr/collections
   [junit4]   2> 
   [junit4]   2> NOTE: leaving temporary files on disk at: /export/home/jenkins/workspace/Lucene-Solr-7.x-Solaris/solr/build/solr-solrj/test/J0/temp/solr.client.solrj.io.stream.StreamExpressionTest_41088374A0026D27-001
   [junit4]   2> NOTE: test params are: codec=Asserting(Lucene70): {expr_s=PostingsFormat(name=Direct), join2_s=PostingsFormat(name=Memory), multiDefault=PostingsFormat(name=Memory), subject=PostingsFormat(name=Memory), a1_s=PostingsFormat(name=Memory), a2_s=PostingsFormat(name=Direct), test_t=PostingsFormat(name=MockRandom), level1_s=PostingsFormat(name=Direct), body_t=PostingsFormat(name=MockRandom), ident_s=PostingsFormat(name=Memory), s_multi=PostingsFormat(name=Direct), col_s=PostingsFormat(name=Memory), level2_s=PostingsFormat(name=Memory), a_ss=PostingsFormat(name=Memory), a_s=PostingsFormat(name=Direct), a_t=PostingsFormat(name=Memory), side_s=PostingsFormat(name=MockRandom), id=PostingsFormat(name=MockRandom), text=PostingsFormat(name=Direct)}, docValues:{expr_s=DocValuesFormat(name=Lucene70), join2_s=DocValuesFormat(name=Lucene70), multiDefault=DocValuesFormat(name=Lucene70), price_f=DocValuesFormat(name=Lucene70), a1_s=DocValuesFormat(name=Memory), a_f=DocValuesFormat(name=Memory), intDefault=DocValuesFormat(name=Memory), a2_s=DocValuesFormat(name=Lucene70), join1_i=DocValuesFormat(name=Lucene70), a_i=DocValuesFormat(name=Direct), join3_i=DocValuesFormat(name=Direct), test_i=DocValuesFormat(name=Lucene70), field_i=DocValuesFormat(name=Lucene70), level1_s=DocValuesFormat(name=Lucene70), s_multi=DocValuesFormat(name=Lucene70), col_s=DocValuesFormat(name=Memory), level2_s=DocValuesFormat(name=Memory), a_ss=DocValuesFormat(name=Lucene70), a_s=DocValuesFormat(name=Lucene70), id=DocValuesFormat(name=Direct), timestamp=DocValuesFormat(name=Lucene70), i_multi=DocValuesFormat(name=Direct), b_ls=DocValuesFormat(name=Memory), test_dt=DocValuesFormat(name=Lucene70), ident_s=DocValuesFormat(name=Memory), order_i=DocValuesFormat(name=Lucene70), _version_=DocValuesFormat(name=Memory), side_s=DocValuesFormat(name=Direct), miles_i=DocValuesFormat(name=Memory)}, maxPointsInLeafNode=1419, maxMBSortInHeap=5.706977194871927, sim=RandomSimilarity(queryNorm=true): {}, locale=en-AU, timezone=Africa/Asmara
   [junit4]   2> NOTE: SunOS 5.11 amd64/Oracle Corporation 1.8.0_141 (64-bit)/cpus=3,threads=1,free=123520736,total=293605376
   [junit4]   2> NOTE: All tests run in this JVM: [TestJavaBinCodec, NaturalLogEvaluatorTest, JDBCStreamTest, FieldAnalysisResponseTest, HyperbolicTangentEvaluatorTest, TestV2Request, RoundEvaluatorTest, NamedListTest, TangentEvaluatorTest, HttpSolrClientConPoolTest, TestUpdateRequestCodec, TermsResponseTest, ConcurrentUpdateSolrClientTest, HyperbolicCosineEvaluatorTest, TestSolrProperties, TestSpellCheckResponse, UniformDistributionEvaluatorTest, EqualToEvaluatorTest, AndEvaluatorTest, CloudSolrClientCacheTest, DivideEvaluatorTest, OperationsTest, FieldValueEvaluatorTest, JdbcDriverTest, ModuloEvaluatorTest, SolrDocumentTest, ArcCosineEvaluatorTest, SolrExampleEmbeddedTest, RegressionEvaluatorTest, TestCoreAdmin, TestSolrJErrorHandling, StreamExpressionTest]
   [junit4] Completed [92/145 (1!)] on J0 in 85.51s, 109 tests, 1 failure, 9 skipped <<< FAILURES!

[...truncated 45516 lines...]

[JENKINS] Lucene-Solr-7.x-Solaris (64bit/jdk1.8.0) - Build # 189 - Still Unstable!

Posted by Policeman Jenkins Server <je...@thetaphi.de>.
Build: https://jenkins.thetaphi.de/job/Lucene-Solr-7.x-Solaris/189/
Java: 64bit/jdk1.8.0 -XX:+UseCompressedOops -XX:+UseG1GC

2 tests failed.
FAILED:  org.apache.solr.handler.extraction.TestExtractionDateUtil.testParseDate

Error Message:
Incorrect parsed timestamp: 1226583351000 != 1226579751000 (Thu Nov 13 04:35:51 AKST 2008)

Stack Trace:
java.lang.AssertionError: Incorrect parsed timestamp: 1226583351000 != 1226579751000 (Thu Nov 13 04:35:51 AKST 2008)
	at __randomizedtesting.SeedInfo.seed([A18DA6CC3D8DD45D:EB94DEF94624A3E8]:0)
	at org.junit.Assert.fail(Assert.java:93)
	at org.junit.Assert.assertTrue(Assert.java:43)
	at org.apache.solr.handler.extraction.TestExtractionDateUtil.assertParsedDate(TestExtractionDateUtil.java:59)
	at org.apache.solr.handler.extraction.TestExtractionDateUtil.testParseDate(TestExtractionDateUtil.java:54)
	at sun.reflect.NativeMethodAccessorImpl.invoke0(Native Method)
	at sun.reflect.NativeMethodAccessorImpl.invoke(NativeMethodAccessorImpl.java:62)
	at sun.reflect.DelegatingMethodAccessorImpl.invoke(DelegatingMethodAccessorImpl.java:43)
	at java.lang.reflect.Method.invoke(Method.java:498)
	at com.carrotsearch.randomizedtesting.RandomizedRunner.invoke(RandomizedRunner.java:1737)
	at com.carrotsearch.randomizedtesting.RandomizedRunner$8.evaluate(RandomizedRunner.java:934)
	at com.carrotsearch.randomizedtesting.RandomizedRunner$9.evaluate(RandomizedRunner.java:970)
	at com.carrotsearch.randomizedtesting.RandomizedRunner$10.evaluate(RandomizedRunner.java:984)
	at org.apache.lucene.util.TestRuleSetupTeardownChained$1.evaluate(TestRuleSetupTeardownChained.java:49)
	at org.apache.lucene.util.AbstractBeforeAfterRule$1.evaluate(AbstractBeforeAfterRule.java:45)
	at org.apache.lucene.util.TestRuleThreadAndTestName$1.evaluate(TestRuleThreadAndTestName.java:48)
	at org.apache.lucene.util.TestRuleIgnoreAfterMaxFailures$1.evaluate(TestRuleIgnoreAfterMaxFailures.java:64)
	at org.apache.lucene.util.TestRuleMarkFailure$1.evaluate(TestRuleMarkFailure.java:47)
	at com.carrotsearch.randomizedtesting.rules.StatementAdapter.evaluate(StatementAdapter.java:36)
	at com.carrotsearch.randomizedtesting.ThreadLeakControl$StatementRunner.run(ThreadLeakControl.java:368)
	at com.carrotsearch.randomizedtesting.ThreadLeakControl.forkTimeoutingTask(ThreadLeakControl.java:817)
	at com.carrotsearch.randomizedtesting.ThreadLeakControl$3.evaluate(ThreadLeakControl.java:468)
	at com.carrotsearch.randomizedtesting.RandomizedRunner.runSingleTest(RandomizedRunner.java:943)
	at com.carrotsearch.randomizedtesting.RandomizedRunner$5.evaluate(RandomizedRunner.java:829)
	at com.carrotsearch.randomizedtesting.RandomizedRunner$6.evaluate(RandomizedRunner.java:879)
	at com.carrotsearch.randomizedtesting.RandomizedRunner$7.evaluate(RandomizedRunner.java:890)
	at org.apache.lucene.util.AbstractBeforeAfterRule$1.evaluate(AbstractBeforeAfterRule.java:45)
	at com.carrotsearch.randomizedtesting.rules.StatementAdapter.evaluate(StatementAdapter.java:36)
	at org.apache.lucene.util.TestRuleStoreClassName$1.evaluate(TestRuleStoreClassName.java:41)
	at com.carrotsearch.randomizedtesting.rules.NoShadowingOrOverridesOnMethodsRule$1.evaluate(NoShadowingOrOverridesOnMethodsRule.java:40)
	at com.carrotsearch.randomizedtesting.rules.NoShadowingOrOverridesOnMethodsRule$1.evaluate(NoShadowingOrOverridesOnMethodsRule.java:40)
	at com.carrotsearch.randomizedtesting.rules.StatementAdapter.evaluate(StatementAdapter.java:36)
	at com.carrotsearch.randomizedtesting.rules.StatementAdapter.evaluate(StatementAdapter.java:36)
	at com.carrotsearch.randomizedtesting.rules.StatementAdapter.evaluate(StatementAdapter.java:36)
	at org.apache.lucene.util.TestRuleAssertionsRequired$1.evaluate(TestRuleAssertionsRequired.java:53)
	at org.apache.lucene.util.TestRuleMarkFailure$1.evaluate(TestRuleMarkFailure.java:47)
	at org.apache.lucene.util.TestRuleIgnoreAfterMaxFailures$1.evaluate(TestRuleIgnoreAfterMaxFailures.java:64)
	at org.apache.lucene.util.TestRuleIgnoreTestSuites$1.evaluate(TestRuleIgnoreTestSuites.java:54)
	at com.carrotsearch.randomizedtesting.rules.StatementAdapter.evaluate(StatementAdapter.java:36)
	at com.carrotsearch.randomizedtesting.ThreadLeakControl$StatementRunner.run(ThreadLeakControl.java:368)
	at java.lang.Thread.run(Thread.java:748)


FAILED:  org.apache.solr.update.AutoCommitTest.testCommitWithin

Error Message:
Exception during query

Stack Trace:
java.lang.RuntimeException: Exception during query
	at __randomizedtesting.SeedInfo.seed([3DF2F86D09227D36:872097158A0C9323]:0)
	at org.apache.solr.SolrTestCaseJ4.assertQ(SolrTestCaseJ4.java:884)
	at org.apache.solr.update.AutoCommitTest.testCommitWithin(AutoCommitTest.java:353)
	at sun.reflect.NativeMethodAccessorImpl.invoke0(Native Method)
	at sun.reflect.NativeMethodAccessorImpl.invoke(NativeMethodAccessorImpl.java:62)
	at sun.reflect.DelegatingMethodAccessorImpl.invoke(DelegatingMethodAccessorImpl.java:43)
	at java.lang.reflect.Method.invoke(Method.java:498)
	at com.carrotsearch.randomizedtesting.RandomizedRunner.invoke(RandomizedRunner.java:1737)
	at com.carrotsearch.randomizedtesting.RandomizedRunner$8.evaluate(RandomizedRunner.java:934)
	at com.carrotsearch.randomizedtesting.RandomizedRunner$9.evaluate(RandomizedRunner.java:970)
	at com.carrotsearch.randomizedtesting.RandomizedRunner$10.evaluate(RandomizedRunner.java:984)
	at com.carrotsearch.randomizedtesting.rules.SystemPropertiesRestoreRule$1.evaluate(SystemPropertiesRestoreRule.java:57)
	at org.apache.lucene.util.TestRuleSetupTeardownChained$1.evaluate(TestRuleSetupTeardownChained.java:49)
	at org.apache.lucene.util.AbstractBeforeAfterRule$1.evaluate(AbstractBeforeAfterRule.java:45)
	at org.apache.lucene.util.TestRuleThreadAndTestName$1.evaluate(TestRuleThreadAndTestName.java:48)
	at org.apache.lucene.util.TestRuleIgnoreAfterMaxFailures$1.evaluate(TestRuleIgnoreAfterMaxFailures.java:64)
	at org.apache.lucene.util.TestRuleMarkFailure$1.evaluate(TestRuleMarkFailure.java:47)
	at com.carrotsearch.randomizedtesting.rules.StatementAdapter.evaluate(StatementAdapter.java:36)
	at com.carrotsearch.randomizedtesting.ThreadLeakControl$StatementRunner.run(ThreadLeakControl.java:368)
	at com.carrotsearch.randomizedtesting.ThreadLeakControl.forkTimeoutingTask(ThreadLeakControl.java:817)
	at com.carrotsearch.randomizedtesting.ThreadLeakControl$3.evaluate(ThreadLeakControl.java:468)
	at com.carrotsearch.randomizedtesting.RandomizedRunner.runSingleTest(RandomizedRunner.java:943)
	at com.carrotsearch.randomizedtesting.RandomizedRunner$5.evaluate(RandomizedRunner.java:829)
	at com.carrotsearch.randomizedtesting.RandomizedRunner$6.evaluate(RandomizedRunner.java:879)
	at com.carrotsearch.randomizedtesting.RandomizedRunner$7.evaluate(RandomizedRunner.java:890)
	at com.carrotsearch.randomizedtesting.rules.StatementAdapter.evaluate(StatementAdapter.java:36)
	at com.carrotsearch.randomizedtesting.rules.SystemPropertiesRestoreRule$1.evaluate(SystemPropertiesRestoreRule.java:57)
	at org.apache.lucene.util.AbstractBeforeAfterRule$1.evaluate(AbstractBeforeAfterRule.java:45)
	at com.carrotsearch.randomizedtesting.rules.StatementAdapter.evaluate(StatementAdapter.java:36)
	at org.apache.lucene.util.TestRuleStoreClassName$1.evaluate(TestRuleStoreClassName.java:41)
	at com.carrotsearch.randomizedtesting.rules.NoShadowingOrOverridesOnMethodsRule$1.evaluate(NoShadowingOrOverridesOnMethodsRule.java:40)
	at com.carrotsearch.randomizedtesting.rules.NoShadowingOrOverridesOnMethodsRule$1.evaluate(NoShadowingOrOverridesOnMethodsRule.java:40)
	at com.carrotsearch.randomizedtesting.rules.StatementAdapter.evaluate(StatementAdapter.java:36)
	at com.carrotsearch.randomizedtesting.rules.StatementAdapter.evaluate(StatementAdapter.java:36)
	at com.carrotsearch.randomizedtesting.rules.StatementAdapter.evaluate(StatementAdapter.java:36)
	at org.apache.lucene.util.TestRuleAssertionsRequired$1.evaluate(TestRuleAssertionsRequired.java:53)
	at org.apache.lucene.util.TestRuleMarkFailure$1.evaluate(TestRuleMarkFailure.java:47)
	at org.apache.lucene.util.TestRuleIgnoreAfterMaxFailures$1.evaluate(TestRuleIgnoreAfterMaxFailures.java:64)
	at org.apache.lucene.util.TestRuleIgnoreTestSuites$1.evaluate(TestRuleIgnoreTestSuites.java:54)
	at com.carrotsearch.randomizedtesting.rules.StatementAdapter.evaluate(StatementAdapter.java:36)
	at com.carrotsearch.randomizedtesting.ThreadLeakControl$StatementRunner.run(ThreadLeakControl.java:368)
	at java.lang.Thread.run(Thread.java:748)
Caused by: java.lang.RuntimeException: REQUEST FAILED: xpath=//result[@numFound=1]
	xml response was: <?xml version="1.0" encoding="UTF-8"?>
<response>
<lst name="responseHeader"><int name="status">0</int><int name="QTime">0</int></lst><result name="response" numFound="0" start="0"></result>
</response>

	request was:q=id:529&qt=&start=0&rows=20&version=2.2
	at org.apache.solr.SolrTestCaseJ4.assertQ(SolrTestCaseJ4.java:877)
	... 40 more




Build Log:
[...truncated 12433 lines...]
   [junit4] Suite: org.apache.solr.update.AutoCommitTest
   [junit4]   2> 2000495 INFO  (SUITE-AutoCommitTest-seed#[3DF2F86D09227D36]-worker) [    ] o.a.s.SolrTestCaseJ4 SecureRandom sanity checks: test.solr.allowed.securerandom=null & java.security.egd=file:/dev/./urandom
   [junit4]   2> Creating dataDir: /export/home/jenkins/workspace/Lucene-Solr-7.x-Solaris/solr/build/solr-core/test/J0/temp/solr.update.AutoCommitTest_3DF2F86D09227D36-001/init-core-data-001
   [junit4]   2> 2000495 INFO  (SUITE-AutoCommitTest-seed#[3DF2F86D09227D36]-worker) [    ] o.a.s.SolrTestCaseJ4 Using PointFields (NUMERIC_POINTS_SYSPROP=true) w/NUMERIC_DOCVALUES_SYSPROP=true
   [junit4]   2> 2000496 INFO  (SUITE-AutoCommitTest-seed#[3DF2F86D09227D36]-worker) [    ] o.a.s.SolrTestCaseJ4 Randomized ssl (false) and clientAuth (false) via: @org.apache.solr.util.RandomizeSSL(reason=, value=NaN, ssl=NaN, clientAuth=NaN)
   [junit4]   2> 2000497 INFO  (SUITE-AutoCommitTest-seed#[3DF2F86D09227D36]-worker) [    ] o.a.s.SolrTestCaseJ4 ####initCore
   [junit4]   2> 2000497 INFO  (SUITE-AutoCommitTest-seed#[3DF2F86D09227D36]-worker) [    ] o.a.s.c.SolrResourceLoader [null] Added 2 libs to classloader, from paths: [/export/home/jenkins/workspace/Lucene-Solr-7.x-Solaris/solr/core/src/test-files/solr/collection1/lib, /export/home/jenkins/workspace/Lucene-Solr-7.x-Solaris/solr/core/src/test-files/solr/collection1/lib/classes]
   [junit4]   2> 2000527 INFO  (SUITE-AutoCommitTest-seed#[3DF2F86D09227D36]-worker) [    ] o.a.s.c.SolrConfig Using Lucene MatchVersion: 7.1.0
   [junit4]   2> 2000548 INFO  (SUITE-AutoCommitTest-seed#[3DF2F86D09227D36]-worker) [    ] o.a.s.s.IndexSchema [null] Schema name=test
   [junit4]   2> 2000608 INFO  (SUITE-AutoCommitTest-seed#[3DF2F86D09227D36]-worker) [    ] o.a.s.s.IndexSchema Loaded schema test/1.0 with uniqueid field id
   [junit4]   2> 2000640 INFO  (SUITE-AutoCommitTest-seed#[3DF2F86D09227D36]-worker) [    ] o.a.s.m.r.SolrJmxReporter JMX monitoring for 'solr.node' (registry 'solr.node') enabled at server: com.sun.jmx.mbeanserver.JmxMBeanServer@49e8ee88
   [junit4]   2> 2000646 INFO  (SUITE-AutoCommitTest-seed#[3DF2F86D09227D36]-worker) [    ] o.a.s.m.r.SolrJmxReporter JMX monitoring for 'solr.jvm' (registry 'solr.jvm') enabled at server: com.sun.jmx.mbeanserver.JmxMBeanServer@49e8ee88
   [junit4]   2> 2000646 INFO  (SUITE-AutoCommitTest-seed#[3DF2F86D09227D36]-worker) [    ] o.a.s.m.r.SolrJmxReporter JMX monitoring for 'solr.jetty' (registry 'solr.jetty') enabled at server: com.sun.jmx.mbeanserver.JmxMBeanServer@49e8ee88
   [junit4]   2> 2000647 INFO  (coreLoadExecutor-6717-thread-1) [    x:collection1] o.a.s.c.SolrResourceLoader [null] Added 2 libs to classloader, from paths: [/export/home/jenkins/workspace/Lucene-Solr-7.x-Solaris/solr/core/src/test-files/solr/collection1/lib, /export/home/jenkins/workspace/Lucene-Solr-7.x-Solaris/solr/core/src/test-files/solr/collection1/lib/classes]
   [junit4]   2> 2000670 INFO  (coreLoadExecutor-6717-thread-1) [    x:collection1] o.a.s.c.SolrConfig Using Lucene MatchVersion: 7.1.0
   [junit4]   2> 2000688 INFO  (coreLoadExecutor-6717-thread-1) [    x:collection1] o.a.s.s.IndexSchema [collection1] Schema name=test
   [junit4]   2> 2000760 INFO  (coreLoadExecutor-6717-thread-1) [    x:collection1] o.a.s.s.IndexSchema Loaded schema test/1.0 with uniqueid field id
   [junit4]   2> 2000766 INFO  (coreLoadExecutor-6717-thread-1) [    x:collection1] o.a.s.c.CoreContainer Creating SolrCore 'collection1' using configuration from instancedir /export/home/jenkins/workspace/Lucene-Solr-7.x-Solaris/solr/core/src/test-files/solr/collection1, trusted=true
   [junit4]   2> 2000766 INFO  (coreLoadExecutor-6717-thread-1) [    x:collection1] o.a.s.m.r.SolrJmxReporter JMX monitoring for 'solr.core.collection1' (registry 'solr.core.collection1') enabled at server: com.sun.jmx.mbeanserver.JmxMBeanServer@49e8ee88
   [junit4]   2> 2000766 INFO  (coreLoadExecutor-6717-thread-1) [    x:collection1] o.a.s.c.SolrCore solr.RecoveryStrategy.Builder
   [junit4]   2> 2000766 INFO  (coreLoadExecutor-6717-thread-1) [    x:collection1] o.a.s.c.SolrCore [[collection1] ] Opening new SolrCore at [/export/home/jenkins/workspace/Lucene-Solr-7.x-Solaris/solr/core/src/test-files/solr/collection1], dataDir=[/export/home/jenkins/workspace/Lucene-Solr-7.x-Solaris/solr/build/solr-core/test/J0/temp/solr.update.AutoCommitTest_3DF2F86D09227D36-001/init-core-data-001/]
   [junit4]   2> 2000767 INFO  (coreLoadExecutor-6717-thread-1) [    x:collection1] o.a.s.u.RandomMergePolicy RandomMergePolicy wrapping class org.apache.lucene.index.LogDocMergePolicy: [LogDocMergePolicy: minMergeSize=1000, mergeFactor=32, maxMergeSize=9223372036854775807, maxMergeSizeForForcedMerge=9223372036854775807, calibrateSizeByDeletes=false, maxMergeDocs=2147483647, maxCFSSegmentSizeMB=8.796093022207999E12, noCFSRatio=1.0]
   [junit4]   2> 2000815 INFO  (coreLoadExecutor-6717-thread-1) [    x:collection1] o.a.s.u.UpdateHandler Using UpdateLog implementation: org.apache.solr.update.UpdateLog
   [junit4]   2> 2000815 INFO  (coreLoadExecutor-6717-thread-1) [    x:collection1] o.a.s.u.UpdateLog Initializing UpdateLog: dataDir= defaultSyncLevel=FLUSH numRecordsToKeep=100 maxNumLogsToKeep=10 numVersionBuckets=65536
   [junit4]   2> 2000816 INFO  (coreLoadExecutor-6717-thread-1) [    x:collection1] o.a.s.u.CommitTracker Hard AutoCommit: disabled
   [junit4]   2> 2000816 INFO  (coreLoadExecutor-6717-thread-1) [    x:collection1] o.a.s.u.CommitTracker Soft AutoCommit: disabled
   [junit4]   2> 2000817 INFO  (coreLoadExecutor-6717-thread-1) [    x:collection1] o.a.s.u.RandomMergePolicy RandomMergePolicy wrapping class org.apache.lucene.index.LogByteSizeMergePolicy: [LogByteSizeMergePolicy: minMergeSize=1677721, mergeFactor=28, maxMergeSize=2147483648, maxMergeSizeForForcedMerge=9223372036854775807, calibrateSizeByDeletes=true, maxMergeDocs=2147483647, maxCFSSegmentSizeMB=8.796093022207999E12, noCFSRatio=0.10566543442241577]
   [junit4]   2> 2000817 INFO  (coreLoadExecutor-6717-thread-1) [    x:collection1] o.a.s.s.SolrIndexSearcher Opening [Searcher@6c3bf681[collection1] main]
   [junit4]   2> 2000818 INFO  (coreLoadExecutor-6717-thread-1) [    x:collection1] o.a.s.h.c.SpellCheckComponent Initializing spell checkers
   [junit4]   2> 2000824 INFO  (coreLoadExecutor-6717-thread-1) [    x:collection1] o.a.s.s.DirectSolrSpellChecker init: {name=direct,classname=DirectSolrSpellChecker,field=lowerfilt,minQueryLength=3}
   [junit4]   2> 2000836 INFO  (coreLoadExecutor-6717-thread-1) [    x:collection1] o.a.s.h.ReplicationHandler Commits will be reserved for  10000
   [junit4]   2> 2000837 INFO  (coreLoadExecutor-6717-thread-1) [    x:collection1] o.a.s.u.UpdateLog Could not find max version in index or recent updates, using new clock 1578824629761343488
   [junit4]   2> 2000837 INFO  (searcherExecutor-6718-thread-1-processing-x:collection1) [    x:collection1] o.a.s.h.c.SpellCheckComponent Loading spell index for spellchecker: default
   [junit4]   2> 2000837 INFO  (searcherExecutor-6718-thread-1-processing-x:collection1) [    x:collection1] o.a.s.h.c.SpellCheckComponent Loading spell index for spellchecker: direct
   [junit4]   2> 2000837 INFO  (searcherExecutor-6718-thread-1-processing-x:collection1) [    x:collection1] o.a.s.h.c.SpellCheckComponent Loading spell index for spellchecker: wordbreak
   [junit4]   2> 2000837 INFO  (searcherExecutor-6718-thread-1-processing-x:collection1) [    x:collection1] o.a.s.h.c.SpellCheckComponent Loading spell index for spellchecker: multipleFields
   [junit4]   2> 2000838 INFO  (searcherExecutor-6718-thread-1-processing-x:collection1) [    x:collection1] o.a.s.h.c.SpellCheckComponent Loading spell index for spellchecker: jarowinkler
   [junit4]   2> 2000838 INFO  (searcherExecutor-6718-thread-1-processing-x:collection1) [    x:collection1] o.a.s.h.c.SpellCheckComponent Loading spell index for spellchecker: external
   [junit4]   2> 2000838 INFO  (searcherExecutor-6718-thread-1-processing-x:collection1) [    x:collection1] o.a.s.h.c.SpellCheckComponent Loading spell index for spellchecker: freq
   [junit4]   2> 2000839 INFO  (searcherExecutor-6718-thread-1-processing-x:collection1) [    x:collection1] o.a.s.h.c.SpellCheckComponent Loading spell index for spellchecker: fqcn
   [junit4]   2> 2000839 INFO  (SUITE-AutoCommitTest-seed#[3DF2F86D09227D36]-worker) [    ] o.a.s.SolrTestCaseJ4 ####initCore end
   [junit4]   2> 2000839 INFO  (searcherExecutor-6718-thread-1-processing-x:collection1) [    x:collection1] o.a.s.h.c.SpellCheckComponent Loading spell index for spellchecker: perDict
   [junit4]   2> 2000843 INFO  (TEST-AutoCommitTest.testMaxTime-seed#[3DF2F86D09227D36]) [    ] o.a.s.SolrTestCaseJ4 ###Starting testMaxTime
   [junit4]   2> 2000843 INFO  (searcherExecutor-6718-thread-1-processing-x:collection1) [    x:collection1] o.a.s.c.SolrCore [collection1] Registered new searcher Searcher@6c3bf681[collection1] main{ExitableDirectoryReader(UninvertingDirectoryReader())}
   [junit4]   2> 2000843 INFO  (TEST-AutoCommitTest.testMaxTime-seed#[3DF2F86D09227D36]) [    ] o.a.s.u.DirectUpdateHandler2 [collection1] REMOVING ALL DOCUMENTS FROM INDEX
   [junit4]   2> 2000844 INFO  (TEST-AutoCommitTest.testMaxTime-seed#[3DF2F86D09227D36]) [    ] o.a.s.s.SolrIndexSearcher Opening [Searcher@6f9b0cc[collection1] realtime]
   [junit4]   2> 2000844 INFO  (TEST-AutoCommitTest.testMaxTime-seed#[3DF2F86D09227D36]) [    ] o.a.s.u.p.LogUpdateProcessorFactory [collection1]  webapp=null path=null params={_version_=-9223372036854775807&update.distrib=FROMLEADER&versions=true&wt=json&indent=true}{deleteByQuery=*:* (-9223372036854775807)} 0 1
   [junit4]   2> 2000844 ERROR (TEST-AutoCommitTest.testMaxTime-seed#[3DF2F86D09227D36]) [    ] o.a.s.c.CorePropertiesLocator Couldn't load core descriptor from /export/home/jenkins/workspace/Lucene-Solr-7.x-Solaris/solr/core/src/test-files/solr/collection1/core.properties:java.nio.file.NoSuchFileException: /export/home/jenkins/workspace/Lucene-Solr-7.x-Solaris/solr/core/src/test-files/solr/collection1/core.properties
   [junit4]   2> 2000845 INFO  (TEST-AutoCommitTest.testMaxTime-seed#[3DF2F86D09227D36]) [    ] o.a.s.c.SolrResourceLoader [null] Added 2 libs to classloader, from paths: [/export/home/jenkins/workspace/Lucene-Solr-7.x-Solaris/solr/core/src/test-files/solr/collection1/lib, /export/home/jenkins/workspace/Lucene-Solr-7.x-Solaris/solr/core/src/test-files/solr/collection1/lib/classes]
   [junit4]   2> 2000867 INFO  (TEST-AutoCommitTest.testMaxTime-seed#[3DF2F86D09227D36]) [    ] o.a.s.c.SolrConfig Using Lucene MatchVersion: 7.1.0
   [junit4]   2> 2000882 INFO  (TEST-AutoCommitTest.testMaxTime-seed#[3DF2F86D09227D36]) [    ] o.a.s.s.IndexSchema [collection1] Schema name=test
   [junit4]   2> 2000961 INFO  (TEST-AutoCommitTest.testMaxTime-seed#[3DF2F86D09227D36]) [    ] o.a.s.s.IndexSchema Loaded schema test/1.0 with uniqueid field id
   [junit4]   2> 2000968 INFO  (TEST-AutoCommitTest.testMaxTime-seed#[3DF2F86D09227D36]) [    ] o.a.s.c.CoreContainer Reloading SolrCore 'collection1' using configuration from instancedir /export/home/jenkins/workspace/Lucene-Solr-7.x-Solaris/solr/core/src/test-files/solr/collection1
   [junit4]   2> 2000998 INFO  (TEST-AutoCommitTest.testMaxTime-seed#[3DF2F86D09227D36]) [    x:collection1] o.a.s.m.r.SolrJmxReporter JMX monitoring for 'solr.core.collection1' (registry 'solr.core.collection1') enabled at server: com.sun.jmx.mbeanserver.JmxMBeanServer@49e8ee88
   [junit4]   2> 2000999 INFO  (TEST-AutoCommitTest.testMaxTime-seed#[3DF2F86D09227D36]) [    x:collection1] o.a.s.c.SolrCore [[collection1] ] Opening new SolrCore at [/export/home/jenkins/workspace/Lucene-Solr-7.x-Solaris/solr/core/src/test-files/solr/collection1], dataDir=[/export/home/jenkins/workspace/Lucene-Solr-7.x-Solaris/solr/build/solr-core/test/J0/temp/solr.update.AutoCommitTest_3DF2F86D09227D36-001/init-core-data-001/]
   [junit4]   2> 2001052 INFO  (TEST-AutoCommitTest.testMaxTime-seed#[3DF2F86D09227D36]) [    x:collection1] o.a.s.u.CommitTracker Hard AutoCommit: disabled
   [junit4]   2> 2001052 INFO  (TEST-AutoCommitTest.testMaxTime-seed#[3DF2F86D09227D36]) [    x:collection1] o.a.s.u.CommitTracker Soft AutoCommit: disabled
   [junit4]   2> 2001053 INFO  (TEST-AutoCommitTest.testMaxTime-seed#[3DF2F86D09227D36]) [    x:collection1] o.a.s.s.SolrIndexSearcher Opening [Searcher@76960582[collection1] main]
   [junit4]   2> 2001054 INFO  (TEST-AutoCommitTest.testMaxTime-seed#[3DF2F86D09227D36]) [    x:collection1] o.a.s.h.c.SpellCheckComponent Initializing spell checkers
   [junit4]   2> 2001054 INFO  (TEST-AutoCommitTest.testMaxTime-seed#[3DF2F86D09227D36]) [    x:collection1] o.a.s.s.DirectSolrSpellChecker init: {name=direct,classname=DirectSolrSpellChecker,field=lowerfilt,minQueryLength=3}
   [junit4]   2> 2001057 INFO  (TEST-AutoCommitTest.testMaxTime-seed#[3DF2F86D09227D36]) [    x:collection1] o.a.s.h.ReplicationHandler Commits will be reserved for  10000
   [junit4]   2> 2001057 INFO  (TEST-AutoCommitTest.testMaxTime-seed#[3DF2F86D09227D36]) [    x:collection1] o.a.s.u.UpdateLog Could not find max version in index or recent updates, using new clock 1578824629992030208
   [junit4]   2> 2001058 INFO  (searcherExecutor-6723-thread-1-processing-x:collection1) [    x:collection1] o.a.s.h.c.SpellCheckComponent Loading spell index for spellchecker: default
   [junit4]   2> 2001060 INFO  (TEST-AutoCommitTest.testMaxTime-seed#[3DF2F86D09227D36]) [    x:collection1] o.a.s.u.RandomMergePolicy RandomMergePolicy wrapping class org.apache.lucene.index.TieredMergePolicy: [TieredMergePolicy: maxMergeAtOnce=18, maxMergeAtOnceExplicit=36, maxMergedSegmentMB=54.791015625, floorSegmentMB=1.8837890625, forceMergeDeletesPctAllowed=1.0440884542929585, segmentsPerTier=48.0, maxCFSSegmentSizeMB=8.796093022207999E12, noCFSRatio=0.8470799807117095
   [junit4]   2> 2001060 INFO  (TEST-AutoCommitTest.testMaxTime-seed#[3DF2F86D09227D36]) [    x:collection1] o.a.s.u.DefaultSolrCoreState New IndexWriter is ready to be used.
   [junit4]   2> 2001060 INFO  (searcherExecutor-6723-thread-1-processing-x:collection1) [    x:collection1] o.a.s.h.c.SpellCheckComponent Loading spell index for spellchecker: direct
   [junit4]   2> 2001060 INFO  (searcherExecutor-6723-thread-1-processing-x:collection1) [    x:collection1] o.a.s.h.c.SpellCheckComponent Loading spell index for spellchecker: wordbreak
   [junit4]   2> 2001060 INFO  (searcherExecutor-6723-thread-1-processing-x:collection1) [    x:collection1] o.a.s.h.c.SpellCheckComponent Loading spell index for spellchecker: multipleFields
   [junit4]   2> 2001061 INFO  (searcherExecutor-6723-thread-1-processing-x:collection1) [    x:collection1] o.a.s.h.c.SpellCheckComponent Loading spell index for spellchecker: jarowinkler
   [junit4]   2> 2001061 INFO  (searcherExecutor-6723-thread-1-processing-x:collection1) [    x:collection1] o.a.s.h.c.SpellCheckComponent Loading spell index for spellchecker: external
   [junit4]   2> 2001061 INFO  (searcherExecutor-6723-thread-1-processing-x:collection1) [    x:collection1] o.a.s.h.c.SpellCheckComponent Loading spell index for spellchecker: freq
   [junit4]   2> 2001061 INFO  (searcherExecutor-6723-thread-1-processing-x:collection1) [    x:collection1] o.a.s.h.c.SpellCheckComponent Loading spell index for spellchecker: fqcn
   [junit4]   2> 2001061 INFO  (searcherExecutor-6723-thread-1-processing-x:collection1) [    x:collection1] o.a.s.h.c.SpellCheckComponent Loading spell index for spellchecker: perDict
   [junit4]   2> 2001064 INFO  (searcherExecutor-6723-thread-1-processing-x:collection1) [    x:collection1] o.a.s.c.SolrCore [collection1] Registered new searcher Searcher@76960582[collection1] main{ExitableDirectoryReader(UninvertingDirectoryReader())}
   [junit4]   2> 2001064 INFO  (TEST-AutoCommitTest.testMaxTime-seed#[3DF2F86D09227D36]) [    x:collection1] o.a.s.s.SolrIndexSearcher Opening [Searcher@7d626582[collection1] main]
   [junit4]   2> 2001064 INFO  (TEST-AutoCommitTest.testMaxTime-seed#[3DF2F86D09227D36]) [    x:collection1] o.a.s.c.SolrCore [collection1]  CLOSING SolrCore org.apache.solr.core.SolrCore@44b68453
   [junit4]   2> 2001064 INFO  (TEST-AutoCommitTest.testMaxTime-seed#[3DF2F86D09227D36]) [    x:collection1] o.a.s.m.SolrMetricManager Closing metric reporters for registry=solr.core.collection1, tag=1152812115
   [junit4]   2> 2001064 INFO  (TEST-AutoCommitTest.testMaxTime-seed#[3DF2F86D09227D36]) [    x:collection1] o.a.s.m.r.SolrJmxReporter Closing reporter [org.apache.solr.metrics.reporters.SolrJmxReporter@6d6a9dbc: rootName = null, domain = solr.core.collection1, service url = null, agent id = null] for registry solr.core.collection1 / com.codahale.metrics.MetricRegistry@196774d7
   [junit4]   2> 2001070 INFO  (searcherExecutor-6723-thread-1-processing-x:collection1) [    x:collection1] o.a.s.c.SolrCore [collection1] Registered new searcher Searcher@7d626582[collection1] main{ExitableDirectoryReader(UninvertingDirectoryReader())}
   [junit4]   2> 2001077 INFO  (TEST-AutoCommitTest.testMaxTime-seed#[3DF2F86D09227D36]) [    x:collection1] o.a.s.u.p.LogUpdateProcessorFactory [collection1] {add=[529 (1578824630011953152)]} 0 1
   [junit4]   2> 2001078 INFO  (TEST-AutoCommitTest.testMaxTime-seed#[3DF2F86D09227D36]) [    x:collection1] o.a.s.c.S.Request [collection1]  webapp=null path=null params={q=id:529&qt=&start=0&rows=20&version=2.2} hits=0 status=0 QTime=0
   [junit4]   2> 2002579 INFO  (commitScheduler-6726-thread-1) [    x:collection1] o.a.s.u.DirectUpdateHandler2 start commit{,optimize=false,openSearcher=true,waitSearcher=true,expungeDeletes=false,softCommit=true,prepareCommit=false}
   [junit4]   2> 2002583 INFO  (commitScheduler-6726-thread-1) [    x:collection1] o.a.s.s.SolrIndexSearcher Opening [Searcher@5db24010[collection1] main]
   [junit4]   2> 2002583 INFO  (commitScheduler-6726-thread-1) [    x:collection1] o.a.s.u.DirectUpdateHandler2 end_commit_flush
   [junit4]   2> 2002586 INFO  (searcherExecutor-6723-thread-1-processing-x:collection1) [    x:collection1] o.a.s.c.SolrCore [collection1] Registered new searcher Searcher@5db24010[collection1] main{ExitableDirectoryReader(UninvertingDirectoryReader(Uninverting(_0(7.1.0):C1)))}
   [junit4]   2> 2002587 INFO  (TEST-AutoCommitTest.testMaxTime-seed#[3DF2F86D09227D36]) [    x:collection1] o.a.s.u.p.LogUpdateProcessorFactory [collection1] {add=[530 (1578824631596351488)]} 0 1511
   [junit4]   2> 2002587 INFO  (TEST-AutoCommitTest.testMaxTime-seed#[3DF2F86D09227D36]) [    x:collection1] o.a.s.c.S.Request [collection1]  webapp=null path=null params={q=id:529&qt=&start=0&rows=20&version=2.2} hits=1 status=0 QTime=0
   [junit4]   2> 2002588 INFO  (TEST-AutoCommitTest.testMaxTime-seed#[3DF2F86D09227D36]) [    x:collection1] o.a.s.c.S.Request [collection1]  webapp=null path=null params={q=id:530&qt=&start=0&rows=20&version=2.2} hits=0 status=0 QTime=0
   [junit4]   2> 2002589 INFO  (TEST-AutoCommitTest.testMaxTime-seed#[3DF2F86D09227D36]) [    x:collection1] o.a.s.u.p.LogUpdateProcessorFactory [collection1]  webapp=null path=null params={}{delete=[529 (-1578824631598448640)]} 0 0
   [junit4]   2> 2002589 INFO  (TEST-AutoCommitTest.testMaxTime-seed#[3DF2F86D09227D36]) [    x:collection1] o.a.s.c.S.Request [collection1]  webapp=null path=null params={q=id:529&qt=&start=0&rows=20&version=2.2} hits=1 status=0 QTime=0
   [junit4]   2> 2004088 INFO  (commitScheduler-6726-thread-1) [    x:collection1] o.a.s.u.DirectUpdateHandler2 start commit{,optimize=false,openSearcher=true,waitSearcher=true,expungeDeletes=false,softCommit=true,prepareCommit=false}
   [junit4]   2> 2004091 INFO  (commitScheduler-6726-thread-1) [    x:collection1] o.a.s.s.SolrIndexSearcher Opening [Searcher@6372c1[collection1] main]
   [junit4]   2> 2004092 INFO  (commitScheduler-6726-thread-1) [    x:collection1] o.a.s.u.DirectUpdateHandler2 end_commit_flush
   [junit4]   2> 2004095 INFO  (searcherExecutor-6723-thread-1-processing-x:collection1) [    x:collection1] o.a.s.c.SolrCore [collection1] Registered new searcher Searcher@6372c1[collection1] main{ExitableDirectoryReader(UninvertingDirectoryReader(Uninverting(_1(7.1.0):C1)))}
   [junit4]   2> 2004097 INFO  (TEST-AutoCommitTest.testMaxTime-seed#[3DF2F86D09227D36]) [    x:collection1] o.a.s.u.p.LogUpdateProcessorFactory [collection1] {add=[550 (1578824633178652672)]} 0 3021
   [junit4]   2> 2004097 INFO  (TEST-AutoCommitTest.testMaxTime-seed#[3DF2F86D09227D36]) [    x:collection1] o.a.s.c.S.Request [collection1]  webapp=null path=null params={q=id:529&qt=&start=0&rows=20&version=2.2} hits=0 status=0 QTime=0
   [junit4]   2> 2004097 INFO  (TEST-AutoCommitTest.testMaxTime-seed#[3DF2F86D09227D36]) [    x:collection1] o.a.s.u.p.LogUpdateProcessorFactory [collection1] {add=[500 (1578824633179701248)]} 0 3022
   [junit4]   2> 2004098 INFO  (TEST-AutoCommitTest.testMaxTime-seed#[3DF2F86D09227D36]) [    x:collection1] o.a.s.u.p.LogUpdateProcessorFactory [collection1] {add=[500 (1578824633179701249)]} 0 3022
   [junit4]   2> 2004098 INFO  (TEST-AutoCommitTest.testMaxTime-seed#[3DF2F86D09227D36]) [    x:collection1] o.a.s.u.p.LogUpdateProcessorFactory [collection1] {add=[500 (1578824633180749824)]} 0 3022
   [junit4]   2> 2004098 INFO  (TEST-AutoCommitTest.testMaxTime-seed#[3DF2F86D09227D36]) [    x:collection1] o.a.s.u.p.LogUpdateProcessorFactory [collection1] {add=[500 (1578824633180749825)]} 0 3023
   [junit4]   2> 2004098 INFO  (TEST-AutoCommitTest.testMaxTime-seed#[3DF2F86D09227D36]) [    x:collection1] o.a.s.u.p.LogUpdateProcessorFactory [collection1] {add=[500 (1578824633180749826)]} 0 3023
   [junit4]   2> 2004098 INFO  (TEST-AutoCommitTest.testMaxTime-seed#[3DF2F86D09227D36]) [    x:collection1] o.a.s.u.p.LogUpdateProcessorFactory [collection1] {add=[500 (1578824633180749827)]} 0 3023
   [junit4]   2> 2004099 INFO  (TEST-AutoCommitTest.testMaxTime-seed#[3DF2F86D09227D36]) [    x:collection1] o.a.s.u.p.LogUpdateProcessorFactory [collection1] {add=[500 (1578824633181798400)]} 0 3023
   [junit4]   2> 2004099 INFO  (TEST-AutoCommitTest.testMaxTime-seed#[3DF2F86D09227D36]) [    x:collection1] o.a.s.u.p.LogUpdateProcessorFactory [collection1] {add=[500 (1578824633181798401)]} 0 3024
   [junit4]   2> 2004099 INFO  (TEST-AutoCommitTest.testMaxTime-seed#[3DF2F86D09227D36]) [    x:collection1] o.a.s.u.p.LogUpdateProcessorFactory [collection1] {add=[500 (1578824633181798402)]} 0 3024
   [junit4]   2> 2004099 INFO  (TEST-AutoCommitTest.testMaxTime-seed#[3DF2F86D09227D36]) [    x:collection1] o.a.s.u.p.LogUpdateProcessorFactory [collection1] {add=[500 (1578824633181798403)]} 0 3024
   [junit4]   2> 2004100 INFO  (TEST-AutoCommitTest.testMaxTime-seed#[3DF2F86D09227D36]) [    x:collection1] o.a.s.c.S.Request [collection1]  webapp=null path=null params={q=id:500&qt=&start=0&rows=20&version=2.2} hits=0 status=0 QTime=0
   [junit4]   2> 2005597 INFO  (commitScheduler-6726-thread-1) [    x:collection1] o.a.s.u.DirectUpdateHandler2 start commit{,optimize=false,openSearcher=true,waitSearcher=true,expungeDeletes=false,softCommit=true,prepareCommit=false}
   [junit4]   2> 2005601 INFO  (commitScheduler-6726-thread-1) [    x:collection1] o.a.s.s.SolrIndexSearcher Opening [Searcher@30a8beed[collection1] main]
   [junit4]   2> 2005601 INFO  (commitScheduler-6726-thread-1) [    x:collection1] o.a.s.u.DirectUpdateHandler2 end_commit_flush
   [junit4]   2> 2005605 INFO  (searcherExecutor-6723-thread-1-processing-x:collection1) [    x:collection1] o.a.s.c.SolrCore [collection1] Registered new searcher Searcher@30a8beed[collection1] main{ExitableDirectoryReader(UninvertingDirectoryReader(Uninverting(_1(7.1.0):C1) Uninverting(_2(7.1.0):C11/9:delGen=1)))}
   [junit4]   2> 2005614 INFO  (TEST-AutoCommitTest.testMaxTime-seed#[3DF2F86D09227D36]) [    x:collection1] o.a.s.u.p.LogUpdateProcessorFactory [collection1] {add=[531 (1578824634770391040)]} 0 4539
   [junit4]   2> 2005614 INFO  (TEST-AutoCommitTest.testMaxTime-seed#[3DF2F86D09227D36]) [    x:collection1] o.a.s.c.S.Request [collection1]  webapp=null path=null params={q=id:500&qt=&start=0&rows=20&version=2.2} hits=1 status=0 QTime=0
   [junit4]   2> 2005615 INFO  (TEST-AutoCommitTest.testMaxTime-seed#[3DF2F86D09227D36]) [    x:collection1] o.a.s.SolrTestCaseJ4 ###Ending testMaxTime
   [junit4]   2> 2005619 INFO  (TEST-AutoCommitTest.testCommitWithin-seed#[3DF2F86D09227D36]) [    x:collection1] o.a.s.SolrTestCaseJ4 ###Starting testCommitWithin
   [junit4]   2> 2005619 INFO  (TEST-AutoCommitTest.testCommitWithin-seed#[3DF2F86D09227D36]) [    x:collection1] o.a.s.u.DirectUpdateHandler2 [collection1] REMOVING ALL DOCUMENTS FROM INDEX
   [junit4]   2> 2005620 INFO  (TEST-AutoCommitTest.testCommitWithin-seed#[3DF2F86D09227D36]) [    x:collection1] o.a.s.s.SolrIndexSearcher Opening [Searcher@5ddab68c[collection1] realtime]
   [junit4]   2> 2005620 INFO  (TEST-AutoCommitTest.testCommitWithin-seed#[3DF2F86D09227D36]) [    x:collection1] o.a.s.u.p.LogUpdateProcessorFactory [collection1]  webapp=null path=null params={_version_=-9223372036854775807&update.distrib=FROMLEADER&versions=true&wt=json&indent=true}{deleteByQuery=*:* (-9223372036854775807)} 0 0
   [junit4]   2> 2005620 ERROR (TEST-AutoCommitTest.testCommitWithin-seed#[3DF2F86D09227D36]) [    x:collection1] o.a.s.c.CorePropertiesLocator Couldn't load core descriptor from /export/home/jenkins/workspace/Lucene-Solr-7.x-Solaris/solr/core/src/test-files/solr/collection1/core.properties:java.nio.file.NoSuchFileException: /export/home/jenkins/workspace/Lucene-Solr-7.x-Solaris/solr/core/src/test-files/solr/collection1/core.properties
   [junit4]   2> 2005621 INFO  (TEST-AutoCommitTest.testCommitWithin-seed#[3DF2F86D09227D36]) [    x:collection1] o.a.s.c.SolrResourceLoader [null] Added 2 libs to classloader, from paths: [/export/home/jenkins/workspace/Lucene-Solr-7.x-Solaris/solr/core/src/test-files/solr/collection1/lib, /export/home/jenkins/workspace/Lucene-Solr-7.x-Solaris/solr/core/src/test-files/solr/collection1/lib/classes]
   [junit4]   2> 2005646 INFO  (TEST-AutoCommitTest.testCommitWithin-seed#[3DF2F86D09227D36]) [    x:collection1] o.a.s.c.SolrConfig Using Lucene MatchVersion: 7.1.0
   [junit4]   2> 2005660 INFO  (TEST-AutoCommitTest.testCommitWithin-seed#[3DF2F86D09227D36]) [    x:collection1] o.a.s.s.IndexSchema [collection1] Schema name=test
   [junit4]   2> 2005720 INFO  (TEST-AutoCommitTest.testCommitWithin-seed#[3DF2F86D09227D36]) [    x:collection1] o.a.s.s.IndexSchema Loaded schema test/1.0 with uniqueid field id
   [junit4]   2> 2005727 INFO  (TEST-AutoCommitTest.testCommitWithin-seed#[3DF2F86D09227D36]) [    x:collection1] o.a.s.c.CoreContainer Reloading SolrCore 'collection1' using configuration from instancedir /export/home/jenkins/workspace/Lucene-Solr-7.x-Solaris/solr/core/src/test-files/solr/collection1
   [junit4]   2> 2005750 INFO  (TEST-AutoCommitTest.testCommitWithin-seed#[3DF2F86D09227D36]) [    x:collection1] o.a.s.m.r.SolrJmxReporter JMX monitoring for 'solr.core.collection1' (registry 'solr.core.collection1') enabled at server: com.sun.jmx.mbeanserver.JmxMBeanServer@49e8ee88
   [junit4]   2> 2005750 INFO  (TEST-AutoCommitTest.testCommitWithin-seed#[3DF2F86D09227D36]) [    x:collection1] o.a.s.c.SolrCore [[collection1] ] Opening new SolrCore at [/export/home/jenkins/workspace/Lucene-Solr-7.x-Solaris/solr/core/src/test-files/solr/collection1], dataDir=[/export/home/jenkins/workspace/Lucene-Solr-7.x-Solaris/solr/build/solr-core/test/J0/temp/solr.update.AutoCommitTest_3DF2F86D09227D36-001/init-core-data-001/]
   [junit4]   2> 2005823 INFO  (TEST-AutoCommitTest.testCommitWithin-seed#[3DF2F86D09227D36]) [    x:collection1] o.a.s.u.CommitTracker Hard AutoCommit: disabled
   [junit4]   2> 2005823 INFO  (TEST-AutoCommitTest.testCommitWithin-seed#[3DF2F86D09227D36]) [    x:collection1] o.a.s.u.CommitTracker Soft AutoCommit: disabled
   [junit4]   2> 2005824 INFO  (TEST-AutoCommitTest.testCommitWithin-seed#[3DF2F86D09227D36]) [    x:collection1] o.a.s.s.SolrIndexSearcher Opening [Searcher@19bfb10b[collection1] main]
   [junit4]   2> 2005825 INFO  (TEST-AutoCommitTest.testCommitWithin-seed#[3DF2F86D09227D36]) [    x:collection1] o.a.s.h.c.SpellCheckComponent Initializing spell checkers
   [junit4]   2> 2005826 INFO  (TEST-AutoCommitTest.testCommitWithin-seed#[3DF2F86D09227D36]) [    x:collection1] o.a.s.s.DirectSolrSpellChecker init: {name=direct,classname=DirectSolrSpellChecker,field=lowerfilt,minQueryLength=3}
   [junit4]   2> 2005830 INFO  (TEST-AutoCommitTest.testCommitWithin-seed#[3DF2F86D09227D36]) [    x:collection1] o.a.s.h.ReplicationHandler Commits will be reserved for  10000
   [junit4]   2> 2005832 INFO  (TEST-AutoCommitTest.testCommitWithin-seed#[3DF2F86D09227D36]) [    x:collection1] o.a.s.u.RandomMergePolicy RandomMergePolicy wrapping class org.apache.lucene.index.TieredMergePolicy: [TieredMergePolicy: maxMergeAtOnce=25, maxMergeAtOnceExplicit=39, maxMergedSegmentMB=83.048828125, floorSegmentMB=0.3671875, forceMergeDeletesPctAllowed=11.67176744591169, segmentsPerTier=23.0, maxCFSSegmentSizeMB=8.796093022207999E12, noCFSRatio=0.0
   [junit4]   2> 2005833 INFO  (TEST-AutoCommitTest.testCommitWithin-seed#[3DF2F86D09227D36]) [    x:collection1] o.a.s.u.DefaultSolrCoreState New IndexWriter is ready to be used.
   [junit4]   2> 2005833 INFO  (searcherExecutor-6727-thread-1-processing-x:collection1) [    x:collection1] o.a.s.h.c.SpellCheckComponent Loading spell index for spellchecker: default
   [junit4]   2> 2005833 INFO  (searcherExecutor-6727-thread-1-processing-x:collection1) [    x:collection1] o.a.s.h.c.SpellCheckComponent Loading spell index for spellchecker: direct
   [junit4]   2> 2005833 INFO  (searcherExecutor-6727-thread-1-processing-x:collection1) [    x:collection1] o.a.s.h.c.SpellCheckComponent Loading spell index for spellchecker: wordbreak
   [junit4]   2> 2005833 INFO  (searcherExecutor-6727-thread-1-processing-x:collection1) [    x:collection1] o.a.s.h.c.SpellCheckComponent Loading spell index for spellchecker: multipleFields
   [junit4]   2> 2005833 INFO  (searcherExecutor-6727-thread-1-processing-x:collection1) [    x:collection1] o.a.s.h.c.SpellCheckComponent Loading spell index for spellchecker: jarowinkler
   [junit4]   2> 2005834 INFO  (searcherExecutor-6727-thread-1-processing-x:collection1) [    x:collection1] o.a.s.h.c.SpellCheckComponent Loading spell index for spellchecker: external
   [junit4]   2> 2005834 INFO  (searcherExecutor-6727-thread-1-processing-x:collection1) [    x:collection1] o.a.s.h.c.SpellCheckComponent Loading spell index for spellchecker: freq
   [junit4]   2> 2005834 INFO  (searcherExecutor-6727-thread-1-processing-x:collection1) [    x:collection1] o.a.s.h.c.SpellCheckComponent Loading spell index for spellchecker: fqcn
   [junit4]   2> 2005834 INFO  (searcherExecutor-6727-thread-1-processing-x:collection1) [    x:collection1] o.a.s.h.c.SpellCheckComponent Loading spell index for spellchecker: perDict
   [junit4]   2> 2005836 INFO  (searcherExecutor-6727-thread-1-processing-x:collection1) [    x:collection1] o.a.s.c.SolrCore [collection1] Registered new searcher Searcher@19bfb10b[collection1] main{ExitableDirectoryReader(UninvertingDirectoryReader())}
   [junit4]   2> 2005836 INFO  (TEST-AutoCommitTest.testCommitWithin-seed#[3DF2F86D09227D36]) [    x:collection1] o.a.s.s.SolrIndexSearcher Opening [Searcher@6f5e6813[collection1] main]
   [junit4]   2> 2005837 INFO  (TEST-AutoCommitTest.testCommitWithin-seed#[3DF2F86D09227D36]) [    x:collection1] o.a.s.c.SolrCore [collection1]  CLOSING SolrCore org.apache.solr.core.SolrCore@492f806b
   [junit4]   2> 2005837 INFO  (TEST-AutoCommitTest.testCommitWithin-seed#[3DF2F86D09227D36]) [    x:collection1] o.a.s.m.SolrMetricManager Closing metric reporters for registry=solr.core.collection1, tag=1227849835
   [junit4]   2> 2005837 INFO  (TEST-AutoCommitTest.testCommitWithin-seed#[3DF2F86D09227D36]) [    x:collection1] o.a.s.m.r.SolrJmxReporter Closing reporter [org.apache.solr.metrics.reporters.SolrJmxReporter@34e39593: rootName = null, domain = solr.core.collection1, service url = null, agent id = null] for registry solr.core.collection1 / com.codahale.metrics.MetricRegistry@196774d7
   [junit4]   2> 2005851 INFO  (searcherExecutor-6727-thread-1-processing-x:collection1) [    x:collection1] o.a.s.c.SolrCore [collection1] Registered new searcher Searcher@6f5e6813[collection1] main{ExitableDirectoryReader(UninvertingDirectoryReader())}
   [junit4]   2> 2005853 INFO  (TEST-AutoCommitTest.testCommitWithin-seed#[3DF2F86D09227D36]) [    x:collection1] o.a.s.u.p.LogUpdateProcessorFactory [collection1] {add=[529 (1578824635017854976)]} 0 7
   [junit4]   2> 2005853 INFO  (TEST-AutoCommitTest.testCommitWithin-seed#[3DF2F86D09227D36]) [    x:collection1] o.a.s.c.S.Request [collection1]  webapp=null path=null params={q=id:529&qt=&start=0&rows=20&version=2.2} hits=0 status=0 QTime=0
   [junit4]   2> 2005853 INFO  (TEST-AutoCommitTest.testCommitWithin-seed#[3DF2F86D09227D36]) [    x:collection1] o.a.s.u.p.LogUpdateProcessorFactory [collection1] {add=[530 (1578824635021000704)]} 0 8
   [junit4]   2> 2005853 INFO  (TEST-AutoCommitTest.testCommitWithin-seed#[3DF2F86D09227D36]) [    x:collection1] o.a.s.c.S.Request [collection1]  webapp=null path=null params={q=id:530&qt=&start=0&rows=20&version=2.2} hits=0 status=0 QTime=0
   [junit4]   2> 2005853 INFO  (TEST-AutoCommitTest.testCommitWithin-seed#[3DF2F86D09227D36]) [    x:collection1] o.a.s.u.p.LogUpdateProcessorFactory [collection1] {delete=[529 (-1578824635021000705)]} 0 8
   [junit4]   2> 2005854 INFO  (TEST-AutoCommitTest.testCommitWithin-seed#[3DF2F86D09227D36]) [    x:collection1] o.a.s.c.S.Request [collection1]  webapp=null path=null params={q=id:529&qt=&start=0&rows=20&version=2.2} hits=0 status=0 QTime=0
   [junit4]   2> 2005854 ERROR (TEST-AutoCommitTest.testCommitWithin-seed#[3DF2F86D09227D36]) [    x:collection1] o.a.s.SolrTestCaseJ4 REQUEST FAILED: xpath=//result[@numFound=1]
   [junit4]   2> 	xml response was: <?xml version="1.0" encoding="UTF-8"?>
   [junit4]   2> <response>
   [junit4]   2> <lst name="responseHeader"><int name="status">0</int><int name="QTime">0</int></lst><result name="response" numFound="0" start="0"></result>
   [junit4]   2> </response>
   [junit4]   2> 
   [junit4]   2> 	request was:q=id:529&qt=&start=0&rows=20&version=2.2
   [junit4]   2> 2005854 ERROR (TEST-AutoCommitTest.testCommitWithin-seed#[3DF2F86D09227D36]) [    x:collection1] o.a.s.SolrTestCaseJ4 REQUEST FAILED: q=id:529&qt=&start=0&rows=20&version=2.2:java.lang.RuntimeException: REQUEST FAILED: xpath=//result[@numFound=1]
   [junit4]   2> 	xml response was: <?xml version="1.0" encoding="UTF-8"?>
   [junit4]   2> <response>
   [junit4]   2> <lst name="responseHeader"><int name="status">0</int><int name="QTime">0</int></lst><result name="response" numFound="0" start="0"></result>
   [junit4]   2> </response>
   [junit4]   2> 
   [junit4]   2> 	request was:q=id:529&qt=&start=0&rows=20&version=2.2
   [junit4]   2> 	at org.apache.solr.SolrTestCaseJ4.assertQ(SolrTestCaseJ4.java:877)
   [junit4]   2> 	at org.apache.solr.update.AutoCommitTest.testCommitWithin(AutoCommitTest.java:353)
   [junit4]   2> 	at sun.reflect.NativeMethodAccessorImpl.invoke0(Native Method)
   [junit4]   2> 	at sun.reflect.NativeMethodAccessorImpl.invoke(NativeMethodAccessorImpl.java:62)
   [junit4]   2> 	at sun.reflect.DelegatingMethodAccessorImpl.invoke(DelegatingMethodAccessorImpl.java:43)
   [junit4]   2> 	at java.lang.reflect.Method.invoke(Method.java:498)
   [junit4]   2> 	at com.carrotsearch.randomizedtesting.RandomizedRunner.invoke(RandomizedRunner.java:1737)
   [junit4]   2> 	at com.carrotsearch.randomizedtesting.RandomizedRunner$8.evaluate(RandomizedRunner.java:934)
   [junit4]   2> 	at com.carrotsearch.randomizedtesting.RandomizedRunner$9.evaluate(RandomizedRunner.java:970)
   [junit4]   2> 	at com.carrotsearch.randomizedtesting.RandomizedRunner$10.evaluate(RandomizedRunner.java:984)
   [junit4]   2> 	at com.carrotsearch.randomizedtesting.rules.SystemPropertiesRestoreRule$1.evaluate(SystemPropertiesRestoreRule.java:57)
   [junit4]   2> 	at org.apache.lucene.util.TestRuleSetupTeardownChained$1.evaluate(TestRuleSetupTeardownChained.java:49)
   [junit4]   2> 	at org.apache.lucene.util.AbstractBeforeAfterRule$1.evaluate(AbstractBeforeAfterRule.java:45)
   [junit4]   2> 	at org.apache.lucene.util.TestRuleThreadAndTestName$1.evaluate(TestRuleThreadAndTestName.java:48)
   [junit4]   2> 	at org.apache.lucene.util.TestRuleIgnoreAfterMaxFailures$1.evaluate(TestRuleIgnoreAfterMaxFailures.java:64)
   [junit4]   2> 	at org.apache.lucene.util.TestRuleMarkFailure$1.evaluate(TestRuleMarkFailure.java:47)
   [junit4]   2> 	at com.carrotsearch.randomizedtesting.rules.StatementAdapter.evaluate(StatementAdapter.java:36)
   [junit4]   2> 	at com.carrotsearch.randomizedtesting.ThreadLeakControl$StatementRunner.run(ThreadLeakControl.java:368)
   [junit4]   2> 	at com.carrotsearch.randomizedtesting.ThreadLeakControl.forkTimeoutingTask(ThreadLeakControl.java:817)
   [junit4]   2> 	at com.carrotsearch.randomizedtesting.ThreadLeakControl$3.evaluate(ThreadLeakControl.java:468)
   [junit4]   2> 	at com.carrotsearch.randomizedtesting.RandomizedRunner.runSingleTest(RandomizedRunner.java:943)
   [junit4]   2> 	at com.carrotsearch.randomizedtesting.RandomizedRunner$5.evaluate(RandomizedRunner.java:829)
   [junit4]   2> 	at com.carrotsearch.randomizedtesting.RandomizedRunner$6.evaluate(RandomizedRunner.java:879)
   [junit4]   2> 	at com.carrotsearch.randomizedtesting.RandomizedRunner$7.evaluate(RandomizedRunner.java:890)
   [junit4]   2> 	at com.carrotsearch.randomizedtesting.rules.StatementAdapter.evaluate(StatementAdapter.java:36)
   [junit4]   2> 	at com.carrotsearch.randomizedtesting.rules.SystemPropertiesRestoreRule$1.evaluate(SystemPropertiesRestoreRule.java:57)
   [junit4]   2> 	at org.apache.lucene.util.AbstractBeforeAfterRule$1.evaluate(AbstractBeforeAfterRule.java:45)
   [junit4]   2> 	at com.carrotsearch.randomizedtesting.rules.StatementAdapter.evaluate(StatementAdapter.java:36)
   [junit4]   2> 	at org.apache.lucene.util.TestRuleStoreClassName$1.evaluate(TestRuleStoreClassName.java:41)
   [junit4]   2> 	at com.carrotsearch.randomizedtesting.rules.NoShadowingOrOverridesOnMethodsRule$1.evaluate(NoShadowingOrOverridesOnMethodsRule.java:40)
   [junit4]   2> 	at com.carrotsearch.randomizedtesting.rules.NoShadowingOrOverridesOnMethodsRule$1.evaluate(NoShadowingOrOverridesOnMethodsRule.java:40)
   [junit4]   2> 	at com.carrotsearch.randomizedtesting.rules.StatementAdapter.evaluate(StatementAdapter.java:36)
   [junit4]   2> 	at com.carrotsearch.randomizedtesting.rules.StatementAdapter.evaluate(StatementAdapter.java:36)
   [junit4]   2> 	at com.carrotsearch.randomizedtesting.rules.StatementAdapter.evaluate(StatementAdapter.java:36)
   [junit4]   2> 	at org.apache.lucene.util.TestRuleAssertionsRequired$1.evaluate(TestRuleAssertionsRequired.java:53)
   [junit4]   2> 	at org.apache.lucene.util.TestRuleMarkFailure$1.evaluate(TestRuleMarkFailure.java:47)
   [junit4]   2> 	at org.apache.lucene.util.TestRuleIgnoreAfterMaxFailures$1.evaluate(TestRuleIgnoreAfterMaxFailures.java:64)
   [junit4]   2> 	at org.apache.lucene.util.TestRuleIgnoreTestSuites$1.evaluate(TestRuleIgnoreTestSuites.java:54)
   [junit4]   2> 	at com.carrotsearch.randomizedtesting.rules.StatementAdapter.evaluate(StatementAdapter.java:36)
   [junit4]   2> 	at com.carrotsearch.randomizedtesting.ThreadLeakControl$StatementRunner.run(ThreadLeakControl.java:368)
   [junit4]   2> 	at java.lang.Thread.run(Thread.java:748)
   [junit4]   2> 
   [junit4]   2> 2005854 INFO  (TEST-AutoCommitTest.testCommitWithin-seed#[3DF2F86D09227D36]) [    x:collection1] o.a.s.SolrTestCaseJ4 ###Ending testCommitWithin
   [junit4]   2> NOTE: reproduce with: ant test  -Dtestcase=AutoCommitTest -Dtests.method=testCommitWithin -Dtests.seed=3DF2F86D09227D36 -Dtests.slow=true -Dtests.locale=sq-AL -Dtests.timezone=Australia/NSW -Dtests.asserts=true -Dtests.file.encoding=US-ASCII
   [junit4] ERROR   0.24s J0 | AutoCommitTest.testCommitWithin <<<
   [junit4]    > Throwable #1: java.lang.RuntimeException: Exception during query
   [junit4]    > 	at __randomizedtesting.SeedInfo.seed([3DF2F86D09227D36:872097158A0C9323]:0)
   [junit4]    > 	at org.apache.solr.SolrTestCaseJ4.assertQ(SolrTestCaseJ4.java:884)
   [junit4]    > 	at org.apache.solr.update.AutoCommitTest.testCommitWithin(AutoCommitTest.java:353)
   [junit4]    > 	at java.lang.Thread.run(Thread.java:748)
   [junit4]    > Caused by: java.lang.RuntimeException: REQUEST FAILED: xpath=//result[@numFound=1]
   [junit4]    > 	xml response was: <?xml version="1.0" encoding="UTF-8"?>
   [junit4]    > <response>
   [junit4]    > <lst name="responseHeader"><int name="status">0</int><int name="QTime">0</int></lst><result name="response" numFound="0" start="0"></result>
   [junit4]    > </response>
   [junit4]    > 	request was:q=id:529&qt=&start=0&rows=20&version=2.2
   [junit4]    > 	at org.apache.solr.SolrTestCaseJ4.assertQ(SolrTestCaseJ4.java:877)
   [junit4]    > 	... 40 more
   [junit4]   2> 2005861 INFO  (TEST-AutoCommitTest.testMaxDocs-seed#[3DF2F86D09227D36]) [    x:collection1] o.a.s.SolrTestCaseJ4 ###Starting testMaxDocs
   [junit4]   2> 2005861 INFO  (TEST-AutoCommitTest.testMaxDocs-seed#[3DF2F86D09227D36]) [    x:collection1] o.a.s.u.DirectUpdateHandler2 [collection1] REMOVING ALL DOCUMENTS FROM INDEX
   [junit4]   2> 2005861 INFO  (TEST-AutoCommitTest.testMaxDocs-seed#[3DF2F86D09227D36]) [    x:collection1] o.a.s.s.SolrIndexSearcher Opening [Searcher@7d8de3e9[collection1] realtime]
   [junit4]   2> 2005861 INFO  (TEST-AutoCommitTest.testMaxDocs-seed#[3DF2F86D09227D36]) [    x:collection1] o.a.s.u.p.LogUpdateProcessorFactory [collection1]  webapp=null path=null params={_version_=-9223372036854775807&update.distrib=FROMLEADER&versions=true&wt=json&indent=true}{deleteByQuery=*:* (-9223372036854775807)} 0 0
   [junit4]   2> 2005861 ERROR (TEST-AutoCommitTest.testMaxDocs-seed#[3DF2F86D09227D36]) [    x:collection1] o.a.s.c.CorePropertiesLocator Couldn't load core descriptor from /export/home/jenkins/workspace/Lucene-Solr-7.x-Solaris/solr/core/src/test-files/solr/collection1/core.properties:java.nio.file.NoSuchFileException: /export/home/jenkins/workspace/Lucene-Solr-7.x-Solaris/solr/core/src/test-files/solr/collection1/core.properties
   [junit4]   2> 2005862 INFO  (TEST-AutoCommitTest.testMaxDocs-seed#[3DF2F86D09227D36]) [    x:collection1] o.a.s.c.SolrResourceLoader [null] Added 2 libs to classloader, from paths: [/export/home/jenkins/workspace/Lucene-Solr-7.x-Solaris/solr/core/src/test-files/solr/collection1/lib, /export/home/jenkins/workspace/Lucene-Solr-7.x-Solaris/solr/core/src/test-files/solr/collection1/lib/classes]
   [junit4]   2> 2005919 INFO  (TEST-AutoCommitTest.testMaxDocs-seed#[3DF2F86D09227D36]) [    x:collection1] o.a.s.c.SolrConfig Using Lucene MatchVersion: 7.1.0
   [junit4]   2> 2005937 INFO  (TEST-AutoCommitTest.testMaxDocs-seed#[3DF2F86D09227D36]) [    x:collection1] o.a.s.s.IndexSchema [collection1] Schema name=test
   [junit4]   2> 2005996 INFO  (TEST-AutoCommitTest.testMaxDocs-seed#[3DF2F86D09227D36]) [    x:collection1] o.a.s.s.IndexSchema Loaded schema test/1.0 with uniqueid field id
   [junit4]   2> 2006001 INFO  (TEST-AutoCommitTest.testMaxDocs-seed#[3DF2F86D09227D36]) [    x:collection1] o.a.s.c.CoreContainer Reloading SolrCore 'collection1' using configuration from instancedir /export/home/jenkins/workspace/Lucene-Solr-7.x-Solaris/solr/core/src/test-files/solr/collection1
   [junit4]   2> 2006023 INFO  (TEST-AutoCommitTest.testMaxDocs-seed#[3DF2F86D09227D36]) [    x:collection1] o.a.s.m.r.SolrJmxReporter JMX monitoring for 'solr.core.collection1' (registry 'solr.core.collection1') enabled at server: com.sun.jmx.mbeanserver.JmxMBeanServer@49e8ee88
   [junit4]   2> 2006023 INFO  (TEST-AutoCommitTest.testMaxDocs-seed#[3DF2F86D09227D36]) [    x:collection1] o.a.s.c.SolrCore [[collection1] ] Opening new SolrCore at [/export/home/jenkins/workspace/Lucene-Solr-7.x-Solaris/solr/core/src/test-files/solr/collection1], dataDir=[/export/home/jenkins/workspace/Lucene-Solr-7.x-Solaris/solr/build/solr-core/test/J0/temp/solr.update.AutoCommitTest_3DF2F86D09227D36-001/init-core-data-001/]
   [junit4]   2> 2006072 INFO  (TEST-AutoCommitTest.testMaxDocs-seed#[3DF2F86D09227D36]) [    x:collection1] o.a.s.u.CommitTracker Hard AutoCommit: disabled
   [junit4]   2> 2006072 INFO  (TEST-AutoCommitTest.testMaxDocs-seed#[3DF2F86D09227D36]) [    x:collection1] o.a.s.u.CommitTracker Soft AutoCommit: disabled
   [junit4]   2> 2006073 INFO  (TEST-AutoCommitTest.testMaxDocs-seed#[3DF2F86D09227D36]) [    x:collection1] o.a.s.s.SolrIndexSearcher Opening [Searcher@747bc22d[collection1] main]
   [junit4]   2> 2006074 INFO  (TEST-AutoCommitTest.testMaxDocs-seed#[3DF2F86D09227D36]) [    x:collection1] o.a.s.h.c.SpellCheckComponent Initializing spell checkers
   [junit4]   2> 2006074 INFO  (TEST-AutoCommitTest.testMaxDocs-seed#[3DF2F86D09227D36]) [    x:collection1] o.a.s.s.DirectSolrSpellChecker init: {name=direct,classname=DirectSolrSpellChecker,field=lowerfilt,minQueryLength=3}
   [junit4]   2> 2006076 INFO  (TEST-AutoCommitTest.testMaxDocs-seed#[3DF2F86D09227D36]) [    x:collection1] o.a.s.h.ReplicationHandler Commits will be reserved for  10000
   [junit4]   2> 2006076 INFO  (searcherExecutor-6731-thread-1-processing-x:collection1) [    x:collection1] o.a.s.h.c.SpellCheckComponent Loading spell index for spellchecker: default
   [junit4]   2> 2006078 INFO  (searcherExecutor-6731-thread-1-processing-x:collection1) [    x:collection1] o.a.s.h.c.SpellCheckComponent Loading spell index for spellchecker: direct
   [junit4]   2> 2006078 INFO  (searcherExecutor-6731-thread-1-processing-x:collection1) [    x:collection1] o.a.s.h.c.SpellCheckComponent Loading spell index for spellchecker: wordbreak
   [junit4]   2> 2006078 INFO  (searcherExecutor-6731-thread-1-processing-x:collection1) [    x:collection1] o.a.s.h.c.SpellCheckComponent Loading spell index for spellchecker: multipleFields
   [junit4]   2> 2006078 INFO  (searcherExecutor-6731-thread-1-processing-x:collection1) [    x:collection1] o.a.s.h.c.SpellCheckComponent Loading spell index for spellchecker: jarowinkler
   [junit4]   2> 2006079 INFO  (searcherExecutor-6731-thread-1-processing-x:collection1) [    x:collection1] o.a.s.h.c.SpellCheckComponent Loading spell index for spellchecker: external
   [junit4]   2> 2006079 INFO  (searcherExecutor-6731-thread-1-processing-x:collection1) [    x:collection1] o.a.s.h.c.SpellCheckComponent Loading spell index for spellchecker: freq
   [junit4]   2> 2006079 INFO  (searcherExecutor-6731-thread-1-processing-x:collection1) [    x:collection1] o.a.s.h.c.SpellCheckComponent Loading spell index for spellchecker: fqcn
   [junit4]   2> 2006079 INFO  (searcherExecutor-6731-thread-1-processing-x:collection1) [    x:collection1] o.a.s.h.c.SpellCheckComponent Loading spell index for spellchecker: perDict
   [junit4]   2> 2006081 INFO  (searcherExecutor-6731-thread-1-processing-x:collection1) [    x:collection1] o.a.s.c.SolrCore [collection1] Registered new searcher Searcher@747bc22d[collection1] main{ExitableDirectoryReader(UninvertingDirectoryReader())}
   [junit4]   2> 2006081 INFO  (TEST-AutoCommitTest.testMaxDocs-seed#[3DF2F86D09227D36]) [    x:collection1] o.a.s.u.RandomMergePolicy RandomMergePolicy wrapping class org.apache.lucene.index.AlcoholicMergePolicy: [AlcoholicMergePolicy: minMergeSize=0, mergeFactor=10, maxMergeSize=384607707, maxMergeSizeForForcedMerge=9223372036854775807, calibrateSizeByDeletes=true, maxMergeDocs=2147483647, maxCFSSegmentSizeMB=8.796093022207999E12, noCFSRatio=0.1]
   [junit4]   2> 2006082 INFO  (TEST-AutoCommitTest.testMaxDocs-seed#[3DF2F86D09227D36]) [    x:collection1] o.a.s.u.DefaultSolrCoreState New IndexWriter is ready to be used.
   [junit4]   2> 2006082 INFO  (TEST-AutoCommitTest.testMaxDocs-seed#[3DF2F86D09227D36]) [    x:collection1] o.a.s.s.SolrIndexSearcher Opening [Searcher@705efcd1[collection1] main]
   [junit4]   2> 2006082 INFO  (TEST-AutoCommitTest.testMaxDocs-seed#[3DF2F86D09227D36]) [    x:collection1] o.a.s.c.SolrCore [collection1]  CLOSING SolrCore org.apache.solr.core.SolrCore@47b719a2
   [junit4]   2> 2006082 INFO  (TEST-AutoCommitTest.testMaxDocs-seed#[3DF2F86D09227D36]) [    x:collection1] o.a.s.m.SolrMetricManager Closing metric reporters for registry=solr.core.collection1, tag=1203181986
   [junit4]   2> 2006082 INFO  (TEST-AutoCommitTest.testMaxDocs-seed#[3DF2F86D09227D36]) [    x:collection1] o.a.s.m.r.SolrJmxReporter Closing reporter [org.apache.solr.metrics.reporters.SolrJmxReporter@2b8cecb1: rootName = null, domain = solr.core.collection1, service url = null, agent id = null] for registry solr.core.collection1 / com.codahale.metrics.MetricRegistry@196774d7
   [junit4]   2> 2006084 INFO  (searcherExecutor-6731-thread-1-processing-x:collection1) [    x:collection1] o.a.s.c.SolrCore [collection1] Registered new searcher Searcher@705efcd1[collection1] main{ExitableDirectoryReader(UninvertingDirectoryReader())}
   [junit4]   2> 2006092 INFO  (TEST-AutoCommitTest.testMaxDocs-seed#[3DF2F86D09227D36]) [    x:collection1] o.a.s.u.p.LogUpdateProcessorFactory [collection1] {add=[0 (1578824635270561792)]} 0 0
   [junit4]   2> 2006092 INFO  (TEST-AutoCommitTest.testMaxDocs-seed#[3DF2F86D09227D36]) [    x:collection1] o.a.s.u.p.LogUpdateProcessorFactory [collection1] {add=[1 (1578824635271610368)]} 0 0
   [junit4]   2> 2006092 INFO  (TEST-AutoCommitTest.testMaxDocs-seed#[3DF2F86D09227D36]) [    x:collection1] o.a.s.u.p.LogUpdateProcessorFactory [collection1] {add=[2 (1578824635271610369)]} 0 0
   [junit4]   2> 2006092 INFO  (TEST-AutoCommitTest.testMaxDocs-seed#[3DF2F86D09227D36]) [    x:collection1] o.a.s.u.p.LogUpdateProcessorFactory [collection1] {add=[3 (1578824635271610370)]} 0 0
   [junit4]   2> 2006092 INFO  (TEST-AutoCommitTest.testMaxDocs-seed#[3DF2F86D09227D36]) [    x:collection1] o.a.s.u.p.LogUpdateProcessorFactory [collection1] {add=[4 (1578824635271610371)]} 0 1
   [junit4]   2> 2006092 INFO  (TEST-AutoCommitTest.testMaxDocs-seed#[3DF2F86D09227D36]) [    x:collection1] o.a.s.u.p.LogUpdateProcessorFactory [collection1] {add=[5 (1578824635271610372)]} 0 1
   [junit4]   2> 2006093 INFO  (TEST-AutoCommitTest.testMaxDocs-seed#[3DF2F86D09227D36]) [    x:collection1] o.a.s.u.p.LogUpdateProcessorFactory [collection1] {add=[6 (1578824635272658944)]} 0 1
   [junit4]   2> 2006093 INFO  (TEST-AutoCommitTest.testMaxDocs-seed#[3DF2F86D09227D36]) [    x:collection1] o.a.s.u.p.LogUpdateProcessorFactory [collection1] {add=[7 (1578824635272658945)]} 0 1
   [junit4]   2> 2006093 INFO  (TEST-AutoCommitTest.testMaxDocs-seed#[3DF2F86D09227D36]) [    x:collection1] o.a.s.u.p.LogUpdateProcessorFactory [collection1] {add=[8 (1578824635272658946)]} 0 1
   [junit4]   2> 2006093 INFO  (TEST-AutoCommitTest.testMaxDocs-seed#[3DF2F86D09227D36]) [    x:collection1] o.a.s.u.p.LogUpdateProcessorFactory [collection1] {add=[9 (1578824635272658947)]} 0 1
   [junit4]   2> 2006093 INFO  (TEST-AutoCommitTest.testMaxDocs-seed#[3DF2F86D09227D36]) [    x:collection1] o.a.s.u.p.LogUpdateProcessorFactory [collection1] {add=[10 (1578824635272658948)]} 0 1
   [junit4]   2> 2006093 INFO  (TEST-AutoCommitTest.testMaxDocs-seed#[3DF2F86D09227D36]) [    x:collection1] o.a.s.u.p.LogUpdateProcessorFactory [collection1] {add=[11 (1578824635272658949)]} 0 1
   [junit4]   2> 2006093 INFO  (TEST-AutoCommitTest.testMaxDocs-seed#[3DF2F86D09227D36]) [    x:collection1] o.a.s.u.p.LogUpdateProcessorFactory [collection1] {add=[12 (1578824635272658950)]} 0 1
   [junit4]   2> 2006093 INFO  (TEST-AutoCommitTest.testMaxDocs-seed#[3DF2F86D09227D36]) [    x:collection1] o.a.s.u.p.LogUpdateProcessorFactory [collection1] {add=[13 (1578824635272658951)]} 0 1
   [junit4]   2> 2006093 INFO  (TEST-AutoCommitTest.testMaxDocs-seed#[3DF2F86D09227D36]) [    x:collection1] o.a.s.c.S.Request [collection1]  webapp=null path=null params={q=id:1&qt=&start=0&rows=20&version=2.2} hits=0 status=0 QTime=0
   [junit4]   2> 2006094 INFO  (TEST-AutoCommitTest.testMaxDocs-seed#[3DF2F86D09227D36]) [    x:collection1] o.a.s.u.p.LogUpdateProcessorFactory [collection1] {add=[14 (1578824635273707520)]} 0 2
   [junit4]   2> 2006096 INFO  (commitScheduler-6734-thread-1) [    x:collection1] o.a.s.u.DirectUpdateHandler2 start commit{,optimize=false,openSearcher=true,waitSearcher=true,expungeDeletes=false,softCommit=true,prepareCommit=false}
   [junit4]   2> 2006098 INFO  (commitScheduler-6734-thread-1) [    x:collection1] o.a.s.s.SolrIndexSearcher Opening [Searcher@e0a76f8[collection1] main]
   [junit4]   2> 2006098 INFO  (commitScheduler-6734-thread-1) [    x:collection1] o.a.s.u.DirectUpdateHandler2 end_commit_flush
   [junit4]   2> 2006099 INFO  (searcherExecutor-6731-thread-1-processing-x:collection1) [    x:collection1] o.a.s.c.SolrCore [collection1] Registered new searcher Searcher@e0a76f8[collection1] main{ExitableDirectoryReader(UninvertingDirectoryReader(Uninverting(_5(7.1.0):C15)))}
   [junit4]   2> 2006344 INFO  (TEST-AutoCommitTest.testMaxDocs-seed#[3DF2F86D09227D36]) [    x:collection1] o.a.s.u.p.LogUpdateProcessorFactory [collection1] {add=[15 (1578824635535851520)]} 0 253
   [junit4]   2> 2006344 INFO  (TEST-AutoCommitTest.testMaxDocs-seed#[3DF2F86D09227D36]) [    x:collection1] o.a.s.c.S.Request [collection1]  webapp=null path=null params={q=id:14&qt=&start=0&rows=20&version=2.2} hits=1 status=0 QTime=0
   [junit4]   2> 2006345 INFO  (TEST-AutoCommitTest.testMaxDocs-seed#[3DF2F86D09227D36]) [    x:collection1] o.a.s.c.S.Request [collection1]  webapp=null path=null params={q=id:15&qt=&start=0&rows=20&version=2.2} hits=0 status=0 QTime=0
   [junit4]   2> 2006346 INFO  (TEST-AutoCommitTest.testMaxDocs-seed#[3DF2F86D09227D36]) [    x:collection1] o.a.s.SolrTestCaseJ4 ###Ending testMaxDocs
   [junit4]   2> 2006346 INFO  (SUITE-AutoCommitTest-seed#[3DF2F86D09227D36]-worker) [    x:collection1] o.a.s.SolrTestCaseJ4 ###deleteCore
   [junit4]   2> 2006346 INFO  (SUITE-AutoCommitTest-seed#[3DF2F86D09227D36]-worker) [    x:collection1] o.a.s.c.CoreContainer Shutting down CoreContainer instance=1642639216
   [junit4]   2> 2006346 INFO  (SUITE-AutoCommitTest-seed#[3DF2F86D09227D36]-worker) [    x:collection1] o.a.s.m.SolrMetricManager Closing metric reporters for registry=solr.node, tag=null
   [junit4]   2> 2006346 INFO  (SUITE-AutoCommitTest-seed#[3DF2F86D09227D36]-worker) [    x:collection1] o.a.s.m.r.SolrJmxReporter Closing reporter [org.apache.solr.metrics.reporters.SolrJmxReporter@ed2d0c7: rootName = null, domain = solr.node, service url = null, agent id = null] for registry solr.node / com.codahale.metrics.MetricRegistry@38534d23
   [junit4]   2> 2006350 INFO  (SUITE-AutoCommitTest-seed#[3DF2F86D09227D36]-worker) [    x:collection1] o.a.s.m.SolrMetricManager Closing metric reporters for registry=solr.jvm, tag=null
   [junit4]   2> 2006350 INFO  (SUITE-AutoCommitTest-seed#[3DF2F86D09227D36]-worker) [    x:collection1] o.a.s.m.r.SolrJmxReporter Closing reporter [org.apache.solr.metrics.reporters.SolrJmxReporter@1536c971: rootName = null, domain = solr.jvm, service url = null, agent id = null] for registry solr.jvm / com.codahale.metrics.MetricRegistry@4dce029b
   [junit4]   2> 2006353 INFO  (SUITE-AutoCommitTest-seed#[3DF2F86D09227D36]-worker) [    x:collection1] o.a.s.m.SolrMetricManager Closing metric reporters for registry=solr.jetty, tag=null
   [junit4]   2> 2006353 INFO  (SUITE-AutoCommitTest-seed#[3DF2F86D09227D36]-worker) [    x:collection1] o.a.s.m.r.SolrJmxReporter Closing reporter [org.apache.solr.metrics.reporters.SolrJmxReporter@253ef6a1: rootName = null, domain = solr.jetty, service url = null, agent id = null] for registry solr.jetty / com.codahale.metrics.MetricRegistry@1b088d02
   [junit4]   2> 2006353 INFO  (SUITE-AutoCommitTest-seed#[3DF2F86D09227D36]-worker) [    x:collection1] o.a.s.c.TransientSolrCoreCacheDefault Allocating transient cache for 2147483647 transient cores
   [junit4]   2> 2006353 INFO  (coreCloseExecutor-6735-thread-1-processing-x:collection1) [    x:collection1] o.a.s.c.SolrCore [collection1]  CLOSING SolrCore org.apache.solr.core.SolrCore@e2e61aa
   [junit4]   2> 2006353 INFO  (coreCloseExecutor-6735-thread-1-processing-x:collection1) [    x:collection1] o.a.s.m.SolrMetricManager Closing metric reporters for registry=solr.core.collection1, tag=237920682
   [junit4]   2> 2006353 INFO  (coreCloseExecutor-6735-thread-1-processing-x:collection1) [    x:collection1] o.a.s.m.r.SolrJmxReporter Closing reporter [org.apache.solr.metrics.reporters.SolrJmxReporter@768ffe62: rootName = null, domain = solr.core.collection1, service url = null, agent id = null] for registry solr.core.collection1 / com.codahale.metrics.MetricRegistry@196774d7
   [junit4]   2> 2006362 INFO  (coreCloseExecutor-6735-thread-1-processing-x:collection1) [    x:collection1] o.a.s.u.DirectUpdateHandler2 Committing on IndexWriter close.
   [junit4]   2> 2006362 INFO  (coreCloseExecutor-6735-thread-1-processing-x:collection1) [    x:collection1] o.a.s.u.SolrIndexWriter Calling setCommitData with IW:org.apache.solr.update.SolrIndexWriter@72f596b8 commitCommandVersion:0
   [junit4]   2> NOTE: leaving temporary files on disk at: /export/home/jenkins/workspace/Lucene-Solr-7.x-Solaris/solr/build/solr-core/test/J0/temp/solr.update.AutoCommitTest_3DF2F86D09227D36-001
   [junit4]   2> NOTE: test params are: codec=Asserting(Lucene70): {field_t=PostingsFormat(name=LuceneVarGapDocFreqInterval), multiDefault=PostingsFormat(name=Memory), subject=PostingsFormat(name=Memory), id=PostingsFormat(name=LuceneVarGapDocFreqInterval), text=PostingsFormat(name=LuceneFixedGap)}, docValues:{range_facet_l_dv=DocValuesFormat(name=Asserting), _version_=DocValuesFormat(name=Lucene70), intDefault=DocValuesFormat(name=Lucene70), id_i1=DocValuesFormat(name=Lucene70), range_facet_i_dv=DocValuesFormat(name=Memory), intDvoDefault=DocValuesFormat(name=Asserting), range_facet_l=DocValuesFormat(name=Memory), timestamp=DocValuesFormat(name=Memory)}, maxPointsInLeafNode=70, maxMBSortInHeap=6.386351667470089, sim=RandomSimilarity(queryNorm=false): {}, locale=sq-AL, timezone=Australia/NSW
   [junit4]   2> NOTE: SunOS 5.11 amd64/Oracle Corporation 1.8.0_141 (64-bit)/cpus=3,threads=1,free=137143144,total=536870912
   [junit4]   2> NOTE: All tests run in this JVM: [TestRandomRequestDistribution, FacetPivotSmallTest, HdfsRestartWhileUpdatingTest, CheckHdfsIndexTest, DistribJoinFromCollectionTest, OverseerRolesTest, RequestHandlersTest, HighlighterTest, TestSizeLimitedDistributedMap, CurrencyFieldTypeTest, SpatialFilterTest, CollectionReloadTest, TestOrdValues, TestManagedStopFilterFactory, DisMaxRequestHandlerTest, DistributedExpandComponentTest, CdcrVersionReplicationTest, RankQueryTest, PeerSyncWithIndexFingerprintCachingTest, TestMissingGroups, CursorPagingTest, QueryElevationComponentTest, TestClassicSimilarityFactory, TestAddFieldRealTimeGet, SimpleFacetsTest, SolrMetricReporterTest, SolrCoreMetricManagerTest, TestQuerySenderListener, LeaderFailureAfterFreshStartTest, TestPrepRecovery, AnalysisAfterCoreReloadTest, AlternateDirectoryTest, TestHashQParserPlugin, SmileWriterTest, ClusterStateTest, DirectSolrConnectionTest, ChaosMonkeyNothingIsSafeTest, HLLSerializationTest, TestAtomicUpdateErrorCases, TestCustomSort, TestCloudSchemaless, TestHighlightDedupGrouping, TestBinaryField, TestUtils, ClusterStateUpdateTest, BufferStoreTest, TestCloudDeleteByQuery, TestExtendedDismaxParser, TestBackupRepositoryFactory, ReplaceNodeTest, HdfsDirectoryFactoryTest, TestExpandComponent, TestCollectionAPIs, NumericFieldsTest, TestManagedSchemaAPI, CollectionTooManyReplicasTest, CdcrBootstrapTest, TestSurroundQueryParser, ChaosMonkeySafeLeaderWithPullReplicasTest, TestStressLiveNodes, DeleteShardTest, TestXmlQParserPlugin, TestSort, DeleteInactiveReplicaTest, TestImpersonationWithHadoopAuth, TestComplexPhraseLeadingWildcard, TestLazyCores, TestConfigReload, ConfigSetsAPITest, PathHierarchyTokenizerFactoryTest, TlogReplayBufferedWhileIndexingTest, OverseerTest, XsltUpdateRequestHandlerTest, PrimitiveFieldTypeTest, HardAutoCommitTest, DistanceFunctionTest, DistribCursorPagingTest, TestPhraseSuggestions, BJQParserTest, TestHdfsUpdateLog, TestCollectionAPI, JavabinLoaderTest, SolrXmlInZkTest, SolrInfoBeanTest, HdfsCollectionsAPIDistributedZkTest, RequiredFieldsTest, TestReloadAndDeleteDocs, RAMDirectoryFactoryTest, ShardRoutingTest, TestFuzzyAnalyzedSuggestions, TestPseudoReturnFields, SolrIndexSplitterTest, TestMiniSolrCloudClusterSSL, TestDeleteCollectionOnDownNodes, TestPayloadCheckQParserPlugin, AddBlockUpdateTest, SortByFunctionTest, TestDistributedSearch, RestartWhileUpdatingTest, TestSweetSpotSimilarityFactory, CdcrReplicationHandlerTest, HdfsLockFactoryTest, TestNumericTokenStream, TestStressRecovery, TestCoreAdminApis, TestEmbeddedSolrServerConstructors, TestPHPSerializedResponseWriter, HdfsChaosMonkeyNothingIsSafeTest, TestTestInjection, TestLegacyTerms, TestJsonFacets, BooleanFieldTest, TestReplicaProperties, NotRequiredUniqueKeyTest, ManagedSchemaRoundRobinCloudTest, TestManagedResourceStorage, TestUseDocValuesAsStored2, TestBlendedInfixSuggestions, TestCloudJSONFacetJoinDomain, TestLMDirichletSimilarityFactory, DateMathParserTest, TestFreeTextSuggestions, TestStressVersions, TestZkAclsWithHadoopAuth, TestCSVResponseWriter, TestJmxIntegration, TestSubQueryTransformerDistrib, AsyncCallRequestStatusResponseTest, HdfsUnloadDistributedZkTest, TestCloudSearcherWarming, LargeFieldTest, SolrGangliaReporterTest, TestConfigSetImmutable, HdfsThreadLeakTest, TestReplicationHandlerBackup, TestSolrCoreSnapshots, SolrShardReporterTest, SolrCLIZkUtilsTest, TimeZoneUtilsTest, SpellCheckCollatorWithCollapseTest, TestSolrQueryResponse, WordBreakSolrSpellCheckerTest, DocValuesMissingTest, ResponseHeaderTest, ActionThrottleTest, SolrSlf4jReporterTest, TestInitParams, TestBulkSchemaAPI, HdfsBasicDistributedZk2Test, ShardSplitTest, MoveReplicaHDFSUlogDirTest, DirectoryFactoryTest, SolrJmxReporterCloudTest, VMParamsZkACLAndCredentialsProvidersTest, CoreAdminCreateDiscoverTest, CreateCollectionCleanupTest, MultiThreadedOCPTest, ReplicaListTransformerTest, TestReversedWildcardFilterFactory, TestQuerySenderNoQuery, HighlighterConfigTest, TestScoreJoinQPScore, ZkStateReaderTest, DistributedQueryComponentOptimizationTest, SuggesterWFSTTest, TestIBSimilarityFactory, TestSolrCloudWithKerberosAlt, DistributedSpellCheckComponentTest, TestStressCloudBlindAtomicUpdates, TestConfigSetsAPI, CloudMLTQParserTest, TestSimpleTextCodec, TestNoOpRegenerator, LeaderElectionContextKeyTest, BlockJoinFacetRandomTest, SimplePostToolTest, QueryParsingTest, RegexBoostProcessorTest, LeaderElectionTest, TestZkChroot, TestRandomDVFaceting, ZkCLITest, AutoCommitTest]
   [junit4] Completed [378/731 (1!)] on J0 in 5.88s, 3 tests, 1 error <<< FAILURES!

[...truncated 6950 lines...]
   [junit4] Suite: org.apache.solr.handler.extraction.TestExtractionDateUtil
   [junit4]   2> NOTE: reproduce with: ant test  -Dtestcase=TestExtractionDateUtil -Dtests.method=testParseDate -Dtests.seed=A18DA6CC3D8DD45D -Dtests.slow=true -Dtests.locale=tr -Dtests.timezone=America/Metlakatla -Dtests.asserts=true -Dtests.file.encoding=UTF-8
   [junit4] FAILURE 0.16s J1 | TestExtractionDateUtil.testParseDate <<<
   [junit4]    > Throwable #1: java.lang.AssertionError: Incorrect parsed timestamp: 1226583351000 != 1226579751000 (Thu Nov 13 04:35:51 AKST 2008)
   [junit4]    > 	at __randomizedtesting.SeedInfo.seed([A18DA6CC3D8DD45D:EB94DEF94624A3E8]:0)
   [junit4]    > 	at org.apache.solr.handler.extraction.TestExtractionDateUtil.assertParsedDate(TestExtractionDateUtil.java:59)
   [junit4]    > 	at org.apache.solr.handler.extraction.TestExtractionDateUtil.testParseDate(TestExtractionDateUtil.java:54)
   [junit4]    > 	at java.lang.Thread.run(Thread.java:748)
   [junit4]   2> NOTE: test params are: codec=Asserting(Lucene70): {}, docValues:{}, maxPointsInLeafNode=242, maxMBSortInHeap=5.776119695377854, sim=RandomSimilarity(queryNorm=true): {}, locale=tr, timezone=America/Metlakatla
   [junit4]   2> NOTE: SunOS 5.11 amd64/Oracle Corporation 1.8.0_141 (64-bit)/cpus=3,threads=1,free=64051720,total=100663296
   [junit4]   2> NOTE: All tests run in this JVM: [TestExtractionDateUtil]
   [junit4] Completed [1/4 (1!)] on J1 in 1.45s, 2 tests, 1 failure <<< FAILURES!

[...truncated 40435 lines...]

[JENKINS] Lucene-Solr-7.x-Solaris (64bit/jdk1.8.0) - Build # 188 - Still Unstable!

Posted by Policeman Jenkins Server <je...@thetaphi.de>.
Build: https://jenkins.thetaphi.de/job/Lucene-Solr-7.x-Solaris/188/
Java: 64bit/jdk1.8.0 -XX:-UseCompressedOops -XX:+UseParallelGC

1 tests failed.
FAILED:  org.apache.solr.cloud.LeaderElectionContextKeyTest.test

Error Message:


Stack Trace:
java.lang.AssertionError
	at __randomizedtesting.SeedInfo.seed([A7DA4FE630E5C51F:2F8E703C9E19A8E7]:0)
	at org.junit.Assert.fail(Assert.java:92)
	at org.junit.Assert.assertTrue(Assert.java:43)
	at org.junit.Assert.assertTrue(Assert.java:54)
	at org.apache.solr.cloud.LeaderElectionContextKeyTest.test(LeaderElectionContextKeyTest.java:88)
	at sun.reflect.NativeMethodAccessorImpl.invoke0(Native Method)
	at sun.reflect.NativeMethodAccessorImpl.invoke(NativeMethodAccessorImpl.java:62)
	at sun.reflect.DelegatingMethodAccessorImpl.invoke(DelegatingMethodAccessorImpl.java:43)
	at java.lang.reflect.Method.invoke(Method.java:498)
	at com.carrotsearch.randomizedtesting.RandomizedRunner.invoke(RandomizedRunner.java:1737)
	at com.carrotsearch.randomizedtesting.RandomizedRunner$8.evaluate(RandomizedRunner.java:934)
	at com.carrotsearch.randomizedtesting.RandomizedRunner$9.evaluate(RandomizedRunner.java:970)
	at com.carrotsearch.randomizedtesting.RandomizedRunner$10.evaluate(RandomizedRunner.java:984)
	at com.carrotsearch.randomizedtesting.rules.SystemPropertiesRestoreRule$1.evaluate(SystemPropertiesRestoreRule.java:57)
	at org.apache.lucene.util.TestRuleSetupTeardownChained$1.evaluate(TestRuleSetupTeardownChained.java:49)
	at org.apache.lucene.util.AbstractBeforeAfterRule$1.evaluate(AbstractBeforeAfterRule.java:45)
	at org.apache.lucene.util.TestRuleThreadAndTestName$1.evaluate(TestRuleThreadAndTestName.java:48)
	at org.apache.lucene.util.TestRuleIgnoreAfterMaxFailures$1.evaluate(TestRuleIgnoreAfterMaxFailures.java:64)
	at org.apache.lucene.util.TestRuleMarkFailure$1.evaluate(TestRuleMarkFailure.java:47)
	at com.carrotsearch.randomizedtesting.rules.StatementAdapter.evaluate(StatementAdapter.java:36)
	at com.carrotsearch.randomizedtesting.ThreadLeakControl$StatementRunner.run(ThreadLeakControl.java:368)
	at com.carrotsearch.randomizedtesting.ThreadLeakControl.forkTimeoutingTask(ThreadLeakControl.java:817)
	at com.carrotsearch.randomizedtesting.ThreadLeakControl$3.evaluate(ThreadLeakControl.java:468)
	at com.carrotsearch.randomizedtesting.RandomizedRunner.runSingleTest(RandomizedRunner.java:943)
	at com.carrotsearch.randomizedtesting.RandomizedRunner$5.evaluate(RandomizedRunner.java:829)
	at com.carrotsearch.randomizedtesting.RandomizedRunner$6.evaluate(RandomizedRunner.java:879)
	at com.carrotsearch.randomizedtesting.RandomizedRunner$7.evaluate(RandomizedRunner.java:890)
	at com.carrotsearch.randomizedtesting.rules.StatementAdapter.evaluate(StatementAdapter.java:36)
	at com.carrotsearch.randomizedtesting.rules.SystemPropertiesRestoreRule$1.evaluate(SystemPropertiesRestoreRule.java:57)
	at org.apache.lucene.util.AbstractBeforeAfterRule$1.evaluate(AbstractBeforeAfterRule.java:45)
	at com.carrotsearch.randomizedtesting.rules.StatementAdapter.evaluate(StatementAdapter.java:36)
	at org.apache.lucene.util.TestRuleStoreClassName$1.evaluate(TestRuleStoreClassName.java:41)
	at com.carrotsearch.randomizedtesting.rules.NoShadowingOrOverridesOnMethodsRule$1.evaluate(NoShadowingOrOverridesOnMethodsRule.java:40)
	at com.carrotsearch.randomizedtesting.rules.NoShadowingOrOverridesOnMethodsRule$1.evaluate(NoShadowingOrOverridesOnMethodsRule.java:40)
	at com.carrotsearch.randomizedtesting.rules.StatementAdapter.evaluate(StatementAdapter.java:36)
	at com.carrotsearch.randomizedtesting.rules.StatementAdapter.evaluate(StatementAdapter.java:36)
	at com.carrotsearch.randomizedtesting.rules.StatementAdapter.evaluate(StatementAdapter.java:36)
	at org.apache.lucene.util.TestRuleAssertionsRequired$1.evaluate(TestRuleAssertionsRequired.java:53)
	at org.apache.lucene.util.TestRuleMarkFailure$1.evaluate(TestRuleMarkFailure.java:47)
	at org.apache.lucene.util.TestRuleIgnoreAfterMaxFailures$1.evaluate(TestRuleIgnoreAfterMaxFailures.java:64)
	at org.apache.lucene.util.TestRuleIgnoreTestSuites$1.evaluate(TestRuleIgnoreTestSuites.java:54)
	at com.carrotsearch.randomizedtesting.rules.StatementAdapter.evaluate(StatementAdapter.java:36)
	at com.carrotsearch.randomizedtesting.ThreadLeakControl$StatementRunner.run(ThreadLeakControl.java:368)
	at java.lang.Thread.run(Thread.java:748)




Build Log:
[...truncated 11134 lines...]
   [junit4] Suite: org.apache.solr.cloud.LeaderElectionContextKeyTest
   [junit4]   2> Creating dataDir: /export/home/jenkins/workspace/Lucene-Solr-7.x-Solaris/solr/build/solr-core/test/J0/temp/solr.cloud.LeaderElectionContextKeyTest_A7DA4FE630E5C51F-001/init-core-data-001
   [junit4]   2> 30520 WARN  (SUITE-LeaderElectionContextKeyTest-seed#[A7DA4FE630E5C51F]-worker) [    ] o.a.s.SolrTestCaseJ4 startTrackingSearchers: numOpens=15 numCloses=15
   [junit4]   2> 30520 INFO  (SUITE-LeaderElectionContextKeyTest-seed#[A7DA4FE630E5C51F]-worker) [    ] o.a.s.SolrTestCaseJ4 Using PointFields (NUMERIC_POINTS_SYSPROP=true) w/NUMERIC_DOCVALUES_SYSPROP=false
   [junit4]   2> 30521 INFO  (SUITE-LeaderElectionContextKeyTest-seed#[A7DA4FE630E5C51F]-worker) [    ] o.a.s.SolrTestCaseJ4 Randomized ssl (false) and clientAuth (false) via: @org.apache.solr.util.RandomizeSSL(reason=, value=NaN, ssl=NaN, clientAuth=NaN)
   [junit4]   2> 30521 INFO  (SUITE-LeaderElectionContextKeyTest-seed#[A7DA4FE630E5C51F]-worker) [    ] o.a.s.SolrTestCaseJ4 SecureRandom sanity checks: test.solr.allowed.securerandom=null & java.security.egd=file:/dev/./urandom
   [junit4]   2> 30523 INFO  (SUITE-LeaderElectionContextKeyTest-seed#[A7DA4FE630E5C51F]-worker) [    ] o.a.s.c.MiniSolrCloudCluster Starting cluster of 1 servers in /export/home/jenkins/workspace/Lucene-Solr-7.x-Solaris/solr/build/solr-core/test/J0/temp/solr.cloud.LeaderElectionContextKeyTest_A7DA4FE630E5C51F-001/tempDir-001
   [junit4]   2> 30523 INFO  (SUITE-LeaderElectionContextKeyTest-seed#[A7DA4FE630E5C51F]-worker) [    ] o.a.s.c.ZkTestServer STARTING ZK TEST SERVER
   [junit4]   2> 30523 INFO  (Thread-54) [    ] o.a.s.c.ZkTestServer client port:0.0.0.0/0.0.0.0:0
   [junit4]   2> 30523 INFO  (Thread-54) [    ] o.a.s.c.ZkTestServer Starting server
   [junit4]   2> 30525 ERROR (Thread-54) [    ] o.a.z.s.ZooKeeperServer ZKShutdownHandler is not registered, so ZooKeeper server won't take any action on ERROR or SHUTDOWN server state changes
   [junit4]   2> 30623 INFO  (SUITE-LeaderElectionContextKeyTest-seed#[A7DA4FE630E5C51F]-worker) [    ] o.a.s.c.ZkTestServer start zk server on port:60948
   [junit4]   2> 30634 INFO  (jetty-launcher-50-thread-1) [    ] o.e.j.s.Server jetty-9.3.20.v20170531
   [junit4]   2> 30636 INFO  (jetty-launcher-50-thread-1) [    ] o.e.j.s.h.ContextHandler Started o.e.j.s.ServletContextHandler@341e22d{/solr,null,AVAILABLE}
   [junit4]   2> 30640 INFO  (jetty-launcher-50-thread-1) [    ] o.e.j.s.AbstractConnector Started ServerConnector@51e0e252{HTTP/1.1,[http/1.1]}{127.0.0.1:37620}
   [junit4]   2> 30640 INFO  (jetty-launcher-50-thread-1) [    ] o.e.j.s.Server Started @32552ms
   [junit4]   2> 30640 INFO  (jetty-launcher-50-thread-1) [    ] o.a.s.c.s.e.JettySolrRunner Jetty properties: {hostContext=/solr, hostPort=37620}
   [junit4]   2> 30640 ERROR (jetty-launcher-50-thread-1) [    ] o.a.s.u.StartupLoggingUtils Missing Java Option solr.log.dir. Logging may be missing or incomplete.
   [junit4]   2> 30640 INFO  (jetty-launcher-50-thread-1) [    ] o.a.s.s.SolrDispatchFilter  ___      _       Welcome to Apache Solr? version 7.1.0
   [junit4]   2> 30640 INFO  (jetty-launcher-50-thread-1) [    ] o.a.s.s.SolrDispatchFilter / __| ___| |_ _   Starting in cloud mode on port null
   [junit4]   2> 30640 INFO  (jetty-launcher-50-thread-1) [    ] o.a.s.s.SolrDispatchFilter \__ \/ _ \ | '_|  Install dir: null, Default config dir: null
   [junit4]   2> 30644 INFO  (jetty-launcher-50-thread-1) [    ] o.a.s.s.SolrDispatchFilter |___/\___/_|_|    Start time: 2017-09-17T13:46:41.228Z
   [junit4]   2> 30648 INFO  (jetty-launcher-50-thread-1) [    ] o.a.s.s.SolrDispatchFilter solr.xml found in ZooKeeper. Loading...
   [junit4]   2> 30699 INFO  (jetty-launcher-50-thread-1) [    ] o.a.s.c.ZkContainer Zookeeper client=127.0.0.1:60948/solr
   [junit4]   2> 30866 INFO  (jetty-launcher-50-thread-1) [n:127.0.0.1:37620_solr    ] o.a.s.c.Overseer Overseer (id=null) closing
   [junit4]   2> 30867 INFO  (jetty-launcher-50-thread-1) [n:127.0.0.1:37620_solr    ] o.a.s.c.OverseerElectionContext I am going to be the leader 127.0.0.1:37620_solr
   [junit4]   2> 30867 INFO  (jetty-launcher-50-thread-1) [n:127.0.0.1:37620_solr    ] o.a.s.c.Overseer Overseer (id=98674671688613891-127.0.0.1:37620_solr-n_0000000000) starting
   [junit4]   2> 30881 INFO  (jetty-launcher-50-thread-1) [n:127.0.0.1:37620_solr    ] o.a.s.c.ZkController Register node as live in ZooKeeper:/live_nodes/127.0.0.1:37620_solr
   [junit4]   2> 30887 INFO  (zkCallback-57-thread-1-processing-n:127.0.0.1:37620_solr) [n:127.0.0.1:37620_solr    ] o.a.s.c.c.ZkStateReader Updated live nodes from ZooKeeper... (0) -> (1)
   [junit4]   2> 30971 INFO  (jetty-launcher-50-thread-1) [n:127.0.0.1:37620_solr    ] o.a.s.m.r.SolrJmxReporter JMX monitoring for 'solr_37620.solr.node' (registry 'solr.node') enabled at server: com.sun.jmx.mbeanserver.JmxMBeanServer@f0175d3
   [junit4]   2> 30978 INFO  (jetty-launcher-50-thread-1) [n:127.0.0.1:37620_solr    ] o.a.s.m.r.SolrJmxReporter JMX monitoring for 'solr_37620.solr.jvm' (registry 'solr.jvm') enabled at server: com.sun.jmx.mbeanserver.JmxMBeanServer@f0175d3
   [junit4]   2> 30978 INFO  (jetty-launcher-50-thread-1) [n:127.0.0.1:37620_solr    ] o.a.s.m.r.SolrJmxReporter JMX monitoring for 'solr_37620.solr.jetty' (registry 'solr.jetty') enabled at server: com.sun.jmx.mbeanserver.JmxMBeanServer@f0175d3
   [junit4]   2> 30979 INFO  (jetty-launcher-50-thread-1) [n:127.0.0.1:37620_solr    ] o.a.s.c.CorePropertiesLocator Found 0 core definitions underneath /export/home/jenkins/workspace/Lucene-Solr-7.x-Solaris/solr/build/solr-core/test/J0/temp/solr.cloud.LeaderElectionContextKeyTest_A7DA4FE630E5C51F-001/tempDir-001/node1/.
   [junit4]   2> 30995 WARN  (NIOServerCxn.Factory:0.0.0.0/0.0.0.0:0) [    ] o.a.z.s.NIOServerCnxn caught end of stream exception
   [junit4]   2> EndOfStreamException: Unable to read additional data from client sessionid 0x15e901752540004, likely client has closed socket
   [junit4]   2> 	at org.apache.zookeeper.server.NIOServerCnxn.doIO(NIOServerCnxn.java:239)
   [junit4]   2> 	at org.apache.zookeeper.server.NIOServerCnxnFactory.run(NIOServerCnxnFactory.java:203)
   [junit4]   2> 	at java.lang.Thread.run(Thread.java:748)
   [junit4]   2> 31001 INFO  (SUITE-LeaderElectionContextKeyTest-seed#[A7DA4FE630E5C51F]-worker) [    ] o.a.s.c.c.ZkStateReader Updated live nodes from ZooKeeper... (0) -> (1)
   [junit4]   2> 31002 INFO  (SUITE-LeaderElectionContextKeyTest-seed#[A7DA4FE630E5C51F]-worker) [    ] o.a.s.c.s.i.ZkClientClusterStateProvider Cluster at 127.0.0.1:60948/solr ready
   [junit4]   2> 31010 INFO  (qtp1853335318-320) [n:127.0.0.1:37620_solr    ] o.a.s.h.a.CollectionsHandler Invoked Collection Action :create with params replicationFactor=1&collection.configName=config&maxShardsPerNode=1000&name=testCollection1&nrtReplicas=1&action=CREATE&numShards=2&wt=javabin&version=2 and sendToOCPQueue=true
   [junit4]   2> 31014 INFO  (OverseerThreadFactory-131-thread-1-processing-n:127.0.0.1:37620_solr) [n:127.0.0.1:37620_solr    ] o.a.s.c.CreateCollectionCmd Create collection testCollection1
   [junit4]   2> 31126 INFO  (OverseerStateUpdate-98674671688613891-127.0.0.1:37620_solr-n_0000000000) [n:127.0.0.1:37620_solr    ] o.a.s.c.o.SliceMutator createReplica() {
   [junit4]   2>   "operation":"ADDREPLICA",
   [junit4]   2>   "collection":"testCollection1",
   [junit4]   2>   "shard":"shard1",
   [junit4]   2>   "core":"testCollection1_shard1_replica_n1",
   [junit4]   2>   "state":"down",
   [junit4]   2>   "base_url":"http://127.0.0.1:37620/solr",
   [junit4]   2>   "type":"NRT"} 
   [junit4]   2> 31130 INFO  (OverseerStateUpdate-98674671688613891-127.0.0.1:37620_solr-n_0000000000) [n:127.0.0.1:37620_solr    ] o.a.s.c.o.SliceMutator createReplica() {
   [junit4]   2>   "operation":"ADDREPLICA",
   [junit4]   2>   "collection":"testCollection1",
   [junit4]   2>   "shard":"shard2",
   [junit4]   2>   "core":"testCollection1_shard2_replica_n2",
   [junit4]   2>   "state":"down",
   [junit4]   2>   "base_url":"http://127.0.0.1:37620/solr",
   [junit4]   2>   "type":"NRT"} 
   [junit4]   2> 31333 INFO  (qtp1853335318-321) [n:127.0.0.1:37620_solr    ] o.a.s.h.a.CoreAdminOperation core create command qt=/admin/cores&coreNodeName=core_node3&collection.configName=config&newCollection=true&name=testCollection1_shard1_replica_n1&action=CREATE&numShards=2&collection=testCollection1&shard=shard1&wt=javabin&version=2&replicaType=NRT
   [junit4]   2> 31333 INFO  (qtp1853335318-321) [n:127.0.0.1:37620_solr    ] o.a.s.c.TransientSolrCoreCacheDefault Allocating transient cache for 2147483647 transient cores
   [junit4]   2> 31342 INFO  (qtp1853335318-324) [n:127.0.0.1:37620_solr    ] o.a.s.h.a.CoreAdminOperation core create command qt=/admin/cores&coreNodeName=core_node4&collection.configName=config&newCollection=true&name=testCollection1_shard2_replica_n2&action=CREATE&numShards=2&collection=testCollection1&shard=shard2&wt=javabin&version=2&replicaType=NRT
   [junit4]   2> 31452 INFO  (zkCallback-57-thread-1-processing-n:127.0.0.1:37620_solr) [n:127.0.0.1:37620_solr    ] o.a.s.c.c.ZkStateReader A cluster state change: [WatchedEvent state:SyncConnected type:NodeDataChanged path:/collections/testCollection1/state.json] for collection [testCollection1] has occurred - updating... (live nodes size: [1])
   [junit4]   2> 31453 INFO  (zkCallback-57-thread-2-processing-n:127.0.0.1:37620_solr) [n:127.0.0.1:37620_solr    ] o.a.s.c.c.ZkStateReader A cluster state change: [WatchedEvent state:SyncConnected type:NodeDataChanged path:/collections/testCollection1/state.json] for collection [testCollection1] has occurred - updating... (live nodes size: [1])
   [junit4]   2> 32366 INFO  (qtp1853335318-321) [n:127.0.0.1:37620_solr c:testCollection1 s:shard1 r:core_node3 x:testCollection1_shard1_replica_n1] o.a.s.c.SolrConfig Using Lucene MatchVersion: 7.1.0
   [junit4]   2> 32373 INFO  (qtp1853335318-324) [n:127.0.0.1:37620_solr c:testCollection1 s:shard2 r:core_node4 x:testCollection1_shard2_replica_n2] o.a.s.c.SolrConfig Using Lucene MatchVersion: 7.1.0
   [junit4]   2> 32425 INFO  (qtp1853335318-321) [n:127.0.0.1:37620_solr c:testCollection1 s:shard1 r:core_node3 x:testCollection1_shard1_replica_n1] o.a.s.s.IndexSchema [testCollection1_shard1_replica_n1] Schema name=minimal
   [junit4]   2> 32446 INFO  (qtp1853335318-324) [n:127.0.0.1:37620_solr c:testCollection1 s:shard2 r:core_node4 x:testCollection1_shard2_replica_n2] o.a.s.s.IndexSchema [testCollection1_shard2_replica_n2] Schema name=minimal
   [junit4]   2> 32450 INFO  (qtp1853335318-324) [n:127.0.0.1:37620_solr c:testCollection1 s:shard2 r:core_node4 x:testCollection1_shard2_replica_n2] o.a.s.s.IndexSchema Loaded schema minimal/1.1 with uniqueid field id
   [junit4]   2> 32450 INFO  (qtp1853335318-324) [n:127.0.0.1:37620_solr c:testCollection1 s:shard2 r:core_node4 x:testCollection1_shard2_replica_n2] o.a.s.c.CoreContainer Creating SolrCore 'testCollection1_shard2_replica_n2' using configuration from collection testCollection1, trusted=true
   [junit4]   2> 32451 INFO  (qtp1853335318-324) [n:127.0.0.1:37620_solr c:testCollection1 s:shard2 r:core_node4 x:testCollection1_shard2_replica_n2] o.a.s.m.r.SolrJmxReporter JMX monitoring for 'solr_37620.solr.core.testCollection1.shard2.replica_n2' (registry 'solr.core.testCollection1.shard2.replica_n2') enabled at server: com.sun.jmx.mbeanserver.JmxMBeanServer@f0175d3
   [junit4]   2> 32452 INFO  (qtp1853335318-324) [n:127.0.0.1:37620_solr c:testCollection1 s:shard2 r:core_node4 x:testCollection1_shard2_replica_n2] o.a.s.c.SolrCore solr.RecoveryStrategy.Builder
   [junit4]   2> 32452 INFO  (qtp1853335318-324) [n:127.0.0.1:37620_solr c:testCollection1 s:shard2 r:core_node4 x:testCollection1_shard2_replica_n2] o.a.s.c.SolrCore [[testCollection1_shard2_replica_n2] ] Opening new SolrCore at [/export/home/jenkins/workspace/Lucene-Solr-7.x-Solaris/solr/build/solr-core/test/J0/temp/solr.cloud.LeaderElectionContextKeyTest_A7DA4FE630E5C51F-001/tempDir-001/node1/testCollection1_shard2_replica_n2], dataDir=[/export/home/jenkins/workspace/Lucene-Solr-7.x-Solaris/solr/build/solr-core/test/J0/temp/solr.cloud.LeaderElectionContextKeyTest_A7DA4FE630E5C51F-001/tempDir-001/node1/./testCollection1_shard2_replica_n2/data/]
   [junit4]   2> 32461 INFO  (qtp1853335318-321) [n:127.0.0.1:37620_solr c:testCollection1 s:shard1 r:core_node3 x:testCollection1_shard1_replica_n1] o.a.s.s.IndexSchema Loaded schema minimal/1.1 with uniqueid field id
   [junit4]   2> 32461 INFO  (qtp1853335318-321) [n:127.0.0.1:37620_solr c:testCollection1 s:shard1 r:core_node3 x:testCollection1_shard1_replica_n1] o.a.s.c.CoreContainer Creating SolrCore 'testCollection1_shard1_replica_n1' using configuration from collection testCollection1, trusted=true
   [junit4]   2> 32462 INFO  (qtp1853335318-321) [n:127.0.0.1:37620_solr c:testCollection1 s:shard1 r:core_node3 x:testCollection1_shard1_replica_n1] o.a.s.m.r.SolrJmxReporter JMX monitoring for 'solr_37620.solr.core.testCollection1.shard1.replica_n1' (registry 'solr.core.testCollection1.shard1.replica_n1') enabled at server: com.sun.jmx.mbeanserver.JmxMBeanServer@f0175d3
   [junit4]   2> 32462 INFO  (qtp1853335318-321) [n:127.0.0.1:37620_solr c:testCollection1 s:shard1 r:core_node3 x:testCollection1_shard1_replica_n1] o.a.s.c.SolrCore solr.RecoveryStrategy.Builder
   [junit4]   2> 32462 INFO  (qtp1853335318-321) [n:127.0.0.1:37620_solr c:testCollection1 s:shard1 r:core_node3 x:testCollection1_shard1_replica_n1] o.a.s.c.SolrCore [[testCollection1_shard1_replica_n1] ] Opening new SolrCore at [/export/home/jenkins/workspace/Lucene-Solr-7.x-Solaris/solr/build/solr-core/test/J0/temp/solr.cloud.LeaderElectionContextKeyTest_A7DA4FE630E5C51F-001/tempDir-001/node1/testCollection1_shard1_replica_n1], dataDir=[/export/home/jenkins/workspace/Lucene-Solr-7.x-Solaris/solr/build/solr-core/test/J0/temp/solr.cloud.LeaderElectionContextKeyTest_A7DA4FE630E5C51F-001/tempDir-001/node1/./testCollection1_shard1_replica_n1/data/]
   [junit4]   2> 32568 INFO  (qtp1853335318-321) [n:127.0.0.1:37620_solr c:testCollection1 s:shard1 r:core_node3 x:testCollection1_shard1_replica_n1] o.a.s.u.UpdateHandler Using UpdateLog implementation: org.apache.solr.update.UpdateLog
   [junit4]   2> 32569 INFO  (qtp1853335318-321) [n:127.0.0.1:37620_solr c:testCollection1 s:shard1 r:core_node3 x:testCollection1_shard1_replica_n1] o.a.s.u.UpdateLog Initializing UpdateLog: dataDir=null defaultSyncLevel=FLUSH numRecordsToKeep=100 maxNumLogsToKeep=10 numVersionBuckets=65536
   [junit4]   2> 32569 INFO  (qtp1853335318-321) [n:127.0.0.1:37620_solr c:testCollection1 s:shard1 r:core_node3 x:testCollection1_shard1_replica_n1] o.a.s.u.CommitTracker Hard AutoCommit: disabled
   [junit4]   2> 32570 INFO  (qtp1853335318-321) [n:127.0.0.1:37620_solr c:testCollection1 s:shard1 r:core_node3 x:testCollection1_shard1_replica_n1] o.a.s.u.CommitTracker Soft AutoCommit: disabled
   [junit4]   2> 32583 INFO  (qtp1853335318-324) [n:127.0.0.1:37620_solr c:testCollection1 s:shard2 r:core_node4 x:testCollection1_shard2_replica_n2] o.a.s.u.UpdateHandler Using UpdateLog implementation: org.apache.solr.update.UpdateLog
   [junit4]   2> 32583 INFO  (qtp1853335318-324) [n:127.0.0.1:37620_solr c:testCollection1 s:shard2 r:core_node4 x:testCollection1_shard2_replica_n2] o.a.s.u.UpdateLog Initializing UpdateLog: dataDir=null defaultSyncLevel=FLUSH numRecordsToKeep=100 maxNumLogsToKeep=10 numVersionBuckets=65536
   [junit4]   2> 32584 INFO  (qtp1853335318-324) [n:127.0.0.1:37620_solr c:testCollection1 s:shard2 r:core_node4 x:testCollection1_shard2_replica_n2] o.a.s.u.CommitTracker Hard AutoCommit: disabled
   [junit4]   2> 32584 INFO  (qtp1853335318-324) [n:127.0.0.1:37620_solr c:testCollection1 s:shard2 r:core_node4 x:testCollection1_shard2_replica_n2] o.a.s.u.CommitTracker Soft AutoCommit: disabled
   [junit4]   2> 32585 INFO  (qtp1853335318-321) [n:127.0.0.1:37620_solr c:testCollection1 s:shard1 r:core_node3 x:testCollection1_shard1_replica_n1] o.a.s.s.SolrIndexSearcher Opening [Searcher@67fc28f6[testCollection1_shard1_replica_n1] main]
   [junit4]   2> 32587 INFO  (qtp1853335318-321) [n:127.0.0.1:37620_solr c:testCollection1 s:shard1 r:core_node3 x:testCollection1_shard1_replica_n1] o.a.s.r.ManagedResourceStorage Configured ZooKeeperStorageIO with znodeBase: /configs/config
   [junit4]   2> 32587 INFO  (qtp1853335318-321) [n:127.0.0.1:37620_solr c:testCollection1 s:shard1 r:core_node3 x:testCollection1_shard1_replica_n1] o.a.s.r.ManagedResourceStorage Loaded null at path _rest_managed.json using ZooKeeperStorageIO:path=/configs/config
   [junit4]   2> 32588 INFO  (qtp1853335318-321) [n:127.0.0.1:37620_solr c:testCollection1 s:shard1 r:core_node3 x:testCollection1_shard1_replica_n1] o.a.s.h.ReplicationHandler Commits will be reserved for  10000
   [junit4]   2> 32599 INFO  (qtp1853335318-324) [n:127.0.0.1:37620_solr c:testCollection1 s:shard2 r:core_node4 x:testCollection1_shard2_replica_n2] o.a.s.s.SolrIndexSearcher Opening [Searcher@219337a1[testCollection1_shard2_replica_n2] main]
   [junit4]   2> 32600 INFO  (searcherExecutor-135-thread-1-processing-n:127.0.0.1:37620_solr x:testCollection1_shard1_replica_n1 s:shard1 c:testCollection1 r:core_node3) [n:127.0.0.1:37620_solr c:testCollection1 s:shard1 r:core_node3 x:testCollection1_shard1_replica_n1] o.a.s.c.SolrCore [testCollection1_shard1_replica_n1] Registered new searcher Searcher@67fc28f6[testCollection1_shard1_replica_n1] main{ExitableDirectoryReader(UninvertingDirectoryReader())}
   [junit4]   2> 32602 INFO  (qtp1853335318-321) [n:127.0.0.1:37620_solr c:testCollection1 s:shard1 r:core_node3 x:testCollection1_shard1_replica_n1] o.a.s.u.UpdateLog Could not find max version in index or recent updates, using new clock 1578794749196763136
   [junit4]   2> 32607 INFO  (qtp1853335318-324) [n:127.0.0.1:37620_solr c:testCollection1 s:shard2 r:core_node4 x:testCollection1_shard2_replica_n2] o.a.s.r.ManagedResourceStorage Configured ZooKeeperStorageIO with znodeBase: /configs/config
   [junit4]   2> 32615 INFO  (qtp1853335318-324) [n:127.0.0.1:37620_solr c:testCollection1 s:shard2 r:core_node4 x:testCollection1_shard2_replica_n2] o.a.s.r.ManagedResourceStorage Loaded null at path _rest_managed.json using ZooKeeperStorageIO:path=/configs/config
   [junit4]   2> 32620 INFO  (qtp1853335318-324) [n:127.0.0.1:37620_solr c:testCollection1 s:shard2 r:core_node4 x:testCollection1_shard2_replica_n2] o.a.s.h.ReplicationHandler Commits will be reserved for  10000
   [junit4]   2> 32623 INFO  (searcherExecutor-134-thread-1-processing-n:127.0.0.1:37620_solr x:testCollection1_shard2_replica_n2 s:shard2 c:testCollection1 r:core_node4) [n:127.0.0.1:37620_solr c:testCollection1 s:shard2 r:core_node4 x:testCollection1_shard2_replica_n2] o.a.s.c.SolrCore [testCollection1_shard2_replica_n2] Registered new searcher Searcher@219337a1[testCollection1_shard2_replica_n2] main{ExitableDirectoryReader(UninvertingDirectoryReader())}
   [junit4]   2> 32625 INFO  (qtp1853335318-324) [n:127.0.0.1:37620_solr c:testCollection1 s:shard2 r:core_node4 x:testCollection1_shard2_replica_n2] o.a.s.u.UpdateLog Could not find max version in index or recent updates, using new clock 1578794749220880384
   [junit4]   2> 32637 INFO  (qtp1853335318-321) [n:127.0.0.1:37620_solr c:testCollection1 s:shard1 r:core_node3 x:testCollection1_shard1_replica_n1] o.a.s.c.ShardLeaderElectionContext Enough replicas found to continue.
   [junit4]   2> 32637 INFO  (qtp1853335318-321) [n:127.0.0.1:37620_solr c:testCollection1 s:shard1 r:core_node3 x:testCollection1_shard1_replica_n1] o.a.s.c.ShardLeaderElectionContext I may be the new leader - try and sync
   [junit4]   2> 32637 INFO  (qtp1853335318-321) [n:127.0.0.1:37620_solr c:testCollection1 s:shard1 r:core_node3 x:testCollection1_shard1_replica_n1] o.a.s.c.SyncStrategy Sync replicas to http://127.0.0.1:37620/solr/testCollection1_shard1_replica_n1/
   [junit4]   2> 32637 INFO  (qtp1853335318-321) [n:127.0.0.1:37620_solr c:testCollection1 s:shard1 r:core_node3 x:testCollection1_shard1_replica_n1] o.a.s.c.SyncStrategy Sync Success - now sync replicas to me
   [junit4]   2> 32638 INFO  (qtp1853335318-321) [n:127.0.0.1:37620_solr c:testCollection1 s:shard1 r:core_node3 x:testCollection1_shard1_replica_n1] o.a.s.c.SyncStrategy http://127.0.0.1:37620/solr/testCollection1_shard1_replica_n1/ has no replicas
   [junit4]   2> 32638 INFO  (qtp1853335318-321) [n:127.0.0.1:37620_solr c:testCollection1 s:shard1 r:core_node3 x:testCollection1_shard1_replica_n1] o.a.s.c.ShardLeaderElectionContext Found all replicas participating in election, clear LIR
   [junit4]   2> 32667 INFO  (qtp1853335318-321) [n:127.0.0.1:37620_solr c:testCollection1 s:shard1 r:core_node3 x:testCollection1_shard1_replica_n1] o.a.s.c.ShardLeaderElectionContext I am the new leader: http://127.0.0.1:37620/solr/testCollection1_shard1_replica_n1/ shard1
   [junit4]   2> 32693 INFO  (qtp1853335318-324) [n:127.0.0.1:37620_solr c:testCollection1 s:shard2 r:core_node4 x:testCollection1_shard2_replica_n2] o.a.s.c.ShardLeaderElectionContext Enough replicas found to continue.
   [junit4]   2> 32693 INFO  (qtp1853335318-324) [n:127.0.0.1:37620_solr c:testCollection1 s:shard2 r:core_node4 x:testCollection1_shard2_replica_n2] o.a.s.c.ShardLeaderElectionContext I may be the new leader - try and sync
   [junit4]   2> 32693 INFO  (qtp1853335318-324) [n:127.0.0.1:37620_solr c:testCollection1 s:shard2 r:core_node4 x:testCollection1_shard2_replica_n2] o.a.s.c.SyncStrategy Sync replicas to http://127.0.0.1:37620/solr/testCollection1_shard2_replica_n2/
   [junit4]   2> 32693 INFO  (qtp1853335318-324) [n:127.0.0.1:37620_solr c:testCollection1 s:shard2 r:core_node4 x:testCollection1_shard2_replica_n2] o.a.s.c.SyncStrategy Sync Success - now sync replicas to me
   [junit4]   2> 32693 INFO  (qtp1853335318-324) [n:127.0.0.1:37620_solr c:testCollection1 s:shard2 r:core_node4 x:testCollection1_shard2_replica_n2] o.a.s.c.SyncStrategy http://127.0.0.1:37620/solr/testCollection1_shard2_replica_n2/ has no replicas
   [junit4]   2> 32693 INFO  (qtp1853335318-324) [n:127.0.0.1:37620_solr c:testCollection1 s:shard2 r:core_node4 x:testCollection1_shard2_replica_n2] o.a.s.c.ShardLeaderElectionContext Found all replicas participating in election, clear LIR
   [junit4]   2> 32698 INFO  (qtp1853335318-324) [n:127.0.0.1:37620_solr c:testCollection1 s:shard2 r:core_node4 x:testCollection1_shard2_replica_n2] o.a.s.c.ShardLeaderElectionContext I am the new leader: http://127.0.0.1:37620/solr/testCollection1_shard2_replica_n2/ shard2
   [junit4]   2> 32806 INFO  (zkCallback-57-thread-2-processing-n:127.0.0.1:37620_solr) [n:127.0.0.1:37620_solr    ] o.a.s.c.c.ZkStateReader A cluster state change: [WatchedEvent state:SyncConnected type:NodeDataChanged path:/collections/testCollection1/state.json] for collection [testCollection1] has occurred - updating... (live nodes size: [1])
   [junit4]   2> 32806 INFO  (zkCallback-57-thread-1-processing-n:127.0.0.1:37620_solr) [n:127.0.0.1:37620_solr    ] o.a.s.c.c.ZkStateReader A cluster state change: [WatchedEvent state:SyncConnected type:NodeDataChanged path:/collections/testCollection1/state.json] for collection [testCollection1] has occurred - updating... (live nodes size: [1])
   [junit4]   2> 32836 INFO  (qtp1853335318-321) [n:127.0.0.1:37620_solr c:testCollection1 s:shard1 r:core_node3 x:testCollection1_shard1_replica_n1] o.a.s.c.ZkController I am the leader, no recovery necessary
   [junit4]   2> 32840 INFO  (qtp1853335318-321) [n:127.0.0.1:37620_solr c:testCollection1 s:shard1 r:core_node3 x:testCollection1_shard1_replica_n1] o.a.s.s.HttpSolrCall [admin] webapp=null path=/admin/cores params={qt=/admin/cores&coreNodeName=core_node3&collection.configName=config&newCollection=true&name=testCollection1_shard1_replica_n1&action=CREATE&numShards=2&collection=testCollection1&shard=shard1&wt=javabin&version=2&replicaType=NRT} status=0 QTime=1507
   [junit4]   2> 32853 INFO  (qtp1853335318-324) [n:127.0.0.1:37620_solr c:testCollection1 s:shard2 r:core_node4 x:testCollection1_shard2_replica_n2] o.a.s.c.ZkController I am the leader, no recovery necessary
   [junit4]   2> 32860 INFO  (qtp1853335318-324) [n:127.0.0.1:37620_solr c:testCollection1 s:shard2 r:core_node4 x:testCollection1_shard2_replica_n2] o.a.s.s.HttpSolrCall [admin] webapp=null path=/admin/cores params={qt=/admin/cores&coreNodeName=core_node4&collection.configName=config&newCollection=true&name=testCollection1_shard2_replica_n2&action=CREATE&numShards=2&collection=testCollection1&shard=shard2&wt=javabin&version=2&replicaType=NRT} status=0 QTime=1518
   [junit4]   2> 32873 INFO  (qtp1853335318-320) [n:127.0.0.1:37620_solr    ] o.a.s.h.a.CollectionsHandler Wait for new collection to be active for at most 30 seconds. Check all shard replicas
   [junit4]   2> 32961 INFO  (zkCallback-57-thread-1-processing-n:127.0.0.1:37620_solr) [n:127.0.0.1:37620_solr    ] o.a.s.c.c.ZkStateReader A cluster state change: [WatchedEvent state:SyncConnected type:NodeDataChanged path:/collections/testCollection1/state.json] for collection [testCollection1] has occurred - updating... (live nodes size: [1])
   [junit4]   2> 32961 INFO  (zkCallback-57-thread-2-processing-n:127.0.0.1:37620_solr) [n:127.0.0.1:37620_solr    ] o.a.s.c.c.ZkStateReader A cluster state change: [WatchedEvent state:SyncConnected type:NodeDataChanged path:/collections/testCollection1/state.json] for collection [testCollection1] has occurred - updating... (live nodes size: [1])
   [junit4]   2> 33016 INFO  (OverseerCollectionConfigSetProcessor-98674671688613891-127.0.0.1:37620_solr-n_0000000000) [n:127.0.0.1:37620_solr    ] o.a.s.c.OverseerTaskQueue Response ZK path: /overseer/collection-queue-work/qnr-0000000000 doesn't exist.  Requestor may have disconnected from ZooKeeper
   [junit4]   2> 33874 INFO  (qtp1853335318-320) [n:127.0.0.1:37620_solr    ] o.a.s.s.HttpSolrCall [admin] webapp=null path=/admin/collections params={replicationFactor=1&collection.configName=config&maxShardsPerNode=1000&name=testCollection1&nrtReplicas=1&action=CREATE&numShards=2&wt=javabin&version=2} status=0 QTime=2865
   [junit4]   2> 33877 INFO  (qtp1853335318-319) [n:127.0.0.1:37620_solr    ] o.a.s.h.a.CollectionsHandler Invoked Collection Action :create with params replicationFactor=1&collection.configName=config&maxShardsPerNode=1000&name=testCollection2&nrtReplicas=1&action=CREATE&numShards=2&wt=javabin&version=2 and sendToOCPQueue=true
   [junit4]   2> 33880 INFO  (OverseerThreadFactory-131-thread-2-processing-n:127.0.0.1:37620_solr) [n:127.0.0.1:37620_solr    ] o.a.s.c.CreateCollectionCmd Create collection testCollection2
   [junit4]   2> 34090 INFO  (OverseerStateUpdate-98674671688613891-127.0.0.1:37620_solr-n_0000000000) [n:127.0.0.1:37620_solr    ] o.a.s.c.o.SliceMutator createReplica() {
   [junit4]   2>   "operation":"ADDREPLICA",
   [junit4]   2>   "collection":"testCollection2",
   [junit4]   2>   "shard":"shard1",
   [junit4]   2>   "core":"testCollection2_shard1_replica_n1",
   [junit4]   2>   "state":"down",
   [junit4]   2>   "base_url":"http://127.0.0.1:37620/solr",
   [junit4]   2>   "type":"NRT"} 
   [junit4]   2> 34094 INFO  (OverseerStateUpdate-98674671688613891-127.0.0.1:37620_solr-n_0000000000) [n:127.0.0.1:37620_solr    ] o.a.s.c.o.SliceMutator createReplica() {
   [junit4]   2>   "operation":"ADDREPLICA",
   [junit4]   2>   "collection":"testCollection2",
   [junit4]   2>   "shard":"shard2",
   [junit4]   2>   "core":"testCollection2_shard2_replica_n3",
   [junit4]   2>   "state":"down",
   [junit4]   2>   "base_url":"http://127.0.0.1:37620/solr",
   [junit4]   2>   "type":"NRT"} 
   [junit4]   2> 34297 INFO  (qtp1853335318-323) [n:127.0.0.1:37620_solr    ] o.a.s.h.a.CoreAdminOperation core create command qt=/admin/cores&coreNodeName=core_node4&collection.configName=config&newCollection=true&name=testCollection2_shard2_replica_n3&action=CREATE&numShards=2&collection=testCollection2&shard=shard2&wt=javabin&version=2&replicaType=NRT
   [junit4]   2> 34298 INFO  (qtp1853335318-318) [n:127.0.0.1:37620_solr    ] o.a.s.h.a.CoreAdminOperation core create command qt=/admin/cores&coreNodeName=core_node2&collection.configName=config&newCollection=true&name=testCollection2_shard1_replica_n1&action=CREATE&numShards=2&collection=testCollection2&shard=shard1&wt=javabin&version=2&replicaType=NRT
   [junit4]   2> 34405 INFO  (zkCallback-57-thread-2-processing-n:127.0.0.1:37620_solr) [n:127.0.0.1:37620_solr    ] o.a.s.c.c.ZkStateReader A cluster state change: [WatchedEvent state:SyncConnected type:NodeDataChanged path:/collections/testCollection2/state.json] for collection [testCollection2] has occurred - updating... (live nodes size: [1])
   [junit4]   2> 34405 INFO  (zkCallback-57-thread-1-processing-n:127.0.0.1:37620_solr) [n:127.0.0.1:37620_solr    ] o.a.s.c.c.ZkStateReader A cluster state change: [WatchedEvent state:SyncConnected type:NodeDataChanged path:/collections/testCollection2/state.json] for collection [testCollection2] has occurred - updating... (live nodes size: [1])
   [junit4]   2> 35313 INFO  (qtp1853335318-318) [n:127.0.0.1:37620_solr c:testCollection2 s:shard1 r:core_node2 x:testCollection2_shard1_replica_n1] o.a.s.c.SolrConfig Using Lucene MatchVersion: 7.1.0
   [junit4]   2> 35323 INFO  (qtp1853335318-323) [n:127.0.0.1:37620_solr c:testCollection2 s:shard2 r:core_node4 x:testCollection2_shard2_replica_n3] o.a.s.c.SolrConfig Using Lucene MatchVersion: 7.1.0
   [junit4]   2> 35329 INFO  (qtp1853335318-318) [n:127.0.0.1:37620_solr c:testCollection2 s:shard1 r:core_node2 x:testCollection2_shard1_replica_n1] o.a.s.s.IndexSchema [testCollection2_shard1_replica_n1] Schema name=minimal
   [junit4]   2> 35331 INFO  (qtp1853335318-318) [n:127.0.0.1:37620_solr c:testCollection2 s:shard1 r:core_node2 x:testCollection2_shard1_replica_n1] o.a.s.s.IndexSchema Loaded schema minimal/1.1 with uniqueid field id
   [junit4]   2> 35331 INFO  (qtp1853335318-323) [n:127.0.0.1:37620_solr c:testCollection2 s:shard2 r:core_node4 x:testCollection2_shard2_replica_n3] o.a.s.s.IndexSchema [testCollection2_shard2_replica_n3] Schema name=minimal
   [junit4]   2> 35332 INFO  (qtp1853335318-318) [n:127.0.0.1:37620_solr c:testCollection2 s:shard1 r:core_node2 x:testCollection2_shard1_replica_n1] o.a.s.c.CoreContainer Creating SolrCore 'testCollection2_shard1_replica_n1' using configuration from collection testCollection2, trusted=true
   [junit4]   2> 35333 INFO  (qtp1853335318-318) [n:127.0.0.1:37620_solr c:testCollection2 s:shard1 r:core_node2 x:testCollection2_shard1_replica_n1] o.a.s.m.r.SolrJmxReporter JMX monitoring for 'solr_37620.solr.core.testCollection2.shard1.replica_n1' (registry 'solr.core.testCollection2.shard1.replica_n1') enabled at server: com.sun.jmx.mbeanserver.JmxMBeanServer@f0175d3
   [junit4]   2> 35333 INFO  (qtp1853335318-318) [n:127.0.0.1:37620_solr c:testCollection2 s:shard1 r:core_node2 x:testCollection2_shard1_replica_n1] o.a.s.c.SolrCore solr.RecoveryStrategy.Builder
   [junit4]   2> 35333 INFO  (qtp1853335318-318) [n:127.0.0.1:37620_solr c:testCollection2 s:shard1 r:core_node2 x:testCollection2_shard1_replica_n1] o.a.s.c.SolrCore [[testCollection2_shard1_replica_n1] ] Opening new SolrCore at [/export/home/jenkins/workspace/Lucene-Solr-7.x-Solaris/solr/build/solr-core/test/J0/temp/solr.cloud.LeaderElectionContextKeyTest_A7DA4FE630E5C51F-001/tempDir-001/node1/testCollection2_shard1_replica_n1], dataDir=[/export/home/jenkins/workspace/Lucene-Solr-7.x-Solaris/solr/build/solr-core/test/J0/temp/solr.cloud.LeaderElectionContextKeyTest_A7DA4FE630E5C51F-001/tempDir-001/node1/./testCollection2_shard1_replica_n1/data/]
   [junit4]   2> 35334 INFO  (qtp1853335318-323) [n:127.0.0.1:37620_solr c:testCollection2 s:shard2 r:core_node4 x:testCollection2_shard2_replica_n3] o.a.s.s.IndexSchema Loaded schema minimal/1.1 with uniqueid field id
   [junit4]   2> 35334 INFO  (qtp1853335318-323) [n:127.0.0.1:37620_solr c:testCollection2 s:shard2 r:core_node4 x:testCollection2_shard2_replica_n3] o.a.s.c.CoreContainer Creating SolrCore 'testCollection2_shard2_replica_n3' using configuration from collection testCollection2, trusted=true
   [junit4]   2> 35334 INFO  (qtp1853335318-323) [n:127.0.0.1:37620_solr c:testCollection2 s:shard2 r:core_node4 x:testCollection2_shard2_replica_n3] o.a.s.m.r.SolrJmxReporter JMX monitoring for 'solr_37620.solr.core.testCollection2.shard2.replica_n3' (registry 'solr.core.testCollection2.shard2.replica_n3') enabled at server: com.sun.jmx.mbeanserver.JmxMBeanServer@f0175d3
   [junit4]   2> 35334 INFO  (qtp1853335318-323) [n:127.0.0.1:37620_solr c:testCollection2 s:shard2 r:core_node4 x:testCollection2_shard2_replica_n3] o.a.s.c.SolrCore solr.RecoveryStrategy.Builder
   [junit4]   2> 35334 INFO  (qtp1853335318-323) [n:127.0.0.1:37620_solr c:testCollection2 s:shard2 r:core_node4 x:testCollection2_shard2_replica_n3] o.a.s.c.SolrCore [[testCollection2_shard2_replica_n3] ] Opening new SolrCore at [/export/home/jenkins/workspace/Lucene-Solr-7.x-Solaris/solr/build/solr-core/test/J0/temp/solr.cloud.LeaderElectionContextKeyTest_A7DA4FE630E5C51F-001/tempDir-001/node1/testCollection2_shard2_replica_n3], dataDir=[/export/home/jenkins/workspace/Lucene-Solr-7.x-Solaris/solr/build/solr-core/test/J0/temp/solr.cloud.LeaderElectionContextKeyTest_A7DA4FE630E5C51F-001/tempDir-001/node1/./testCollection2_shard2_replica_n3/data/]
   [junit4]   2> 35385 INFO  (qtp1853335318-318) [n:127.0.0.1:37620_solr c:testCollection2 s:shard1 r:core_node2 x:testCollection2_shard1_replica_n1] o.a.s.u.UpdateHandler Using UpdateLog implementation: org.apache.solr.update.UpdateLog
   [junit4]   2> 35385 INFO  (qtp1853335318-323) [n:127.0.0.1:37620_solr c:testCollection2 s:shard2 r:core_node4 x:testCollection2_shard2_replica_n3] o.a.s.u.UpdateHandler Using UpdateLog implementation: org.apache.solr.update.UpdateLog
   [junit4]   2> 35385 INFO  (qtp1853335318-318) [n:127.0.0.1:37620_solr c:testCollection2 s:shard1 r:core_node2 x:testCollection2_shard1_replica_n1] o.a.s.u.UpdateLog Initializing UpdateLog: dataDir=null defaultSyncLevel=FLUSH numRecordsToKeep=100 maxNumLogsToKeep=10 numVersionBuckets=65536
   [junit4]   2> 35385 INFO  (qtp1853335318-323) [n:127.0.0.1:37620_solr c:testCollection2 s:shard2 r:core_node4 x:testCollection2_shard2_replica_n3] o.a.s.u.UpdateLog Initializing UpdateLog: dataDir=null defaultSyncLevel=FLUSH numRecordsToKeep=100 maxNumLogsToKeep=10 numVersionBuckets=65536
   [junit4]   2> 35386 INFO  (qtp1853335318-323) [n:127.0.0.1:37620_solr c:testCollection2 s:shard2 r:core_node4 x:testCollection2_shard2_replica_n3] o.a.s.u.CommitTracker Hard AutoCommit: disabled
   [junit4]   2> 35386 INFO  (qtp1853335318-318) [n:127.0.0.1:37620_solr c:testCollection2 s:shard1 r:core_node2 x:testCollection2_shard1_replica_n1] o.a.s.u.CommitTracker Hard AutoCommit: disabled
   [junit4]   2> 35386 INFO  (qtp1853335318-323) [n:127.0.0.1:37620_solr c:testCollection2 s:shard2 r:core_node4 x:testCollection2_shard2_replica_n3] o.a.s.u.CommitTracker Soft AutoCommit: disabled
   [junit4]   2> 35386 INFO  (qtp1853335318-318) [n:127.0.0.1:37620_solr c:testCollection2 s:shard1 r:core_node2 x:testCollection2_shard1_replica_n1] o.a.s.u.CommitTracker Soft AutoCommit: disabled
   [junit4]   2> 35387 INFO  (qtp1853335318-318) [n:127.0.0.1:37620_solr c:testCollection2 s:shard1 r:core_node2 x:testCollection2_shard1_replica_n1] o.a.s.s.SolrIndexSearcher Opening [Searcher@363317b8[testCollection2_shard1_replica_n1] main]
   [junit4]   2> 35387 INFO  (qtp1853335318-323) [n:127.0.0.1:37620_solr c:testCollection2 s:shard2 r:core_node4 x:testCollection2_shard2_replica_n3] o.a.s.s.SolrIndexSearcher Opening [Searcher@4f53dca0[testCollection2_shard2_replica_n3] main]
   [junit4]   2> 35389 INFO  (qtp1853335318-323) [n:127.0.0.1:37620_solr c:testCollection2 s:shard2 r:core_node4 x:testCollection2_shard2_replica_n3] o.a.s.r.ManagedResourceStorage Configured ZooKeeperStorageIO with znodeBase: /configs/config
   [junit4]   2> 35389 INFO  (qtp1853335318-318) [n:127.0.0.1:37620_solr c:testCollection2 s:shard1 r:core_node2 x:testCollection2_shard1_replica_n1] o.a.s.r.ManagedResourceStorage Configured ZooKeeperStorageIO with znodeBase: /configs/config
   [junit4]   2> 35389 INFO  (qtp1853335318-323) [n:127.0.0.1:37620_solr c:testCollection2 s:shard2 r:core_node4 x:testCollection2_shard2_replica_n3] o.a.s.r.ManagedResourceStorage Loaded null at path _rest_managed.json using ZooKeeperStorageIO:path=/configs/config
   [junit4]   2> 35389 INFO  (qtp1853335318-318) [n:127.0.0.1:37620_solr c:testCollection2 s:shard1 r:core_node2 x:testCollection2_shard1_replica_n1] o.a.s.r.ManagedResourceStorage Loaded null at path _rest_managed.json using ZooKeeperStorageIO:path=/configs/config
   [junit4]   2> 35390 INFO  (qtp1853335318-323) [n:127.0.0.1:37620_solr c:testCollection2 s:shard2 r:core_node4 x:testCollection2_shard2_replica_n3] o.a.s.h.ReplicationHandler Commits will be reserved for  10000
   [junit4]   2> 35390 INFO  (qtp1853335318-318) [n:127.0.0.1:37620_solr c:testCollection2 s:shard1 r:core_node2 x:testCollection2_shard1_replica_n1] o.a.s.h.ReplicationHandler Commits will be reserved for  10000
   [junit4]   2> 35390 INFO  (qtp1853335318-323) [n:127.0.0.1:37620_solr c:testCollection2 s:shard2 r:core_node4 x:testCollection2_shard2_replica_n3] o.a.s.u.UpdateLog Could not find max version in index or recent updates, using new clock 1578794752120193024
   [junit4]   2> 35390 INFO  (qtp1853335318-318) [n:127.0.0.1:37620_solr c:testCollection2 s:shard1 r:core_node2 x:testCollection2_shard1_replica_n1] o.a.s.u.UpdateLog Could not find max version in index or recent updates, using new clock 1578794752120193024
   [junit4]   2> 35393 INFO  (searcherExecutor-145-thread-1-processing-n:127.0.0.1:37620_solr x:testCollection2_shard2_replica_n3 s:shard2 c:testCollection2 r:core_node4) [n:127.0.0.1:37620_solr c:testCollection2 s:shard2 r:core_node4 x:testCollection2_shard2_replica_n3] o.a.s.c.SolrCore [testCollection2_shard2_replica_n3] Registered new searcher Searcher@4f53dca0[testCollection2_shard2_replica_n3] main{ExitableDirectoryReader(UninvertingDirectoryReader())}
   [junit4]   2> 35395 INFO  (searcherExecutor-144-thread-1-processing-n:127.0.0.1:37620_solr x:testCollection2_shard1_replica_n1 s:shard1 c:testCollection2 r:core_node2) [n:127.0.0.1:37620_solr c:testCollection2 s:shard1 r:core_node2 x:testCollection2_shard1_replica_n1] o.a.s.c.SolrCore [testCollection2_shard1_replica_n1] Registered new searcher Searcher@363317b8[testCollection2_shard1_replica_n1] main{ExitableDirectoryReader(UninvertingDirectoryReader())}
   [junit4]   2> 35398 INFO  (qtp1853335318-318) [n:127.0.0.1:37620_solr c:testCollection2 s:shard1 r:core_node2 x:testCollection2_shard1_replica_n1] o.a.s.c.ShardLeaderElectionContext Enough replicas found to continue.
   [junit4]   2> 35398 INFO  (qtp1853335318-318) [n:127.0.0.1:37620_solr c:testCollection2 s:shard1 r:core_node2 x:testCollection2_shard1_replica_n1] o.a.s.c.ShardLeaderElectionContext I may be the new leader - try and sync
   [junit4]   2> 35398 INFO  (qtp1853335318-318) [n:127.0.0.1:37620_solr c:testCollection2 s:shard1 r:core_node2 x:testCollection2_shard1_replica_n1] o.a.s.c.SyncStrategy Sync replicas to http://127.0.0.1:37620/solr/testCollection2_shard1_replica_n1/
   [junit4]   2> 35398 INFO  (qtp1853335318-318) [n:127.0.0.1:37620_solr c:testCollection2 s:shard1 r:core_node2 x:testCollection2_shard1_replica_n1] o.a.s.c.SyncStrategy Sync Success - now sync replicas to me
   [junit4]   2> 35398 INFO  (qtp1853335318-318) [n:127.0.0.1:37620_solr c:testCollection2 s:shard1 r:core_node2 x:testCollection2_shard1_replica_n1] o.a.s.c.SyncStrategy http://127.0.0.1:37620/solr/testCollection2_shard1_replica_n1/ has no replicas
   [junit4]   2> 35398 INFO  (qtp1853335318-318) [n:127.0.0.1:37620_solr c:testCollection2 s:shard1 r:core_node2 x:testCollection2_shard1_replica_n1] o.a.s.c.ShardLeaderElectionContext Found all replicas participating in election, clear LIR
   [junit4]   2> 35399 INFO  (qtp1853335318-323) [n:127.0.0.1:37620_solr c:testCollection2 s:shard2 r:core_node4 x:testCollection2_shard2_replica_n3] o.a.s.c.ShardLeaderElectionContext Enough replicas found to continue.
   [junit4]   2> 35399 INFO  (qtp1853335318-323) [n:127.0.0.1:37620_solr c:testCollection2 s:shard2 r:core_node4 x:testCollection2_shard2_replica_n3] o.a.s.c.ShardLeaderElectionContext I may be the new leader - try and sync
   [junit4]   2> 35400 INFO  (qtp1853335318-323) [n:127.0.0.1:37620_solr c:testCollection2 s:shard2 r:core_node4 x:testCollection2_shard2_replica_n3] o.a.s.c.SyncStrategy Sync replicas to http://127.0.0.1:37620/solr/testCollection2_shard2_replica_n3/
   [junit4]   2> 35400 INFO  (qtp1853335318-323) [n:127.0.0.1:37620_solr c:testCollection2 s:shard2 r:core_node4 x:testCollection2_shard2_replica_n3] o.a.s.c.SyncStrategy Sync Success - now sync replicas to me
   [junit4]   2> 35400 INFO  (qtp1853335318-323) [n:127.0.0.1:37620_solr c:testCollection2 s:shard2 r:core_node4 x:testCollection2_shard2_replica_n3] o.a.s.c.SyncStrategy http://127.0.0.1:37620/solr/testCollection2_shard2_replica_n3/ has no replicas
   [junit4]   2> 35400 INFO  (qtp1853335318-323) [n:127.0.0.1:37620_solr c:testCollection2 s:shard2 r:core_node4 x:testCollection2_shard2_replica_n3] o.a.s.c.ShardLeaderElectionContext Found all replicas participating in election, clear LIR
   [junit4]   2> 35405 INFO  (qtp1853335318-318) [n:127.0.0.1:37620_solr c:testCollection2 s:shard1 r:core_node2 x:testCollection2_shard1_replica_n1] o.a.s.c.ShardLeaderElectionContext I am the new leader: http://127.0.0.1:37620/solr/testCollection2_shard1_replica_n1/ shard1
   [junit4]   2> 35407 INFO  (qtp1853335318-323) [n:127.0.0.1:37620_solr c:testCollection2 s:shard2 r:core_node4 x:testCollection2_shard2_replica_n3] o.a.s.c.ShardLeaderElectionContext I am the new leader: http://127.0.0.1:37620/solr/testCollection2_shard2_replica_n3/ shard2
   [junit4]   2> 35510 INFO  (zkCallback-57-thread-1-processing-n:127.0.0.1:37620_solr) [n:127.0.0.1:37620_solr    ] o.a.s.c.c.ZkStateReader A cluster state change: [WatchedEvent state:SyncConnected type:NodeDataChanged path:/collections/testCollection2/state.json] for collection [testCollection2] has occurred - updating... (live nodes size: [1])
   [junit4]   2> 35510 INFO  (zkCallback-57-thread-2-processing-n:127.0.0.1:37620_solr) [n:127.0.0.1:37620_solr    ] o.a.s.c.c.ZkStateReader A cluster state change: [WatchedEvent state:SyncConnected type:NodeDataChanged path:/collections/testCollection2/state.json] for collection [testCollection2] has occurred - updating... (live nodes size: [1])
   [junit4]   2> 35559 INFO  (qtp1853335318-318) [n:127.0.0.1:37620_solr c:testCollection2 s:shard1 r:core_node2 x:testCollection2_shard1_replica_n1] o.a.s.c.ZkController I am the leader, no recovery necessary
   [junit4]   2> 35559 INFO  (qtp1853335318-323) [n:127.0.0.1:37620_solr c:testCollection2 s:shard2 r:core_node4 x:testCollection2_shard2_replica_n3] o.a.s.c.ZkController I am the leader, no recovery necessary
   [junit4]   2> 35562 INFO  (qtp1853335318-318) [n:127.0.0.1:37620_solr c:testCollection2 s:shard1 r:core_node2 x:testCollection2_shard1_replica_n1] o.a.s.s.HttpSolrCall [admin] webapp=null path=/admin/cores params={qt=/admin/cores&coreNodeName=core_node2&collection.configName=config&newCollection=true&name=testCollection2_shard1_replica_n1&action=CREATE&numShards=2&collection=testCollection2&shard=shard1&wt=javabin&version=2&replicaType=NRT} status=0 QTime=1264
   [junit4]   2> 35563 INFO  (qtp1853335318-323) [n:127.0.0.1:37620_solr c:testCollection2 s:shard2 r:core_node4 x:testCollection2_shard2_replica_n3] o.a.s.s.HttpSolrCall [admin] webapp=null path=/admin/cores params={qt=/admin/cores&coreNodeName=core_node4&collection.configName=config&newCollection=true&name=testCollection2_shard2_replica_n3&action=CREATE&numShards=2&collection=testCollection2&shard=shard2&wt=javabin&version=2&replicaType=NRT} status=0 QTime=1266
   [junit4]   2> 35567 INFO  (qtp1853335318-319) [n:127.0.0.1:37620_solr    ] o.a.s.h.a.CollectionsHandler Wait for new collection to be active for at most 30 seconds. Check all shard replicas
   [junit4]   2> 35669 INFO  (zkCallback-57-thread-2-processing-n:127.0.0.1:37620_solr) [n:127.0.0.1:37620_solr    ] o.a.s.c.c.ZkStateReader A cluster state change: [WatchedEvent state:SyncConnected type:NodeDataChanged path:/collections/testCollection2/state.json] for collection [testCollection2] has occurred - updating... (live nodes size: [1])
   [junit4]   2> 35669 INFO  (zkCallback-57-thread-1-processing-n:127.0.0.1:37620_solr) [n:127.0.0.1:37620_solr    ] o.a.s.c.c.ZkStateReader A cluster state change: [WatchedEvent state:SyncConnected type:NodeDataChanged path:/collections/testCollection2/state.json] for collection [testCollection2] has occurred - updating... (live nodes size: [1])
   [junit4]   2> 35884 INFO  (OverseerCollectionConfigSetProcessor-98674671688613891-127.0.0.1:37620_solr-n_0000000000) [n:127.0.0.1:37620_solr    ] o.a.s.c.OverseerTaskQueue Response ZK path: /overseer/collection-queue-work/qnr-0000000002 doesn't exist.  Requestor may have disconnected from ZooKeeper
   [junit4]   2> 36568 INFO  (qtp1853335318-319) [n:127.0.0.1:37620_solr    ] o.a.s.s.HttpSolrCall [admin] webapp=null path=/admin/collections params={replicationFactor=1&collection.configName=config&maxShardsPerNode=1000&name=testCollection2&nrtReplicas=1&action=CREATE&numShards=2&wt=javabin&version=2} status=0 QTime=2692
   [junit4]   2> 36568 INFO  (SUITE-LeaderElectionContextKeyTest-seed#[A7DA4FE630E5C51F]-worker) [    ] o.a.s.c.AbstractDistribZkTestBase Wait for recoveries to finish - collection: testCollection1 failOnTimeout:true timeout (sec):30
   [junit4]   2> 36569 INFO  (SUITE-LeaderElectionContextKeyTest-seed#[A7DA4FE630E5C51F]-worker) [    ] o.a.s.c.AbstractDistribZkTestBase Recoveries finished - collection: testCollection1
   [junit4]   2> 36569 INFO  (SUITE-LeaderElectionContextKeyTest-seed#[A7DA4FE630E5C51F]-worker) [    ] o.a.s.c.AbstractDistribZkTestBase Wait for recoveries to finish - collection: testCollection2 failOnTimeout:true timeout (sec):30
   [junit4]   2> 36569 INFO  (SUITE-LeaderElectionContextKeyTest-seed#[A7DA4FE630E5C51F]-worker) [    ] o.a.s.c.AbstractDistribZkTestBase Recoveries finished - collection: testCollection2
   [junit4]   2> 36581 INFO  (TEST-LeaderElectionContextKeyTest.test-seed#[A7DA4FE630E5C51F]) [    ] o.a.s.SolrTestCaseJ4 ###Starting test
   [junit4]   2> 36587 INFO  (qtp1853335318-322) [n:127.0.0.1:37620_solr    ] o.a.s.m.SolrMetricManager Closing metric reporters for registry=solr.core.testCollection1.shard2.replica_n2, tag=null
   [junit4]   2> 36587 INFO  (qtp1853335318-322) [n:127.0.0.1:37620_solr    ] o.a.s.m.r.SolrJmxReporter Closing reporter [org.apache.solr.metrics.reporters.SolrJmxReporter@133cb6fa: rootName = solr_37620, domain = solr.core.testCollection1.shard2.replica_n2, service url = null, agent id = null] for registry solr.core.testCollection1.shard2.replica_n2 / com.codahale.metrics.MetricRegistry@f6eae69
   [junit4]   2> 36598 INFO  (qtp1853335318-322) [n:127.0.0.1:37620_solr    ] o.a.s.c.SolrCore [testCollection1_shard2_replica_n2]  CLOSING SolrCore org.apache.solr.core.SolrCore@7a8b06ff
   [junit4]   2> 36598 INFO  (qtp1853335318-322) [n:127.0.0.1:37620_solr    ] o.a.s.m.SolrMetricManager Closing metric reporters for registry=solr.core.testCollection1.shard2.replica_n2, tag=2055931647
   [junit4]   2> 36598 INFO  (qtp1853335318-322) [n:127.0.0.1:37620_solr    ] o.a.s.m.SolrMetricManager Closing metric reporters for registry=solr.collection.testCollection1.shard2.leader, tag=2055931647
   [junit4]   2> 36602 INFO  (qtp1853335318-322) [n:127.0.0.1:37620_solr    ] o.a.s.s.HttpSolrCall [admin] webapp=null path=/admin/cores params={deleteInstanceDir=false&core=testCollection1_shard2_replica_n2&deleteDataDir=false&action=UNLOAD&indexInfo=true&wt=javabin&version=2&deleteIndex=false} status=0 QTime=15
   [junit4]   2> 36603 INFO  (TEST-LeaderElectionContextKeyTest.test-seed#[A7DA4FE630E5C51F]) [    ] o.a.s.SolrTestCaseJ4 ###Ending test
   [junit4]   2> NOTE: reproduce with: ant test  -Dtestcase=LeaderElectionContextKeyTest -Dtests.method=test -Dtests.seed=A7DA4FE630E5C51F -Dtests.slow=true -Dtests.locale=id-ID -Dtests.timezone=America/Atikokan -Dtests.asserts=true -Dtests.file.encoding=ISO-8859-1
   [junit4] FAILURE 0.04s J0 | LeaderElectionContextKeyTest.test <<<
   [junit4]    > Throwable #1: java.lang.AssertionError
   [junit4]    > 	at __randomizedtesting.SeedInfo.seed([A7DA4FE630E5C51F:2F8E703C9E19A8E7]:0)
   [junit4]    > 	at org.apache.solr.cloud.LeaderElectionContextKeyTest.test(LeaderElectionContextKeyTest.java:88)
   [junit4]    > 	at java.lang.Thread.run(Thread.java:748)
   [junit4]   2> 36609 INFO  (jetty-closer-51-thread-1) [    ] o.e.j.s.AbstractConnector Stopped ServerConnector@51e0e252{HTTP/1.1,[http/1.1]}{127.0.0.1:0}
   [junit4]   2> 36609 INFO  (jetty-closer-51-thread-1) [    ] o.a.s.c.CoreContainer Shutting down CoreContainer instance=421543184
   [junit4]   2> 36609 INFO  (jetty-closer-51-thread-1) [    ] o.a.s.m.SolrMetricManager Closing metric reporters for registry=solr.node, tag=null
   [junit4]   2> 36610 INFO  (jetty-closer-51-thread-1) [    ] o.a.s.m.r.SolrJmxReporter Closing reporter [org.apache.solr.metrics.reporters.SolrJmxReporter@e18415e: rootName = solr_37620, domain = solr.node, service url = null, agent id = null] for registry solr.node / com.codahale.metrics.MetricRegistry@46df3889
   [junit4]   2> 36613 INFO  (jetty-closer-51-thread-1) [    ] o.a.s.m.SolrMetricManager Closing metric reporters for registry=solr.jvm, tag=null
   [junit4]   2> 36613 INFO  (jetty-closer-51-thread-1) [    ] o.a.s.m.r.SolrJmxReporter Closing reporter [org.apache.solr.metrics.reporters.SolrJmxReporter@1439976e: rootName = solr_37620, domain = solr.jvm, service url = null, agent id = null] for registry solr.jvm / com.codahale.metrics.MetricRegistry@7cbc45d2
   [junit4]   2> 36615 INFO  (jetty-closer-51-thread-1) [    ] o.a.s.m.SolrMetricManager Closing metric reporters for registry=solr.jetty, tag=null
   [junit4]   2> 36615 INFO  (jetty-closer-51-thread-1) [    ] o.a.s.m.r.SolrJmxReporter Closing reporter [org.apache.solr.metrics.reporters.SolrJmxReporter@1d1073cc: rootName = solr_37620, domain = solr.jetty, service url = null, agent id = null] for registry solr.jetty / com.codahale.metrics.MetricRegistry@5b696847
   [junit4]   2> 36620 INFO  (jetty-closer-51-thread-1) [    ] o.a.s.m.SolrMetricManager Closing metric reporters for registry=solr.cluster, tag=null
   [junit4]   2> 36622 INFO  (coreCloseExecutor-154-thread-1) [n:127.0.0.1:37620_solr c:testCollection1 s:shard1 r:core_node3 x:testCollection1_shard1_replica_n1] o.a.s.c.SolrCore [testCollection1_shard1_replica_n1]  CLOSING SolrCore org.apache.solr.core.SolrCore@241fb4ea
   [junit4]   2> 36623 INFO  (coreCloseExecutor-154-thread-1) [n:127.0.0.1:37620_solr c:testCollection1 s:shard1 r:core_node3 x:testCollection1_shard1_replica_n1] o.a.s.m.SolrMetricManager Closing metric reporters for registry=solr.core.testCollection1.shard1.replica_n1, tag=606057706
   [junit4]   2> 36623 INFO  (coreCloseExecutor-154-thread-1) [n:127.0.0.1:37620_solr c:testCollection1 s:shard1 r:core_node3 x:testCollection1_shard1_replica_n1] o.a.s.m.r.SolrJmxReporter Closing reporter [org.apache.solr.metrics.reporters.SolrJmxReporter@4d6a9d88: rootName = solr_37620, domain = solr.core.testCollection1.shard1.replica_n1, service url = null, agent id = null] for registry solr.core.testCollection1.shard1.replica_n1 / com.codahale.metrics.MetricRegistry@2b886e0
   [junit4]   2> 36623 INFO  (coreCloseExecutor-154-thread-3) [n:127.0.0.1:37620_solr c:testCollection2 s:shard1 r:core_node2 x:testCollection2_shard1_replica_n1] o.a.s.c.SolrCore [testCollection2_shard1_replica_n1]  CLOSING SolrCore org.apache.solr.core.SolrCore@369f0b32
   [junit4]   2> 36623 INFO  (coreCloseExecutor-154-thread-2) [n:127.0.0.1:37620_solr c:testCollection2 s:shard2 r:core_node4 x:testCollection2_shard2_replica_n3] o.a.s.c.SolrCore [testCollection2_shard2_replica_n3]  CLOSING SolrCore org.apache.solr.core.SolrCore@7a5b5763
   [junit4]   2> 36641 INFO  (coreCloseExecutor-154-thread-1) [n:127.0.0.1:37620_solr c:testCollection1 s:shard1 r:core_node3 x:testCollection1_shard1_replica_n1] o.a.s.m.SolrMetricManager Closing metric reporters for registry=solr.collection.testCollection1.shard1.leader, tag=606057706
   [junit4]   2> 36641 INFO  (coreCloseExecutor-154-thread-3) [n:127.0.0.1:37620_solr c:testCollection2 s:shard1 r:core_node2 x:testCollection2_shard1_replica_n1] o.a.s.m.SolrMetricManager Closing metric reporters for registry=solr.core.testCollection2.shard1.replica_n1, tag=916392754
   [junit4]   2> 36641 INFO  (coreCloseExecutor-154-thread-3) [n:127.0.0.1:37620_solr c:testCollection2 s:shard1 r:core_node2 x:testCollection2_shard1_replica_n1] o.a.s.m.r.SolrJmxReporter Closing reporter [org.apache.solr.metrics.reporters.SolrJmxReporter@36152940: rootName = solr_37620, domain = solr.core.testCollection2.shard1.replica_n1, service url = null, agent id = null] for registry solr.core.testCollection2.shard1.replica_n1 / com.codahale.metrics.MetricRegistry@22e6c66b
   [junit4]   2> 36647 INFO  (coreCloseExecutor-154-thread-3) [n:127.0.0.1:37620_solr c:testCollection2 s:shard1 r:core_node2 x:testCollection2_shard1_replica_n1] o.a.s.m.SolrMetricManager Closing metric reporters for registry=solr.collection.testCollection2.shard1.leader, tag=916392754
   [junit4]   2> 36647 INFO  (coreCloseExecutor-154-thread-2) [n:127.0.0.1:37620_solr c:testCollection2 s:shard2 r:core_node4 x:testCollection2_shard2_replica_n3] o.a.s.m.SolrMetricManager Closing metric reporters for registry=solr.core.testCollection2.shard2.replica_n3, tag=2052806499
   [junit4]   2> 36648 INFO  (coreCloseExecutor-154-thread-2) [n:127.0.0.1:37620_solr c:testCollection2 s:shard2 r:core_node4 x:testCollection2_shard2_replica_n3] o.a.s.m.r.SolrJmxReporter Closing reporter [org.apache.solr.metrics.reporters.SolrJmxReporter@1cfcec8f: rootName = solr_37620, domain = solr.core.testCollection2.shard2.replica_n3, service url = null, agent id = null] for registry solr.core.testCollection2.shard2.replica_n3 / com.codahale.metrics.MetricRegistry@18158f31
   [junit4]   2> 36653 INFO  (coreCloseExecutor-154-thread-2) [n:127.0.0.1:37620_solr c:testCollection2 s:shard2 r:core_node4 x:testCollection2_shard2_replica_n3] o.a.s.m.SolrMetricManager Closing metric reporters for registry=solr.collection.testCollection2.shard2.leader, tag=2052806499
   [junit4]   2> 36662 INFO  (jetty-closer-51-thread-1) [    ] o.a.s.c.Overseer Overseer (id=98674671688613891-127.0.0.1:37620_solr-n_0000000000) closing
   [junit4]   2> 36662 INFO  (OverseerStateUpdate-98674671688613891-127.0.0.1:37620_solr-n_0000000000) [n:127.0.0.1:37620_solr    ] o.a.s.c.Overseer Overseer Loop exiting : 127.0.0.1:37620_solr
   [junit4]   2> 36667 WARN  (zkCallback-57-thread-2-processing-n:127.0.0.1:37620_solr) [n:127.0.0.1:37620_solr    ] o.a.s.c.c.ZkStateReader ZooKeeper watch triggered, but Solr cannot talk to ZK: [KeeperErrorCode = Session expired for /live_nodes]
   [junit4]   2> 36670 INFO  (jetty-closer-51-thread-1) [    ] o.e.j.s.h.ContextHandler Stopped o.e.j.s.ServletContextHandler@341e22d{/solr,null,UNAVAILABLE}
   [junit4]   2> 36673 ERROR (SUITE-LeaderElectionContextKeyTest-seed#[A7DA4FE630E5C51F]-worker) [    ] o.a.z.s.ZooKeeperServer ZKShutdownHandler is not registered, so ZooKeeper server won't take any action on ERROR or SHUTDOWN server state changes
   [junit4]   2> 36674 INFO  (SUITE-LeaderElectionContextKeyTest-seed#[A7DA4FE630E5C51F]-worker) [    ] o.a.s.c.ZkTestServer connecting to 127.0.0.1:60948 60948
   [junit4]   2> 36730 WARN  (NIOServerCxn.Factory:0.0.0.0/0.0.0.0:0) [    ] o.a.z.s.NIOServerCnxnFactory Ignoring unexpected runtime exception
   [junit4]   2> java.nio.channels.CancelledKeyException
   [junit4]   2> 	at sun.nio.ch.SelectionKeyImpl.ensureValid(SelectionKeyImpl.java:73)
   [junit4]   2> 	at sun.nio.ch.SelectionKeyImpl.readyOps(SelectionKeyImpl.java:87)
   [junit4]   2> 	at org.apache.zookeeper.server.NIOServerCnxnFactory.run(NIOServerCnxnFactory.java:182)
   [junit4]   2> 	at java.lang.Thread.run(Thread.java:748)
   [junit4]   2> 36730 INFO  (Thread-54) [    ] o.a.s.c.ZkTestServer connecting to 127.0.0.1:60948 60948
   [junit4]   2> 36732 WARN  (Thread-54) [    ] o.a.s.c.ZkTestServer Watch limit violations: 
   [junit4]   2> Maximum concurrent create/delete watches above limit:
   [junit4]   2> 
   [junit4]   2> 	2	/solr/aliases.json
   [junit4]   2> 	2	/solr/clusterprops.json
   [junit4]   2> 
   [junit4]   2> Maximum concurrent data watches above limit:
   [junit4]   2> 
   [junit4]   2> 	5	/solr/collections/testCollection2/state.json
   [junit4]   2> 	5	/solr/collections/testCollection1/state.json
   [junit4]   2> 	2	/solr/clusterstate.json
   [junit4]   2> 
   [junit4]   2> Maximum concurrent children watches above limit:
   [junit4]   2> 
   [junit4]   2> 	2	/solr/live_nodes
   [junit4]   2> 	2	/solr/collections
   [junit4]   2> 
   [junit4]   2> NOTE: leaving temporary files on disk at: /export/home/jenkins/workspace/Lucene-Solr-7.x-Solaris/solr/build/solr-core/test/J0/temp/solr.cloud.LeaderElectionContextKeyTest_A7DA4FE630E5C51F-001
   [junit4]   2> Sep 17, 2017 1:46:47 PM com.carrotsearch.randomizedtesting.ThreadLeakControl checkThreadLeaks
   [junit4]   2> WARNING: Will linger awaiting termination of 2 leaked thread(s).
   [junit4]   2> NOTE: test params are: codec=Asserting(Lucene70): {}, docValues:{}, maxPointsInLeafNode=410, maxMBSortInHeap=7.6932161747195575, sim=RandomSimilarity(queryNorm=false): {}, locale=id-ID, timezone=America/Atikokan
   [junit4]   2> NOTE: SunOS 5.11 amd64/Oracle Corporation 1.8.0_141 (64-bit)/cpus=3,threads=1,free=186010320,total=310378496
   [junit4]   2> NOTE: All tests run in this JVM: [SimplePostToolTest, TestReplicaProperties, LeaderElectionContextKeyTest]
   [junit4] Completed [9/731 (1!)] on J0 in 7.00s, 1 test, 1 failure <<< FAILURES!

[...truncated 48675 lines...]