You are viewing a plain text version of this content. The canonical link for it is here.
Posted to dev@kafka.apache.org by Apache Jenkins Server <je...@builds.apache.org> on 2019/04/04 21:35:46 UTC
Build failed in Jenkins: kafka-trunk-jdk8 #3512
See <https://builds.apache.org/job/kafka-trunk-jdk8/3512/display/redirect?page=changes>
Changes:
[manikumar] KAFKA-8090: Use automatic RPC generation in ControlledShutdown
------------------------------------------
[...truncated 2.36 MB...]
org.apache.kafka.connect.data.DateTest > testToLogicalInvalidSchema PASSED
org.apache.kafka.connect.util.ConnectorUtilsTest > testGroupPartitions STARTED
org.apache.kafka.connect.util.ConnectorUtilsTest > testGroupPartitions PASSED
org.apache.kafka.connect.util.ConnectorUtilsTest > testGroupPartitionsInvalidCount STARTED
org.apache.kafka.connect.util.ConnectorUtilsTest > testGroupPartitionsInvalidCount PASSED
org.apache.kafka.connect.header.ConnectHeaderTest > shouldGetSchemaFromStruct STARTED
org.apache.kafka.connect.header.ConnectHeaderTest > shouldGetSchemaFromStruct PASSED
org.apache.kafka.connect.header.ConnectHeaderTest > shouldAllowNonNullValue STARTED
org.apache.kafka.connect.header.ConnectHeaderTest > shouldAllowNonNullValue PASSED
org.apache.kafka.connect.header.ConnectHeaderTest > shouldSatisfyEquals STARTED
org.apache.kafka.connect.header.ConnectHeaderTest > shouldSatisfyEquals PASSED
org.apache.kafka.connect.header.ConnectHeaderTest > shouldAllowNullSchema STARTED
org.apache.kafka.connect.header.ConnectHeaderTest > shouldAllowNullSchema PASSED
org.apache.kafka.connect.header.ConnectHeaderTest > shouldAllowNullValues STARTED
org.apache.kafka.connect.header.ConnectHeaderTest > shouldAllowNullValues PASSED
org.apache.kafka.connect.header.ConnectHeadersTest > shouldNotAllowNullKey STARTED
org.apache.kafka.connect.header.ConnectHeadersTest > shouldNotAllowNullKey PASSED
org.apache.kafka.connect.header.ConnectHeadersTest > shouldValidateLogicalTypes STARTED
org.apache.kafka.connect.header.ConnectHeadersTest > shouldValidateLogicalTypes PASSED
org.apache.kafka.connect.header.ConnectHeadersTest > shouldHaveToString STARTED
org.apache.kafka.connect.header.ConnectHeadersTest > shouldHaveToString PASSED
org.apache.kafka.connect.header.ConnectHeadersTest > shouldTransformHeadersWithKey STARTED
org.apache.kafka.connect.header.ConnectHeadersTest > shouldTransformHeadersWithKey PASSED
org.apache.kafka.connect.header.ConnectHeadersTest > shouldAddDate STARTED
org.apache.kafka.connect.header.ConnectHeadersTest > shouldAddDate PASSED
org.apache.kafka.connect.header.ConnectHeadersTest > shouldAddTime STARTED
org.apache.kafka.connect.header.ConnectHeadersTest > shouldAddTime PASSED
org.apache.kafka.connect.header.ConnectHeadersTest > shouldNotAddHeadersWithObjectValuesAndMismatchedSchema STARTED
org.apache.kafka.connect.header.ConnectHeadersTest > shouldNotAddHeadersWithObjectValuesAndMismatchedSchema PASSED
org.apache.kafka.connect.header.ConnectHeadersTest > shouldNotValidateMismatchedValuesWithBuiltInTypes STARTED
org.apache.kafka.connect.header.ConnectHeadersTest > shouldNotValidateMismatchedValuesWithBuiltInTypes PASSED
org.apache.kafka.connect.header.ConnectHeadersTest > shouldRemoveAllHeadersWithSameKey STARTED
org.apache.kafka.connect.header.ConnectHeadersTest > shouldRemoveAllHeadersWithSameKey PASSED
org.apache.kafka.connect.header.ConnectHeadersTest > shouldTransformAndRemoveHeaders STARTED
org.apache.kafka.connect.header.ConnectHeadersTest > shouldTransformAndRemoveHeaders PASSED
org.apache.kafka.connect.header.ConnectHeadersTest > shouldBeEquals STARTED
org.apache.kafka.connect.header.ConnectHeadersTest > shouldBeEquals PASSED
org.apache.kafka.connect.header.ConnectHeadersTest > shouldValidateBuildInTypes STARTED
org.apache.kafka.connect.header.ConnectHeadersTest > shouldValidateBuildInTypes PASSED
org.apache.kafka.connect.header.ConnectHeadersTest > shouldRemoveAllHeaders STARTED
org.apache.kafka.connect.header.ConnectHeadersTest > shouldRemoveAllHeaders PASSED
org.apache.kafka.connect.header.ConnectHeadersTest > shouldNotValidateNullValuesWithBuiltInTypes STARTED
org.apache.kafka.connect.header.ConnectHeadersTest > shouldNotValidateNullValuesWithBuiltInTypes PASSED
org.apache.kafka.connect.header.ConnectHeadersTest > shouldTransformHeaders STARTED
org.apache.kafka.connect.header.ConnectHeadersTest > shouldTransformHeaders PASSED
org.apache.kafka.connect.header.ConnectHeadersTest > shouldAddMultipleHeadersWithSameKeyAndRetainLatest STARTED
org.apache.kafka.connect.header.ConnectHeadersTest > shouldAddMultipleHeadersWithSameKeyAndRetainLatest PASSED
org.apache.kafka.connect.header.ConnectHeadersTest > shouldAddHeadersWithPrimitiveValues STARTED
org.apache.kafka.connect.header.ConnectHeadersTest > shouldAddHeadersWithPrimitiveValues PASSED
org.apache.kafka.connect.header.ConnectHeadersTest > shouldNotAddHeadersWithNullObjectValuesWithNonOptionalSchema STARTED
org.apache.kafka.connect.header.ConnectHeadersTest > shouldNotAddHeadersWithNullObjectValuesWithNonOptionalSchema PASSED
org.apache.kafka.connect.header.ConnectHeadersTest > shouldDuplicateAndAlwaysReturnEquivalentButDifferentObject STARTED
org.apache.kafka.connect.header.ConnectHeadersTest > shouldDuplicateAndAlwaysReturnEquivalentButDifferentObject PASSED
org.apache.kafka.connect.header.ConnectHeadersTest > shouldAddTimestamp STARTED
org.apache.kafka.connect.header.ConnectHeadersTest > shouldAddTimestamp PASSED
org.apache.kafka.connect.header.ConnectHeadersTest > shouldAddDecimal STARTED
org.apache.kafka.connect.header.ConnectHeadersTest > shouldAddDecimal PASSED
org.apache.kafka.connect.header.ConnectHeadersTest > shouldAddHeadersWithNullObjectValuesWithOptionalSchema STARTED
org.apache.kafka.connect.header.ConnectHeadersTest > shouldAddHeadersWithNullObjectValuesWithOptionalSchema PASSED
org.apache.kafka.connect.connector.ConnectorReconfigurationTest > testReconfigureStopException STARTED
org.apache.kafka.connect.connector.ConnectorReconfigurationTest > testReconfigureStopException PASSED
org.apache.kafka.connect.connector.ConnectorReconfigurationTest > testDefaultReconfigure STARTED
org.apache.kafka.connect.connector.ConnectorReconfigurationTest > testDefaultReconfigure PASSED
org.apache.kafka.connect.source.SourceRecordTest > shouldDuplicateRecordAndCloneHeaders STARTED
org.apache.kafka.connect.source.SourceRecordTest > shouldDuplicateRecordAndCloneHeaders PASSED
org.apache.kafka.connect.source.SourceRecordTest > shouldDuplicateRecordUsingNewHeaders STARTED
org.apache.kafka.connect.source.SourceRecordTest > shouldDuplicateRecordUsingNewHeaders PASSED
org.apache.kafka.connect.source.SourceRecordTest > shouldModifyRecordHeader STARTED
org.apache.kafka.connect.source.SourceRecordTest > shouldModifyRecordHeader PASSED
org.apache.kafka.connect.source.SourceRecordTest > shouldCreateSinkRecordWithHeaders STARTED
org.apache.kafka.connect.source.SourceRecordTest > shouldCreateSinkRecordWithHeaders PASSED
org.apache.kafka.connect.source.SourceRecordTest > shouldCreateSinkRecordWithEmtpyHeaders STARTED
org.apache.kafka.connect.source.SourceRecordTest > shouldCreateSinkRecordWithEmtpyHeaders PASSED
org.apache.kafka.connect.sink.SinkRecordTest > shouldDuplicateRecordAndCloneHeaders STARTED
org.apache.kafka.connect.sink.SinkRecordTest > shouldDuplicateRecordAndCloneHeaders PASSED
org.apache.kafka.connect.sink.SinkRecordTest > shouldCreateSinkRecordWithEmptyHeaders STARTED
org.apache.kafka.connect.sink.SinkRecordTest > shouldCreateSinkRecordWithEmptyHeaders PASSED
org.apache.kafka.connect.sink.SinkRecordTest > shouldDuplicateRecordUsingNewHeaders STARTED
org.apache.kafka.connect.sink.SinkRecordTest > shouldDuplicateRecordUsingNewHeaders PASSED
org.apache.kafka.connect.sink.SinkRecordTest > shouldModifyRecordHeader STARTED
org.apache.kafka.connect.sink.SinkRecordTest > shouldModifyRecordHeader PASSED
org.apache.kafka.connect.sink.SinkRecordTest > shouldCreateSinkRecordWithHeaders STARTED
org.apache.kafka.connect.sink.SinkRecordTest > shouldCreateSinkRecordWithHeaders PASSED
> Task :connect:basic-auth-extension:test
org.apache.kafka.connect.rest.basic.auth.extension.JaasBasicAuthFilterTest > testSuccess STARTED
org.apache.kafka.connect.rest.basic.auth.extension.JaasBasicAuthFilterTest > testSuccess PASSED
org.apache.kafka.connect.rest.basic.auth.extension.JaasBasicAuthFilterTest > testBadCredential STARTED
org.apache.kafka.connect.rest.basic.auth.extension.JaasBasicAuthFilterTest > testBadCredential PASSED
org.apache.kafka.connect.rest.basic.auth.extension.JaasBasicAuthFilterTest > testBadPassword STARTED
org.apache.kafka.connect.rest.basic.auth.extension.JaasBasicAuthFilterTest > testBadPassword PASSED
org.apache.kafka.connect.rest.basic.auth.extension.JaasBasicAuthFilterTest > testUnknownBearer STARTED
org.apache.kafka.connect.rest.basic.auth.extension.JaasBasicAuthFilterTest > testUnknownBearer PASSED
org.apache.kafka.connect.rest.basic.auth.extension.JaasBasicAuthFilterTest > testUnknownLoginModule STARTED
org.apache.kafka.connect.rest.basic.auth.extension.JaasBasicAuthFilterTest > testUnknownLoginModule PASSED
org.apache.kafka.connect.rest.basic.auth.extension.JaasBasicAuthFilterTest > testUnknownCredentialsFile STARTED
org.apache.kafka.connect.rest.basic.auth.extension.JaasBasicAuthFilterTest > testUnknownCredentialsFile PASSED
org.apache.kafka.connect.rest.basic.auth.extension.JaasBasicAuthFilterTest > testEmptyCredentialsFile STARTED
org.apache.kafka.connect.rest.basic.auth.extension.JaasBasicAuthFilterTest > testEmptyCredentialsFile PASSED
org.apache.kafka.connect.rest.basic.auth.extension.JaasBasicAuthFilterTest > testNoFileOption STARTED
org.apache.kafka.connect.rest.basic.auth.extension.JaasBasicAuthFilterTest > testNoFileOption PASSED
FAILURE: Build failed with an exception.
* What went wrong:
Execution failed for task ':core:test'.
> There were failing tests. See the report at: file://<https://builds.apache.org/job/kafka-trunk-jdk8/ws/core/build/reports/tests/test/index.html>
* Try:
Run with --stacktrace option to get the stack trace. Run with --info or --debug option to get more log output. Run with --scan to get full insights.
* Get more help at https://help.gradle.org
Deprecated Gradle features were used in this build, making it incompatible with Gradle 6.0.
Use '--warning-mode all' to show the individual deprecation warnings.
See https://docs.gradle.org/5.1.1/userguide/command_line_interface.html#sec:command_line_warnings
BUILD FAILED in 2h 31m 33s
173 actionable tasks: 172 executed, 1 up-to-date
Build step 'Execute shell' marked build as failure
[FINDBUGS] Collecting findbugs analysis files...
Setting GRADLE_4_8_1_HOME=/home/jenkins/tools/gradle/4.8.1
[FINDBUGS] Searching for all files in <https://builds.apache.org/job/kafka-trunk-jdk8/ws/> that match the pattern **/build/reports/*bugs/*.xml
[FINDBUGS] Parsing 17 files in <https://builds.apache.org/job/kafka-trunk-jdk8/ws/>
[FINDBUGS] Successfully parsed file <https://builds.apache.org/job/kafka-trunk-jdk8/ws/clients/build/reports/spotbugs/main.xml> with 0 unique warnings and 0 duplicates.
[FINDBUGS] Successfully parsed file <https://builds.apache.org/job/kafka-trunk-jdk8/ws/connect/api/build/reports/spotbugs/main.xml> with 0 unique warnings and 0 duplicates.
[FINDBUGS] Successfully parsed file <https://builds.apache.org/job/kafka-trunk-jdk8/ws/connect/basic-auth-extension/build/reports/spotbugs/main.xml> with 0 unique warnings and 0 duplicates.
[FINDBUGS] Successfully parsed file <https://builds.apache.org/job/kafka-trunk-jdk8/ws/connect/file/build/reports/spotbugs/main.xml> with 0 unique warnings and 0 duplicates.
[FINDBUGS] Successfully parsed file <https://builds.apache.org/job/kafka-trunk-jdk8/ws/connect/json/build/reports/spotbugs/main.xml> with 0 unique warnings and 0 duplicates.
[FINDBUGS] Successfully parsed file <https://builds.apache.org/job/kafka-trunk-jdk8/ws/connect/runtime/build/reports/spotbugs/main.xml> with 0 unique warnings and 0 duplicates.
[FINDBUGS] Successfully parsed file <https://builds.apache.org/job/kafka-trunk-jdk8/ws/connect/transforms/build/reports/spotbugs/main.xml> with 0 unique warnings and 0 duplicates.
[FINDBUGS] Successfully parsed file <https://builds.apache.org/job/kafka-trunk-jdk8/ws/core/build/reports/spotbugs/main.xml> with 0 unique warnings and 0 duplicates.
[FINDBUGS] Successfully parsed file <https://builds.apache.org/job/kafka-trunk-jdk8/ws/examples/build/reports/spotbugs/main.xml> with 0 unique warnings and 0 duplicates.
[FINDBUGS] Successfully parsed file <https://builds.apache.org/job/kafka-trunk-jdk8/ws/generator/build/reports/spotbugs/main.xml> with 0 unique warnings and 0 duplicates.
[FINDBUGS] Successfully parsed file <https://builds.apache.org/job/kafka-trunk-jdk8/ws/jmh-benchmarks/build/reports/spotbugs/main.xml> with 0 unique warnings and 0 duplicates.
[FINDBUGS] Successfully parsed file <https://builds.apache.org/job/kafka-trunk-jdk8/ws/log4j-appender/build/reports/spotbugs/main.xml> with 0 unique warnings and 0 duplicates.
[FINDBUGS] Successfully parsed file <https://builds.apache.org/job/kafka-trunk-jdk8/ws/streams/build/reports/spotbugs/main.xml> with 0 unique warnings and 0 duplicates.
[FINDBUGS] Successfully parsed file <https://builds.apache.org/job/kafka-trunk-jdk8/ws/streams/examples/build/reports/spotbugs/main.xml> with 0 unique warnings and 0 duplicates.
[FINDBUGS] Successfully parsed file <https://builds.apache.org/job/kafka-trunk-jdk8/ws/streams/streams-scala/build/reports/spotbugs/main.xml> with 0 unique warnings and 0 duplicates.
[FINDBUGS] Successfully parsed file <https://builds.apache.org/job/kafka-trunk-jdk8/ws/streams/test-utils/build/reports/spotbugs/main.xml> with 0 unique warnings and 0 duplicates.
[FINDBUGS] Successfully parsed file <https://builds.apache.org/job/kafka-trunk-jdk8/ws/tools/build/reports/spotbugs/main.xml> with 0 unique warnings and 0 duplicates.
Setting GRADLE_4_8_1_HOME=/home/jenkins/tools/gradle/4.8.1
No credentials specified
Setting GRADLE_4_8_1_HOME=/home/jenkins/tools/gradle/4.8.1
<Git Blamer> Using GitBlamer to create author and commit information for all warnings.
<Git Blamer> GIT_COMMIT=c3010254843dcdf0bd68602f752f690cd76d9813, workspace=<https://builds.apache.org/job/kafka-trunk-jdk8/ws/>
[FINDBUGS] Computing warning deltas based on reference build #3511
Recording test results
Setting GRADLE_4_8_1_HOME=/home/jenkins/tools/gradle/4.8.1
Setting GRADLE_4_8_1_HOME=/home/jenkins/tools/gradle/4.8.1
Jenkins build is back to normal : kafka-trunk-jdk8 #3514
Posted by Apache Jenkins Server <je...@builds.apache.org>.
See <https://builds.apache.org/job/kafka-trunk-jdk8/3514/display/redirect?page=changes>
Build failed in Jenkins: kafka-trunk-jdk8 #3513
Posted by Apache Jenkins Server <je...@builds.apache.org>.
See <https://builds.apache.org/job/kafka-trunk-jdk8/3513/display/redirect?page=changes>
Changes:
[cshapi] MINOR: fix throttling and status in ConnectionStressWorker
------------------------------------------
[...truncated 2.35 MB...]
org.apache.kafka.connect.runtime.ConnectMetricsTest > testRecreateWithoutClose STARTED
org.apache.kafka.connect.runtime.ConnectMetricsTest > testRecreateWithoutClose PASSED
org.apache.kafka.connect.runtime.ConnectMetricsTest > testGettingGroupWithTags STARTED
org.apache.kafka.connect.runtime.ConnectMetricsTest > testGettingGroupWithTags PASSED
org.apache.kafka.connect.runtime.ConnectMetricsTest > testRecreateWithClose STARTED
org.apache.kafka.connect.runtime.ConnectMetricsTest > testRecreateWithClose PASSED
org.apache.kafka.connect.runtime.ConnectMetricsTest > testKafkaMetricsNotNull STARTED
org.apache.kafka.connect.runtime.ConnectMetricsTest > testKafkaMetricsNotNull PASSED
org.apache.kafka.connect.converters.ShortConverterTest > testBytesNullToNumber STARTED
org.apache.kafka.connect.converters.ShortConverterTest > testBytesNullToNumber PASSED
org.apache.kafka.connect.converters.ShortConverterTest > testSerializingIncorrectType STARTED
org.apache.kafka.connect.converters.ShortConverterTest > testSerializingIncorrectType PASSED
org.apache.kafka.connect.converters.ShortConverterTest > testDeserializingHeaderWithTooManyBytes STARTED
org.apache.kafka.connect.converters.ShortConverterTest > testDeserializingHeaderWithTooManyBytes PASSED
org.apache.kafka.connect.converters.ShortConverterTest > testNullToBytes STARTED
org.apache.kafka.connect.converters.ShortConverterTest > testNullToBytes PASSED
org.apache.kafka.connect.converters.ShortConverterTest > testSerializingIncorrectHeader STARTED
org.apache.kafka.connect.converters.ShortConverterTest > testSerializingIncorrectHeader PASSED
org.apache.kafka.connect.converters.ShortConverterTest > testDeserializingDataWithTooManyBytes STARTED
org.apache.kafka.connect.converters.ShortConverterTest > testDeserializingDataWithTooManyBytes PASSED
org.apache.kafka.connect.converters.ShortConverterTest > testConvertingSamplesToAndFromBytes STARTED
org.apache.kafka.connect.converters.ShortConverterTest > testConvertingSamplesToAndFromBytes PASSED
org.apache.kafka.connect.converters.FloatConverterTest > testBytesNullToNumber STARTED
org.apache.kafka.connect.converters.FloatConverterTest > testBytesNullToNumber PASSED
org.apache.kafka.connect.converters.FloatConverterTest > testSerializingIncorrectType STARTED
org.apache.kafka.connect.converters.FloatConverterTest > testSerializingIncorrectType PASSED
org.apache.kafka.connect.converters.FloatConverterTest > testDeserializingHeaderWithTooManyBytes STARTED
org.apache.kafka.connect.converters.FloatConverterTest > testDeserializingHeaderWithTooManyBytes PASSED
org.apache.kafka.connect.converters.FloatConverterTest > testNullToBytes STARTED
org.apache.kafka.connect.converters.FloatConverterTest > testNullToBytes PASSED
org.apache.kafka.connect.converters.FloatConverterTest > testSerializingIncorrectHeader STARTED
org.apache.kafka.connect.converters.FloatConverterTest > testSerializingIncorrectHeader PASSED
org.apache.kafka.connect.converters.FloatConverterTest > testDeserializingDataWithTooManyBytes STARTED
org.apache.kafka.connect.converters.FloatConverterTest > testDeserializingDataWithTooManyBytes PASSED
org.apache.kafka.connect.converters.FloatConverterTest > testConvertingSamplesToAndFromBytes STARTED
org.apache.kafka.connect.converters.FloatConverterTest > testConvertingSamplesToAndFromBytes PASSED
org.apache.kafka.connect.converters.ByteArrayConverterTest > testFromConnectSchemaless STARTED
org.apache.kafka.connect.converters.ByteArrayConverterTest > testFromConnectSchemaless PASSED
org.apache.kafka.connect.converters.ByteArrayConverterTest > testToConnectNull STARTED
org.apache.kafka.connect.converters.ByteArrayConverterTest > testToConnectNull PASSED
org.apache.kafka.connect.converters.ByteArrayConverterTest > testFromConnectBadSchema STARTED
org.apache.kafka.connect.converters.ByteArrayConverterTest > testFromConnectBadSchema PASSED
org.apache.kafka.connect.converters.ByteArrayConverterTest > testFromConnectNull STARTED
org.apache.kafka.connect.converters.ByteArrayConverterTest > testFromConnectNull PASSED
org.apache.kafka.connect.converters.ByteArrayConverterTest > testToConnect STARTED
org.apache.kafka.connect.converters.ByteArrayConverterTest > testToConnect PASSED
org.apache.kafka.connect.converters.ByteArrayConverterTest > testFromConnect STARTED
org.apache.kafka.connect.converters.ByteArrayConverterTest > testFromConnect PASSED
org.apache.kafka.connect.converters.ByteArrayConverterTest > testFromConnectInvalidValue STARTED
org.apache.kafka.connect.converters.ByteArrayConverterTest > testFromConnectInvalidValue PASSED
org.apache.kafka.connect.converters.LongConverterTest > testBytesNullToNumber STARTED
org.apache.kafka.connect.converters.LongConverterTest > testBytesNullToNumber PASSED
org.apache.kafka.connect.converters.LongConverterTest > testSerializingIncorrectType STARTED
org.apache.kafka.connect.converters.LongConverterTest > testSerializingIncorrectType PASSED
org.apache.kafka.connect.converters.LongConverterTest > testDeserializingHeaderWithTooManyBytes STARTED
org.apache.kafka.connect.converters.LongConverterTest > testDeserializingHeaderWithTooManyBytes PASSED
org.apache.kafka.connect.converters.LongConverterTest > testNullToBytes STARTED
org.apache.kafka.connect.converters.LongConverterTest > testNullToBytes PASSED
org.apache.kafka.connect.converters.LongConverterTest > testSerializingIncorrectHeader STARTED
org.apache.kafka.connect.converters.LongConverterTest > testSerializingIncorrectHeader PASSED
org.apache.kafka.connect.converters.LongConverterTest > testDeserializingDataWithTooManyBytes STARTED
org.apache.kafka.connect.converters.LongConverterTest > testDeserializingDataWithTooManyBytes PASSED
org.apache.kafka.connect.converters.LongConverterTest > testConvertingSamplesToAndFromBytes STARTED
org.apache.kafka.connect.converters.LongConverterTest > testConvertingSamplesToAndFromBytes PASSED
org.apache.kafka.connect.converters.IntegerConverterTest > testBytesNullToNumber STARTED
org.apache.kafka.connect.converters.IntegerConverterTest > testBytesNullToNumber PASSED
org.apache.kafka.connect.converters.IntegerConverterTest > testSerializingIncorrectType STARTED
org.apache.kafka.connect.converters.IntegerConverterTest > testSerializingIncorrectType PASSED
org.apache.kafka.connect.converters.IntegerConverterTest > testDeserializingHeaderWithTooManyBytes STARTED
org.apache.kafka.connect.converters.IntegerConverterTest > testDeserializingHeaderWithTooManyBytes PASSED
org.apache.kafka.connect.converters.IntegerConverterTest > testNullToBytes STARTED
org.apache.kafka.connect.converters.IntegerConverterTest > testNullToBytes PASSED
org.apache.kafka.connect.converters.IntegerConverterTest > testSerializingIncorrectHeader STARTED
org.apache.kafka.connect.converters.IntegerConverterTest > testSerializingIncorrectHeader PASSED
org.apache.kafka.connect.converters.IntegerConverterTest > testDeserializingDataWithTooManyBytes STARTED
org.apache.kafka.connect.converters.IntegerConverterTest > testDeserializingDataWithTooManyBytes PASSED
org.apache.kafka.connect.converters.IntegerConverterTest > testConvertingSamplesToAndFromBytes STARTED
org.apache.kafka.connect.converters.IntegerConverterTest > testConvertingSamplesToAndFromBytes PASSED
org.apache.kafka.connect.converters.DoubleConverterTest > testBytesNullToNumber STARTED
org.apache.kafka.connect.converters.DoubleConverterTest > testBytesNullToNumber PASSED
org.apache.kafka.connect.converters.DoubleConverterTest > testSerializingIncorrectType STARTED
org.apache.kafka.connect.converters.DoubleConverterTest > testSerializingIncorrectType PASSED
org.apache.kafka.connect.converters.DoubleConverterTest > testDeserializingHeaderWithTooManyBytes STARTED
org.apache.kafka.connect.converters.DoubleConverterTest > testDeserializingHeaderWithTooManyBytes PASSED
org.apache.kafka.connect.converters.DoubleConverterTest > testNullToBytes STARTED
org.apache.kafka.connect.converters.DoubleConverterTest > testNullToBytes PASSED
org.apache.kafka.connect.converters.DoubleConverterTest > testSerializingIncorrectHeader STARTED
org.apache.kafka.connect.converters.DoubleConverterTest > testSerializingIncorrectHeader PASSED
org.apache.kafka.connect.converters.DoubleConverterTest > testDeserializingDataWithTooManyBytes STARTED
org.apache.kafka.connect.converters.DoubleConverterTest > testDeserializingDataWithTooManyBytes PASSED
org.apache.kafka.connect.converters.DoubleConverterTest > testConvertingSamplesToAndFromBytes STARTED
org.apache.kafka.connect.converters.DoubleConverterTest > testConvertingSamplesToAndFromBytes PASSED
org.apache.kafka.connect.integration.ExampleConnectIntegrationTest > testSourceConnector STARTED
org.apache.kafka.connect.integration.ExampleConnectIntegrationTest > testSourceConnector PASSED
org.apache.kafka.connect.integration.ExampleConnectIntegrationTest > testSinkConnector STARTED
org.apache.kafka.connect.integration.ExampleConnectIntegrationTest > testSinkConnector PASSED
org.apache.kafka.connect.integration.ErrorHandlingIntegrationTest > testSkipRetryAndDLQWithHeaders STARTED
org.apache.kafka.connect.integration.ErrorHandlingIntegrationTest > testSkipRetryAndDLQWithHeaders PASSED
org.apache.kafka.connect.integration.ConnectWorkerIntegrationTest > testAddAndRemoveWorker STARTED
org.apache.kafka.connect.integration.ConnectWorkerIntegrationTest > testAddAndRemoveWorker PASSED
FAILURE: Build failed with an exception.
* What went wrong:
Execution failed for task ':tools:test'.
> There were failing tests. See the report at: file://<https://builds.apache.org/job/kafka-trunk-jdk8/ws/tools/build/reports/tests/test/index.html>
* Try:
Run with --stacktrace option to get the stack trace. Run with --info or --debug option to get more log output. Run with --scan to get full insights.
* Get more help at https://help.gradle.org
Deprecated Gradle features were used in this build, making it incompatible with Gradle 6.0.
Use '--warning-mode all' to show the individual deprecation warnings.
See https://docs.gradle.org/5.1.1/userguide/command_line_interface.html#sec:command_line_warnings
BUILD FAILED in 1h 56m 33s
173 actionable tasks: 172 executed, 1 up-to-date
Build step 'Execute shell' marked build as failure
[FINDBUGS] Collecting findbugs analysis files...
Setting GRADLE_4_8_1_HOME=/home/jenkins/tools/gradle/4.8.1
[FINDBUGS] Searching for all files in <https://builds.apache.org/job/kafka-trunk-jdk8/ws/> that match the pattern **/build/reports/*bugs/*.xml
[FINDBUGS] Parsing 17 files in <https://builds.apache.org/job/kafka-trunk-jdk8/ws/>
[FINDBUGS] Successfully parsed file <https://builds.apache.org/job/kafka-trunk-jdk8/ws/clients/build/reports/spotbugs/main.xml> with 0 unique warnings and 0 duplicates.
[FINDBUGS] Successfully parsed file <https://builds.apache.org/job/kafka-trunk-jdk8/ws/connect/api/build/reports/spotbugs/main.xml> with 0 unique warnings and 0 duplicates.
[FINDBUGS] Successfully parsed file <https://builds.apache.org/job/kafka-trunk-jdk8/ws/connect/basic-auth-extension/build/reports/spotbugs/main.xml> with 0 unique warnings and 0 duplicates.
[FINDBUGS] Successfully parsed file <https://builds.apache.org/job/kafka-trunk-jdk8/ws/connect/file/build/reports/spotbugs/main.xml> with 0 unique warnings and 0 duplicates.
[FINDBUGS] Successfully parsed file <https://builds.apache.org/job/kafka-trunk-jdk8/ws/connect/json/build/reports/spotbugs/main.xml> with 0 unique warnings and 0 duplicates.
[FINDBUGS] Successfully parsed file <https://builds.apache.org/job/kafka-trunk-jdk8/ws/connect/runtime/build/reports/spotbugs/main.xml> with 0 unique warnings and 0 duplicates.
[FINDBUGS] Successfully parsed file <https://builds.apache.org/job/kafka-trunk-jdk8/ws/connect/transforms/build/reports/spotbugs/main.xml> with 0 unique warnings and 0 duplicates.
[FINDBUGS] Successfully parsed file <https://builds.apache.org/job/kafka-trunk-jdk8/ws/core/build/reports/spotbugs/main.xml> with 0 unique warnings and 0 duplicates.
[FINDBUGS] Successfully parsed file <https://builds.apache.org/job/kafka-trunk-jdk8/ws/examples/build/reports/spotbugs/main.xml> with 0 unique warnings and 0 duplicates.
[FINDBUGS] Successfully parsed file <https://builds.apache.org/job/kafka-trunk-jdk8/ws/generator/build/reports/spotbugs/main.xml> with 0 unique warnings and 0 duplicates.
[FINDBUGS] Successfully parsed file <https://builds.apache.org/job/kafka-trunk-jdk8/ws/jmh-benchmarks/build/reports/spotbugs/main.xml> with 0 unique warnings and 0 duplicates.
[FINDBUGS] Successfully parsed file <https://builds.apache.org/job/kafka-trunk-jdk8/ws/log4j-appender/build/reports/spotbugs/main.xml> with 0 unique warnings and 0 duplicates.
[FINDBUGS] Successfully parsed file <https://builds.apache.org/job/kafka-trunk-jdk8/ws/streams/build/reports/spotbugs/main.xml> with 0 unique warnings and 0 duplicates.
[FINDBUGS] Successfully parsed file <https://builds.apache.org/job/kafka-trunk-jdk8/ws/streams/examples/build/reports/spotbugs/main.xml> with 0 unique warnings and 0 duplicates.
[FINDBUGS] Successfully parsed file <https://builds.apache.org/job/kafka-trunk-jdk8/ws/streams/streams-scala/build/reports/spotbugs/main.xml> with 0 unique warnings and 0 duplicates.
[FINDBUGS] Successfully parsed file <https://builds.apache.org/job/kafka-trunk-jdk8/ws/streams/test-utils/build/reports/spotbugs/main.xml> with 0 unique warnings and 0 duplicates.
[FINDBUGS] Successfully parsed file <https://builds.apache.org/job/kafka-trunk-jdk8/ws/tools/build/reports/spotbugs/main.xml> with 0 unique warnings and 0 duplicates.
Setting GRADLE_4_8_1_HOME=/home/jenkins/tools/gradle/4.8.1
No credentials specified
Setting GRADLE_4_8_1_HOME=/home/jenkins/tools/gradle/4.8.1
<Git Blamer> Using GitBlamer to create author and commit information for all warnings.
<Git Blamer> GIT_COMMIT=a674ded0b34b79e04b4242a3db19c90ae87b6f87, workspace=<https://builds.apache.org/job/kafka-trunk-jdk8/ws/>
[FINDBUGS] Computing warning deltas based on reference build #3511
Recording test results
Setting GRADLE_4_8_1_HOME=/home/jenkins/tools/gradle/4.8.1
Setting GRADLE_4_8_1_HOME=/home/jenkins/tools/gradle/4.8.1
Not sending mail to unregistered user cshapi@gmail.com