You are viewing a plain text version of this content. The canonical link for it is here.
Posted to commits@sling.apache.org by Apache Jenkins Server <je...@builds.apache.org> on 2017/06/01 21:57:15 UTC

Build failed in Jenkins: sling-testing-junit-remote-1.8 #4

See <https://builds.apache.org/job/sling-testing-junit-remote-1.8/4/display/redirect>

------------------------------------------
Started by upstream project "sling-testing-tools-1.7" build number 5
originally caused by:
 Started by an SCM change
[EnvInject] - Loading node environment variables.
Building remotely on qnode2 (ubuntu) in workspace <https://builds.apache.org/job/sling-testing-junit-remote-1.8/ws/>
Checking out a fresh workspace because there's no workspace at <https://builds.apache.org/job/sling-testing-junit-remote-1.8/ws/>
Cleaning local Directory .
Checking out https://svn.apache.org/repos/asf/sling/trunk/testing/junit/remote at revision '2017-06-01T21:56:30.121 +0000'
A         src
A         src/test
A         src/test/java
A         src/test/java/org
A         src/test/java/org/apache
A         src/test/java/org/apache/sling
A         src/test/java/org/apache/sling/junit
A         src/test/java/org/apache/sling/junit/remote
A         src/test/java/org/apache/sling/junit/remote/testrunner
A         src/test/java/org/apache/sling/junit/remote/testrunner/RemoteExecutionExceptionTest.java
A         src/main
A         src/main/java
A         src/main/java/org
A         src/main/java/org/apache
A         src/main/java/org/apache/sling
A         src/main/java/org/apache/sling/junit
A         src/main/java/org/apache/sling/junit/remote
A         src/main/java/org/apache/sling/junit/remote/httpclient
AU        src/main/java/org/apache/sling/junit/remote/httpclient/RemoteTestHttpClient.java
A         src/main/java/org/apache/sling/junit/remote/ide
AU        src/main/java/org/apache/sling/junit/remote/ide/ExecutionResult.java
AU        src/main/java/org/apache/sling/junit/remote/ide/SerializedRenderer.java
AU        src/main/java/org/apache/sling/junit/remote/ide/SlingRemoteExecutionRule.java
A         src/main/java/org/apache/sling/junit/remote/ide/package-info.java
A         src/main/java/org/apache/sling/junit/remote/testrunner
AU        src/main/java/org/apache/sling/junit/remote/testrunner/SlingRemoteTestParameters.java
AU        src/main/java/org/apache/sling/junit/remote/testrunner/SlingTestsCountChecker.java
A         src/main/java/org/apache/sling/junit/remote/testrunner/RemoteExecutionException.java
AU        src/main/java/org/apache/sling/junit/remote/testrunner/SlingRemoteTestRunner.java
A         src/main/java/org/apache/sling/junit/remote/testrunner/package-info.java
AU        src/main/java/org/apache/sling/junit/remote/testrunner/SlingRemoteTest.java
A         src/main/java/org/apache/sling/junit/remote/exported
A         src/main/java/org/apache/sling/junit/remote/exported/package-info.java
AU        src/main/java/org/apache/sling/junit/remote/exported/ExampleRemoteTest.java
AU        pom.xml
 U        .
At revision 1797280

No changes for https://svn.apache.org/repos/asf/sling/trunk/testing/junit/remote since the previous build
Parsing POMs
Established TCP socket on 41139
maven33-agent.jar already up to date
maven33-interceptor.jar already up to date
maven3-interceptor-commons.jar already up to date
[sling-testing-junit-remote-1.8] $ /home/jenkins/tools/java/latest1.8/bin/java -Xmx2g -Xms256m -cp /home/jenkins/jenkins-slave/maven33-agent.jar:/home/jenkins/tools/maven/apache-maven-3.3.9/boot/plexus-classworlds-2.5.2.jar:/home/jenkins/tools/maven/apache-maven-3.3.9/conf/logging jenkins.maven3.agent.Maven33Main /home/jenkins/tools/maven/apache-maven-3.3.9 /home/jenkins/jenkins-slave/slave.jar /home/jenkins/jenkins-slave/maven33-interceptor.jar /home/jenkins/jenkins-slave/maven3-interceptor-commons.jar 41139
<===[JENKINS REMOTING CAPACITY]===>   channel started
Executing Maven:  -B -f <https://builds.apache.org/job/sling-testing-junit-remote-1.8/ws/pom.xml> -Dmaven.repo.local=/home/jenkins/jenkins-slave/maven-repositories/1 -U clean verify
[INFO] Scanning for projects...
[INFO]                                                                         
[INFO] ------------------------------------------------------------------------
[INFO] Building Apache Sling JUnit Remote Tests Runners 1.0.11-SNAPSHOT
[INFO] ------------------------------------------------------------------------
[INFO] Downloading: http://repository.apache.org/snapshots/org/apache/sling/org.apache.sling.junit.core/1.0.24-SNAPSHOT/maven-metadata.xml
[INFO] Downloading: http://repository.apache.org/snapshots/org/apache/sling/org.apache.sling.junit.core/1.0.24-SNAPSHOT/org.apache.sling.junit.core-1.0.24-SNAPSHOT.pom
[WARNING] The POM for org.apache.sling:org.apache.sling.junit.core:jar:1.0.24-SNAPSHOT is missing, no dependency information available
[INFO] Downloading: https://repo.maven.apache.org/maven2/org/slf4j/slf4j-simple/1.5.11/slf4j-simple-1.5.11.pom
[INFO] Downloaded: https://repo.maven.apache.org/maven2/org/slf4j/slf4j-simple/1.5.11/slf4j-simple-1.5.11.pom (2 KB at 4.0 KB/sec)
[INFO] Downloading: http://repository.apache.org/snapshots/org/apache/sling/org.apache.sling.testing.tools/1.0.17-SNAPSHOT/maven-metadata.xml
[INFO] Downloaded: http://repository.apache.org/snapshots/org/apache/sling/org.apache.sling.testing.tools/1.0.17-SNAPSHOT/maven-metadata.xml (1014 B at 1.9 KB/sec)
[INFO] Downloading: http://repository.apache.org/snapshots/org/apache/sling/org.apache.sling.testing.tools/1.0.17-SNAPSHOT/org.apache.sling.testing.tools-1.0.17-20170601.215427-2.pom
[INFO] Downloaded: http://repository.apache.org/snapshots/org/apache/sling/org.apache.sling.testing.tools/1.0.17-SNAPSHOT/org.apache.sling.testing.tools-1.0.17-20170601.215427-2.pom (6 KB at 13.5 KB/sec)
[INFO] Downloading: http://repository.apache.org/snapshots/org/apache/sling/org.apache.sling.jcr.contentparser/1.2.3-SNAPSHOT/maven-metadata.xml
[INFO] Downloaded: http://repository.apache.org/snapshots/org/apache/sling/org.apache.sling.jcr.contentparser/1.2.3-SNAPSHOT/maven-metadata.xml (1014 B at 2.4 KB/sec)
[INFO] Downloading: http://repository.apache.org/snapshots/org/apache/sling/org.apache.sling.jcr.contentparser/1.2.3-SNAPSHOT/org.apache.sling.jcr.contentparser-1.2.3-20170530.084323-3.pom
[INFO] Downloaded: http://repository.apache.org/snapshots/org/apache/sling/org.apache.sling.jcr.contentparser/1.2.3-SNAPSHOT/org.apache.sling.jcr.contentparser-1.2.3-20170530.084323-3.pom (6 KB at 12.0 KB/sec)
[INFO] Downloading: http://repository.apache.org/snapshots/org/apache/sling/org.apache.sling.junit.core/1.0.24-SNAPSHOT/org.apache.sling.junit.core-1.0.24-SNAPSHOT.jar
[INFO] Downloading: http://repository.apache.org/snapshots/org/apache/sling/org.apache.sling.jcr.contentparser/1.2.3-SNAPSHOT/org.apache.sling.jcr.contentparser-1.2.3-20170530.084323-3.jar
[INFO] Downloading: http://repository.apache.org/snapshots/org/apache/sling/org.apache.sling.testing.tools/1.0.17-SNAPSHOT/org.apache.sling.testing.tools-1.0.17-20170601.215427-2.jar
[INFO] Downloaded: http://repository.apache.org/snapshots/org/apache/sling/org.apache.sling.jcr.contentparser/1.2.3-SNAPSHOT/org.apache.sling.jcr.contentparser-1.2.3-20170530.084323-3.jar (34 KB at 65.0 KB/sec)
[INFO] Downloaded: http://repository.apache.org/snapshots/org/apache/sling/org.apache.sling.testing.tools/1.0.17-SNAPSHOT/org.apache.sling.testing.tools-1.0.17-20170601.215427-2.jar (79 KB at 130.1 KB/sec)
[INFO] Downloading: https://repo.maven.apache.org/maven2/org/slf4j/slf4j-simple/1.5.11/slf4j-simple-1.5.11.jar
[INFO] Downloaded: https://repo.maven.apache.org/maven2/org/slf4j/slf4j-simple/1.5.11/slf4j-simple-1.5.11.jar (8 KB at 390.6 KB/sec)
[JENKINS] Archiving disabled
[JENKINS] Archiving disabled
[INFO] ------------------------------------------------------------------------
[INFO] BUILD FAILURE
[INFO] ------------------------------------------------------------------------
[INFO] Total time: 15.335 s
[INFO] Finished at: 2017-06-01T21:57:13+00:00
[INFO] Final Memory: 17M/285M
[INFO] ------------------------------------------------------------------------
Waiting for Jenkins to finish collecting data
[ERROR] Failed to execute goal on project org.apache.sling.junit.remote: Could not resolve dependencies for project org.apache.sling:org.apache.sling.junit.remote:bundle:1.0.11-SNAPSHOT: Could not find artifact org.apache.sling:org.apache.sling.junit.core:jar:1.0.24-SNAPSHOT in Nexus (http://repository.apache.org/snapshots) -> [Help 1]
[ERROR] 
[ERROR] To see the full stack trace of the errors, re-run Maven with the -e switch.
[ERROR] Re-run Maven using the -X switch to enable full debug logging.
[ERROR] 
[ERROR] For more information about the errors and possible solutions, please read the following articles:
[ERROR] [Help 1] http://cwiki.apache.org/confluence/display/MAVEN/DependencyResolutionException
channel stopped
Recording test results

Jenkins build is back to normal : sling-testing-junit-remote-1.8 #5

Posted by Apache Jenkins Server <je...@builds.apache.org>.
See <https://builds.apache.org/job/sling-testing-junit-remote-1.8/5/display/redirect?page=changes>