You are viewing a plain text version of this content. The canonical link for it is here.
Posted to users@cxf.apache.org by Anders Rundgren <an...@gmail.com> on 2019/02/11 10:45:54 UTC
Failed building CXF
Using the 3.3.0 version as well as the master mvn terminates with:
[ERROR] Errors:
[ERROR] JCacheJWTOAuthDataProviderTest.testAddGetDeleteAccessToken:23->AbstractOAuthDataProviderTest.testAddGetDeleteAccessToken:148->AbstractOAuthDataProvide
rTest.validateAccessToken:370 » Jws
[ERROR] JCacheJWTOAuthDataProviderTest.testAddGetDeleteAccessToken2:23->AbstractOAuthDataProviderTest.testAddGetDeleteAccessToken2:199->AbstractOAuthDataProvi
derTest.validateAccessToken:370 » Jws
[ERROR] JCacheJWTOAuthDataProviderTest.testAddGetDeleteAccessTokenWithNullSubject:23->AbstractOAuthDataProviderTest.testAddGetDeleteAccessTokenWithNullSubject
:221->AbstractOAuthDataProviderTest.validateAccessToken:370 » Jws
[ERROR] JCacheJWTOAuthDataProviderTest.testAddGetDeleteMultipleAccessToken:23->AbstractOAuthDataProviderTest.testAddGetDeleteMultipleAccessToken:243->Abstract
OAuthDataProviderTest.validateAccessToken:370 » Jws
[ERROR] JCacheJWTOAuthDataProviderTest.testAddGetDeleteRefreshToken:23->AbstractOAuthDataProviderTest.testAddGetDeleteRefreshToken:274->AbstractOAuthDataProvi
derTest.validateAccessToken:370 » Jws
[INFO]
[ERROR] Tests run: 93, Failures: 0, Errors: 5, Skipped: 2
Anders
Re: Failed building CXF
Posted by Colm O hEigeartaigh <co...@apache.org>.
What versions of Java + Maven are you using?
Colm.
On Mon, Feb 11, 2019 at 10:46 AM Anders Rundgren <
anders.rundgren.net@gmail.com> wrote:
> Using the 3.3.0 version as well as the master mvn terminates with:
>
> [ERROR] Errors:
> [ERROR]
> JCacheJWTOAuthDataProviderTest.testAddGetDeleteAccessToken:23->AbstractOAuthDataProviderTest.testAddGetDeleteAccessToken:148->AbstractOAuthDataProvide
> rTest.validateAccessToken:370 » Jws
> [ERROR]
> JCacheJWTOAuthDataProviderTest.testAddGetDeleteAccessToken2:23->AbstractOAuthDataProviderTest.testAddGetDeleteAccessToken2:199->AbstractOAuthDataProvi
> derTest.validateAccessToken:370 » Jws
> [ERROR]
> JCacheJWTOAuthDataProviderTest.testAddGetDeleteAccessTokenWithNullSubject:23->AbstractOAuthDataProviderTest.testAddGetDeleteAccessTokenWithNullSubject
> :221->AbstractOAuthDataProviderTest.validateAccessToken:370 » Jws
> [ERROR]
> JCacheJWTOAuthDataProviderTest.testAddGetDeleteMultipleAccessToken:23->AbstractOAuthDataProviderTest.testAddGetDeleteMultipleAccessToken:243->Abstract
> OAuthDataProviderTest.validateAccessToken:370 » Jws
> [ERROR]
> JCacheJWTOAuthDataProviderTest.testAddGetDeleteRefreshToken:23->AbstractOAuthDataProviderTest.testAddGetDeleteRefreshToken:274->AbstractOAuthDataProvi
> derTest.validateAccessToken:370 » Jws
> [INFO]
> [ERROR] Tests run: 93, Failures: 0, Errors: 5, Skipped: 2
>
> Anders
>
--
Colm O hEigeartaigh
Talend Community Coder
http://coders.talend.com