You are viewing a plain text version of this content. The canonical link for it is here.
Posted to dev@lucene.apache.org by Apache Jenkins Server <je...@builds.apache.org> on 2011/07/26 15:21:22 UTC

[JENKINS] Lucene-Solr-tests-only-3.x-java7 - Build # 24 - Failure

Build: https://builds.apache.org/job/Lucene-Solr-tests-only-3.x-java7/24/

1 tests failed.
FAILED:  org.apache.lucene.index.TestIndexWriterDelete.testFlushPushedDeletesByCount

Error Message:
delete's were not applied at count=6998

Stack Trace:
junit.framework.AssertionFailedError: delete's were not applied at count=6998
	at org.apache.lucene.util.LuceneTestCase$LuceneTestCaseRunner.runChild(LuceneTestCase.java:1316)
	at org.apache.lucene.util.LuceneTestCase$LuceneTestCaseRunner.runChild(LuceneTestCase.java:1221)
	at org.apache.lucene.index.TestIndexWriterDelete.testFlushPushedDeletesByCount(TestIndexWriterDelete.java:1030)




Build Log (for compile errors):
[...truncated 7073 lines...]



---------------------------------------------------------------------
To unsubscribe, e-mail: dev-unsubscribe@lucene.apache.org
For additional commands, e-mail: dev-help@lucene.apache.org


[JENKINS] Lucene-Solr-tests-only-3.x-java7 - Build # 29 - Still Failing

Posted by Apache Jenkins Server <je...@builds.apache.org>.
Build: https://builds.apache.org/job/Lucene-Solr-tests-only-3.x-java7/29/

1 tests failed.
FAILED:  org.apache.lucene.index.TestIndexWriterDelete.testFlushPushedDeletesByCount

Error Message:
delete's were not applied at count=6100

Stack Trace:
junit.framework.AssertionFailedError: delete's were not applied at count=6100
	at org.apache.lucene.util.LuceneTestCase$LuceneTestCaseRunner.runChild(LuceneTestCase.java:1316)
	at org.apache.lucene.util.LuceneTestCase$LuceneTestCaseRunner.runChild(LuceneTestCase.java:1221)
	at org.apache.lucene.index.TestIndexWriterDelete.testFlushPushedDeletesByCount(TestIndexWriterDelete.java:1030)




Build Log (for compile errors):
[...truncated 7071 lines...]



---------------------------------------------------------------------
To unsubscribe, e-mail: dev-unsubscribe@lucene.apache.org
For additional commands, e-mail: dev-help@lucene.apache.org


Re: [JENKINS] Lucene-Solr-tests-only-3.x-java7 - Build # 28 - Still Failing

Posted by Michael McCandless <lu...@mikemccandless.com>.
I committed a fix for this -- this was a new bug, only in 3.x,
uncovered by the test cases added for LUCENE-3340.

Mike McCandless

http://blog.mikemccandless.com

On Tue, Jul 26, 2011 at 11:05 AM, Apache Jenkins Server
<je...@builds.apache.org> wrote:
> Build: https://builds.apache.org/job/Lucene-Solr-tests-only-3.x-java7/28/
>
> 1 tests failed.
> FAILED:  org.apache.lucene.index.TestIndexWriterDelete.testFlushPushedDeletesByCount
>
> Error Message:
> delete's were not applied at count=5868
>
> Stack Trace:
> junit.framework.AssertionFailedError: delete's were not applied at count=5868
>        at org.apache.lucene.util.LuceneTestCase$LuceneTestCaseRunner.runChild(LuceneTestCase.java:1316)
>        at org.apache.lucene.util.LuceneTestCase$LuceneTestCaseRunner.runChild(LuceneTestCase.java:1221)
>        at org.apache.lucene.index.TestIndexWriterDelete.testFlushPushedDeletesByCount(TestIndexWriterDelete.java:1030)
>
>
>
>
> Build Log (for compile errors):
> [...truncated 7064 lines...]
>
>
>
> ---------------------------------------------------------------------
> To unsubscribe, e-mail: dev-unsubscribe@lucene.apache.org
> For additional commands, e-mail: dev-help@lucene.apache.org
>
>

---------------------------------------------------------------------
To unsubscribe, e-mail: dev-unsubscribe@lucene.apache.org
For additional commands, e-mail: dev-help@lucene.apache.org


[JENKINS] Lucene-Solr-tests-only-3.x-java7 - Build # 28 - Still Failing

Posted by Apache Jenkins Server <je...@builds.apache.org>.
Build: https://builds.apache.org/job/Lucene-Solr-tests-only-3.x-java7/28/

1 tests failed.
FAILED:  org.apache.lucene.index.TestIndexWriterDelete.testFlushPushedDeletesByCount

Error Message:
delete's were not applied at count=5868

Stack Trace:
junit.framework.AssertionFailedError: delete's were not applied at count=5868
	at org.apache.lucene.util.LuceneTestCase$LuceneTestCaseRunner.runChild(LuceneTestCase.java:1316)
	at org.apache.lucene.util.LuceneTestCase$LuceneTestCaseRunner.runChild(LuceneTestCase.java:1221)
	at org.apache.lucene.index.TestIndexWriterDelete.testFlushPushedDeletesByCount(TestIndexWriterDelete.java:1030)




Build Log (for compile errors):
[...truncated 7064 lines...]



---------------------------------------------------------------------
To unsubscribe, e-mail: dev-unsubscribe@lucene.apache.org
For additional commands, e-mail: dev-help@lucene.apache.org


[JENKINS] Lucene-Solr-tests-only-3.x-java7 - Build # 27 - Still Failing

Posted by Apache Jenkins Server <je...@builds.apache.org>.
Build: https://builds.apache.org/job/Lucene-Solr-tests-only-3.x-java7/27/

1 tests failed.
FAILED:  org.apache.lucene.index.TestIndexWriterDelete.testFlushPushedDeletesByCount

Error Message:
delete's were not applied at count=6762

Stack Trace:
junit.framework.AssertionFailedError: delete's were not applied at count=6762
	at org.apache.lucene.util.LuceneTestCase$LuceneTestCaseRunner.runChild(LuceneTestCase.java:1316)
	at org.apache.lucene.util.LuceneTestCase$LuceneTestCaseRunner.runChild(LuceneTestCase.java:1221)
	at org.apache.lucene.index.TestIndexWriterDelete.testFlushPushedDeletesByCount(TestIndexWriterDelete.java:1030)




Build Log (for compile errors):
[...truncated 7067 lines...]



---------------------------------------------------------------------
To unsubscribe, e-mail: dev-unsubscribe@lucene.apache.org
For additional commands, e-mail: dev-help@lucene.apache.org


[JENKINS] Lucene-Solr-tests-only-3.x-java7 - Build # 26 - Still Failing

Posted by Apache Jenkins Server <je...@builds.apache.org>.
Build: https://builds.apache.org/job/Lucene-Solr-tests-only-3.x-java7/26/

1 tests failed.
FAILED:  org.apache.lucene.index.TestIndexWriterDelete.testFlushPushedDeletesByCount

Error Message:
delete's were not applied at count=7330

Stack Trace:
junit.framework.AssertionFailedError: delete's were not applied at count=7330
	at org.apache.lucene.util.LuceneTestCase$LuceneTestCaseRunner.runChild(LuceneTestCase.java:1316)
	at org.apache.lucene.util.LuceneTestCase$LuceneTestCaseRunner.runChild(LuceneTestCase.java:1221)
	at org.apache.lucene.index.TestIndexWriterDelete.testFlushPushedDeletesByCount(TestIndexWriterDelete.java:1030)




Build Log (for compile errors):
[...truncated 7064 lines...]



---------------------------------------------------------------------
To unsubscribe, e-mail: dev-unsubscribe@lucene.apache.org
For additional commands, e-mail: dev-help@lucene.apache.org


RE: [JENKINS] Lucene-Solr-tests-only-3.x-java7 - Build # 25 - Still Failing

Posted by Uwe Schindler <uw...@thetaphi.de>.
This one is real.

Also happens locally with Java 5 reproducible:

$ ant test-core -Dtestcase=TestIndexWriterDelete -Dtestmethod=testFlushPushedDeletesByCount -Dtests.seed=3728512532261700821:674509683516976857 -Dtests.multiplier=5
...
junit-sequential:
    [junit] Testsuite: org.apache.lucene.index.TestIndexWriterDelete
    [junit] Tests run: 1, Failures: 1, Errors: 0, Time elapsed: 2,259 sec
    [junit]
    [junit] ------------- Standard Error -----------------
    [junit] NOTE: reproduce with: ant test -Dtestcase=TestIndexWriterDelete -Dtestmethod=testFlushPushedDeletesByCount -Dtests.seed=3728512532261700821:674509683516976857 -Dtests.multiplier=5
    [junit] NOTE: test params are: locale=pl_PL, timezone=Asia/Manila
    [junit] NOTE: all tests run in this JVM:
    [junit] [TestIndexWriterDelete]
    [junit] NOTE: Windows 7 6.1 amd64/Sun Microsystems Inc. 1.5.0_22 (64-bit)/cpus=2,threads=1,free=13481536,total=15335424
    [junit] ------------- ---------------- ---------------
    [junit] Testcase: testFlushPushedDeletesByCount(org.apache.lucene.index.TestIndexWriterDelete): FAILED
    [junit] delete's were not applied at count=6998
    [junit] junit.framework.AssertionFailedError: delete's were not applied at count=6998
    [junit]     at org.apache.lucene.util.LuceneTestCase$LuceneTestCaseRunner.runChild(LuceneTestCase.java:1316)
    [junit]     at org.apache.lucene.util.LuceneTestCase$LuceneTestCaseRunner.runChild(LuceneTestCase.java:1221)
    [junit]     at org.apache.lucene.index.TestIndexWriterDelete.testFlushPushedDeletesByCount(TestIndexWriterDelete.java:1030)
    [junit]
    [junit]
    [junit] Test org.apache.lucene.index.TestIndexWriterDelete FAILED


-----
Uwe Schindler
H.-H.-Meier-Allee 63, D-28213 Bremen
http://www.thetaphi.de
eMail: uwe@thetaphi.de


> -----Original Message-----
> From: Apache Jenkins Server [mailto:jenkins@builds.apache.org]
> Sent: Tuesday, July 26, 2011 3:38 PM
> To: dev@lucene.apache.org
> Subject: [JENKINS] Lucene-Solr-tests-only-3.x-java7 - Build # 25 - Still Failing
> 
> Build: https://builds.apache.org/job/Lucene-Solr-tests-only-3.x-java7/25/
> 
> 1 tests failed.
> FAILED:
> org.apache.lucene.index.TestIndexWriterDelete.testFlushPushedDeletesBy
> Count
> 
> Error Message:
> delete's were not applied at count=6212
> 
> Stack Trace:
> junit.framework.AssertionFailedError: delete's were not applied at
> count=6212
> 	at
> org.apache.lucene.util.LuceneTestCase$LuceneTestCaseRunner.runChild(Luc
> eneTestCase.java:1316)
> 	at
> org.apache.lucene.util.LuceneTestCase$LuceneTestCaseRunner.runChild(Luc
> eneTestCase.java:1221)
> 	at
> org.apache.lucene.index.TestIndexWriterDelete.testFlushPushedDeletesBy
> Count(TestIndexWriterDelete.java:1030)
> 
> 
> 
> 
> Build Log (for compile errors):
> [...truncated 7062 lines...]
> 
> 
> 
> ---------------------------------------------------------------------
> To unsubscribe, e-mail: dev-unsubscribe@lucene.apache.org For additional
> commands, e-mail: dev-help@lucene.apache.org


---------------------------------------------------------------------
To unsubscribe, e-mail: dev-unsubscribe@lucene.apache.org
For additional commands, e-mail: dev-help@lucene.apache.org


[JENKINS] Lucene-Solr-tests-only-3.x-java7 - Build # 25 - Still Failing

Posted by Apache Jenkins Server <je...@builds.apache.org>.
Build: https://builds.apache.org/job/Lucene-Solr-tests-only-3.x-java7/25/

1 tests failed.
FAILED:  org.apache.lucene.index.TestIndexWriterDelete.testFlushPushedDeletesByCount

Error Message:
delete's were not applied at count=6212

Stack Trace:
junit.framework.AssertionFailedError: delete's were not applied at count=6212
	at org.apache.lucene.util.LuceneTestCase$LuceneTestCaseRunner.runChild(LuceneTestCase.java:1316)
	at org.apache.lucene.util.LuceneTestCase$LuceneTestCaseRunner.runChild(LuceneTestCase.java:1221)
	at org.apache.lucene.index.TestIndexWriterDelete.testFlushPushedDeletesByCount(TestIndexWriterDelete.java:1030)




Build Log (for compile errors):
[...truncated 7062 lines...]



---------------------------------------------------------------------
To unsubscribe, e-mail: dev-unsubscribe@lucene.apache.org
For additional commands, e-mail: dev-help@lucene.apache.org