You are viewing a plain text version of this content. The canonical link for it is here.
Posted to builds@beam.apache.org by Apache Jenkins Server <je...@builds.apache.org> on 2020/02/27 17:36:46 UTC

Build failed in Jenkins: beam_PostCommit_Java_ValidatesRunner_Apex #6460

See <https://builds.apache.org/job/beam_PostCommit_Java_ValidatesRunner_Apex/6460/display/redirect?page=changes>

Changes:

[michal.walenia] [BEAM-9258] Add integration test for Cloud DLP


------------------------------------------
Started by GitHub push by aaltay
Running as SYSTEM
[EnvInject] - Loading node environment variables.
Building remotely on apache-beam-jenkins-5 (beam) in workspace <https://builds.apache.org/job/beam_PostCommit_Java_ValidatesRunner_Apex/ws/>
No credentials specified
Wiping out workspace first.
Cloning the remote Git repository
Cloning repository https://github.com/apache/beam.git
 > git init <https://builds.apache.org/job/beam_PostCommit_Java_ValidatesRunner_Apex/ws/src> # timeout=10
Fetching upstream changes from https://github.com/apache/beam.git
 > git --version # timeout=10
 > git fetch --tags --progress https://github.com/apache/beam.git +refs/heads/*:refs/remotes/origin/*
 > git config remote.origin.url https://github.com/apache/beam.git # timeout=10
 > git config --add remote.origin.fetch +refs/heads/*:refs/remotes/origin/* # timeout=10
 > git config remote.origin.url https://github.com/apache/beam.git # timeout=10
Fetching upstream changes from https://github.com/apache/beam.git
 > git fetch --tags --progress https://github.com/apache/beam.git +refs/heads/*:refs/remotes/origin/* +refs/pull/${ghprbPullId}/*:refs/remotes/origin/pr/${ghprbPullId}/*
 > git rev-parse origin/master^{commit} # timeout=10
Checking out Revision 1388bca9314e23f205b17a18e32554ea351dd21e (origin/master)
 > git config core.sparsecheckout # timeout=10
 > git checkout -f 1388bca9314e23f205b17a18e32554ea351dd21e
Commit message: "Merge pull request #10961 from apache/BEAM-9258-cloud-dlp-python-it"
 > git rev-list --no-walk 1856d8533c879ab236d0593be1f9c7fff41edd7f # timeout=10
No emails were triggered.
[EnvInject] - Executing scripts and injecting environment variables after the SCM step.
[EnvInject] - Injecting as environment variables the properties content 
SPARK_LOCAL_IP=127.0.0.1

[EnvInject] - Variables injected successfully.
[Gradle] - Launching build.
[src] $ <https://builds.apache.org/job/beam_PostCommit_Java_ValidatesRunner_Apex/ws/src/gradlew> --continue --max-workers=12 -Dorg.gradle.jvmargs=-Xms2g -Dorg.gradle.jvmargs=-Xmx4g :runners:apex:validatesRunner
Starting a Gradle Daemon, 1 stopped Daemon could not be reused, use --status for details

FAILURE: Build failed with an exception.

* What went wrong:
Could not create service of type ExecutionHistoryCacheAccess using ExecutionServices.createCacheAccess().
> Failed to create parent directory '<https://builds.apache.org/job/beam_PostCommit_Java_ValidatesRunner_Apex/ws/src/buildSrc/.gradle/5.2.1'> when creating directory '<https://builds.apache.org/job/beam_PostCommit_Java_ValidatesRunner_Apex/ws/src/buildSrc/.gradle/5.2.1/executionHistory'>

* Try:
Run with --stacktrace option to get the stack trace. Run with --info or --debug option to get more log output. Run with --scan to get full insights.

* Get more help at https://help.gradle.org

BUILD FAILED in 6s

FAILURE: Build failed with an exception.

* What went wrong:
Failed to notify root build lifecycle listener.
> Could not update /home/jenkins/.gradle/caches/5.2.1/file-changes/last-build.bin
> Could not update <https://builds.apache.org/job/beam_PostCommit_Java_ValidatesRunner_Apex/ws/src/.gradle/5.2.1/fileChanges/last-build.bin>

* Try:
Run with --stacktrace option to get the stack trace. Run with --info or --debug option to get more log output. Run with --scan to get full insights.

* Get more help at https://help.gradle.org

BUILD FAILED in 6s

FAILURE: Build failed with an exception.

* What went wrong:
Could not write cache value to '/home/jenkins/.gradle/daemon/5.2.1/registry.bin'.

* Try:
Run with --stacktrace option to get the stack trace. Run with --info or --debug option to get more log output. Run with --scan to get full insights.

* Get more help at https://help.gradle.org
Build step 'Invoke Gradle script' changed build result to FAILURE
Build step 'Invoke Gradle script' marked build as failure

---------------------------------------------------------------------
To unsubscribe, e-mail: builds-unsubscribe@beam.apache.org
For additional commands, e-mail: builds-help@beam.apache.org


Jenkins build is back to normal : beam_PostCommit_Java_ValidatesRunner_Apex #6461

Posted by Apache Jenkins Server <je...@builds.apache.org>.
See <https://builds.apache.org/job/beam_PostCommit_Java_ValidatesRunner_Apex/6461/display/redirect>


---------------------------------------------------------------------
To unsubscribe, e-mail: builds-unsubscribe@beam.apache.org
For additional commands, e-mail: builds-help@beam.apache.org