You are viewing a plain text version of this content. The canonical link for it is here.
Posted to dev@hawq.apache.org by Ed Espino <es...@apache.org> on 2017/06/02 18:08:38 UTC

Apache HAWQ TravisCI build error

I'm taking a look at the Apache HAWQ build error reported on TravisCI (
https://travis-ci.org/apache/incubator-hawq).

I noticed there is a "mvn" error.


***
ERROR: `mvn' is missing on your system.
***
make[2]: *** [hawq-mapreduce-tool/target/hawq-mapreduce-tool-1.1.0.jar]
Error 1
make[1]: *** [all] Error 2
make: *** [all] Error 2


I am going to spend some time to determine what has introduced this and
hopefully be able to take corrective action.

-=e
-- 
*Ed Espino*