You are viewing a plain text version of this content. The canonical link for it is here.
Posted to dev@lucene.apache.org by bu...@flonkings.com on 2012/10/18 14:13:21 UTC

[JENKINS] Lucene-trunk-Linux-Java6-64-test-only - Build # 10239 - Failure!

Build: builds.flonkings.com/job/Lucene-trunk-Linux-Java6-64-test-only/10239/

1 tests failed.
REGRESSION:  org.apache.lucene.search.TestTimeLimitingCollector.testSearchMultiThreaded

Error Message:
Captured an uncaught exception in thread: Thread[id=78, name=Thread-49, state=RUNNABLE, group=TGRP-TestTimeLimitingCollector]

Stack Trace:
com.carrotsearch.randomizedtesting.UncaughtExceptionError: Captured an uncaught exception in thread: Thread[id=78, name=Thread-49, state=RUNNABLE, group=TGRP-TestTimeLimitingCollector]
Caused by: java.lang.OutOfMemoryError: Java heap space
	at __randomizedtesting.SeedInfo.seed([349C4306D54BF8B7]:0)
	at org.apache.lucene.store.BufferedIndexInput.refill(BufferedIndexInput.java:269)
	at org.apache.lucene.store.BufferedIndexInput.readByte(BufferedIndexInput.java:51)
	at org.apache.lucene.store.DataInput.readVInt(DataInput.java:108)
	at org.apache.lucene.store.BufferedIndexInput.readVInt(BufferedIndexInput.java:219)
	at org.apache.lucene.store.MockIndexInputWrapper.readVInt(MockIndexInputWrapper.java:161)
	at org.apache.lucene.codecs.lucene41.Lucene41PostingsReader.readVIntBlock(Lucene41PostingsReader.java:129)
	at org.apache.lucene.codecs.lucene41.Lucene41PostingsReader.access$300(Lucene41PostingsReader.java:55)
	at org.apache.lucene.codecs.lucene41.Lucene41PostingsReader$BlockDocsEnum.refillDocs(Lucene41PostingsReader.java:426)
	at org.apache.lucene.codecs.lucene41.Lucene41PostingsReader$BlockDocsEnum.nextDoc(Lucene41PostingsReader.java:448)
	at org.apache.lucene.index.MultiDocsEnum.nextDoc(MultiDocsEnum.java:124)
	at org.apache.lucene.search.TermScorer.nextDoc(TermScorer.java:69)
	at org.apache.lucene.search.DisjunctionSumScorer.nextDoc(DisjunctionSumScorer.java:74)
	at org.apache.lucene.search.BooleanScorer2.score(BooleanScorer2.java:282)
	at org.apache.lucene.search.IndexSearcher.search(IndexSearcher.java:589)
	at org.apache.lucene.search.IndexSearcher.search(IndexSearcher.java:293)
	at org.apache.lucene.search.TestTimeLimitingCollector.search(TestTimeLimitingCollector.java:124)
	at org.apache.lucene.search.TestTimeLimitingCollector.doTestSearch(TestTimeLimitingCollector.java:139)
	at org.apache.lucene.search.TestTimeLimitingCollector.access$200(TestTimeLimitingCollector.java:42)
	at org.apache.lucene.search.TestTimeLimitingCollector$1.run(TestTimeLimitingCollector.java:292)




Build Log:
[...truncated 1042 lines...]
[junit4:junit4] Suite: org.apache.lucene.search.TestTimeLimitingCollector
[junit4:junit4]   2> 2012-okt-18 22:12:03 com.carrotsearch.randomizedtesting.RandomizedRunner$QueueUncaughtExceptionsHandler uncaughtException
[junit4:junit4]   2> VARNING: Uncaught exception in thread: Thread[Thread-49,5,TGRP-TestTimeLimitingCollector]
[junit4:junit4]   2> java.lang.OutOfMemoryError: Java heap space
[junit4:junit4]   2> 	at __randomizedtesting.SeedInfo.seed([349C4306D54BF8B7]:0)
[junit4:junit4]   2> 	at org.apache.lucene.store.BufferedIndexInput.refill(BufferedIndexInput.java:269)
[junit4:junit4]   2> 	at org.apache.lucene.store.BufferedIndexInput.readByte(BufferedIndexInput.java:51)
[junit4:junit4]   2> 	at org.apache.lucene.store.DataInput.readVInt(DataInput.java:108)
[junit4:junit4]   2> 	at org.apache.lucene.store.BufferedIndexInput.readVInt(BufferedIndexInput.java:219)
[junit4:junit4]   2> 	at org.apache.lucene.store.MockIndexInputWrapper.readVInt(MockIndexInputWrapper.java:161)
[junit4:junit4]   2> 	at org.apache.lucene.codecs.lucene41.Lucene41PostingsReader.readVIntBlock(Lucene41PostingsReader.java:129)
[junit4:junit4]   2> 	at org.apache.lucene.codecs.lucene41.Lucene41PostingsReader.access$300(Lucene41PostingsReader.java:55)
[junit4:junit4]   2> 	at org.apache.lucene.codecs.lucene41.Lucene41PostingsReader$BlockDocsEnum.refillDocs(Lucene41PostingsReader.java:426)
[junit4:junit4]   2> 	at org.apache.lucene.codecs.lucene41.Lucene41PostingsReader$BlockDocsEnum.nextDoc(Lucene41PostingsReader.java:448)
[junit4:junit4]   2> 	at org.apache.lucene.index.MultiDocsEnum.nextDoc(MultiDocsEnum.java:124)
[junit4:junit4]   2> 	at org.apache.lucene.search.TermScorer.nextDoc(TermScorer.java:69)
[junit4:junit4]   2> 	at org.apache.lucene.search.DisjunctionSumScorer.nextDoc(DisjunctionSumScorer.java:74)
[junit4:junit4]   2> 	at org.apache.lucene.search.BooleanScorer2.score(BooleanScorer2.java:282)
[junit4:junit4]   2> 	at org.apache.lucene.search.IndexSearcher.search(IndexSearcher.java:589)
[junit4:junit4]   2> 	at org.apache.lucene.search.IndexSearcher.search(IndexSearcher.java:293)
[junit4:junit4]   2> 	at org.apache.lucene.search.TestTimeLimitingCollector.search(TestTimeLimitingCollector.java:124)
[junit4:junit4]   2> 	at org.apache.lucene.search.TestTimeLimitingCollector.doTestSearch(TestTimeLimitingCollector.java:139)
[junit4:junit4]   2> 	at org.apache.lucene.search.TestTimeLimitingCollector.access$200(TestTimeLimitingCollector.java:42)
[junit4:junit4]   2> 	at org.apache.lucene.search.TestTimeLimitingCollector$1.run(TestTimeLimitingCollector.java:292)
[junit4:junit4]   2> NOTE: reproduce with: ant test  -Dtestcase=TestTimeLimitingCollector -Dtests.method=testSearchMultiThreaded -Dtests.seed=349C4306D54BF8B7 -Dtests.slow=true -Dtests.locale=sv_SE -Dtests.timezone=Pacific/Truk -Dtests.file.encoding=ISO-8859-1
[junit4:junit4] ERROR    132s J2 | TestTimeLimitingCollector.testSearchMultiThreaded <<<
[junit4:junit4]    > Throwable #1: java.lang.AssertionError: some threads failed! expected:<50> but was:<49>
[junit4:junit4]    > 	at org.junit.Assert.fail(Assert.java:93)
[junit4:junit4]    > 	at org.junit.Assert.failNotEquals(Assert.java:647)
[junit4:junit4]    > 	at org.junit.Assert.assertEquals(Assert.java:128)
[junit4:junit4]    > 	at org.junit.Assert.assertEquals(Assert.java:472)
[junit4:junit4]    > 	at org.apache.lucene.search.TestTimeLimitingCollector.doTestMultiThreads(TestTimeLimitingCollector.java:306)
[junit4:junit4]    > 	at org.apache.lucene.search.TestTimeLimitingCollector.testSearchMultiThreaded(TestTimeLimitingCollector.java:271)
[junit4:junit4]    > 	at sun.reflect.NativeMethodAccessorImpl.invoke0(Native Method)
[junit4:junit4]    > 	at sun.reflect.NativeMethodAccessorImpl.invoke(NativeMethodAccessorImpl.java:39)
[junit4:junit4]    > 	at sun.reflect.DelegatingMethodAccessorImpl.invoke(DelegatingMethodAccessorImpl.java:25)
[junit4:junit4]    > 	at java.lang.reflect.Method.invoke(Method.java:597)
[junit4:junit4]    > 	at com.carrotsearch.randomizedtesting.RandomizedRunner.invoke(RandomizedRunner.java:1559)
[junit4:junit4]    > 	at com.carrotsearch.randomizedtesting.RandomizedRunner.access$600(RandomizedRunner.java:79)
[junit4:junit4]    > 	at com.carrotsearch.randomizedtesting.RandomizedRunner$6.evaluate(RandomizedRunner.java:737)
[junit4:junit4]    > 	at com.carrotsearch.randomizedtesting.RandomizedRunner$7.evaluate(RandomizedRunner.java:773)
[junit4:junit4]    > 	at com.carrotsearch.randomizedtesting.RandomizedRunner$8.evaluate(RandomizedRunner.java:787)
[junit4:junit4]    > 	at org.apache.lucene.util.TestRuleSetupTeardownChained$1.evaluate(TestRuleSetupTeardownChained.java:50)
[junit4:junit4]    > 	at org.apache.lucene.util.TestRuleFieldCacheSanity$1.evaluate(TestRuleFieldCacheSanity.java:51)
[junit4:junit4]    > 	at org.apache.lucene.util.AbstractBeforeAfterRule$1.evaluate(AbstractBeforeAfterRule.java:45)
[junit4:junit4]    > 	at com.carrotsearch.randomizedtesting.rules.SystemPropertiesInvariantRule$1.evaluate(SystemPropertiesInvariantRule.java:55)
[junit4:junit4]    > 	at org.apache.lucene.util.TestRuleThreadAndTestName$1.evaluate(TestRuleThreadAndTestName.java:48)
[junit4:junit4]    > 	at org.apache.lucene.util.TestRuleIgnoreAfterMaxFailures$1.evaluate(TestRuleIgnoreAfterMaxFailures.java:70)
[junit4:junit4]    > 	at org.apache.lucene.util.TestRuleMarkFailure$1.evaluate(TestRuleMarkFailure.java:48)
[junit4:junit4]    > 	at com.carrotsearch.randomizedtesting.rules.StatementAdapter.evaluate(StatementAdapter.java:36)
[junit4:junit4]    > 	at com.carrotsearch.randomizedtesting.ThreadLeakControl$StatementRunner.run(ThreadLeakControl.java:358)
[junit4:junit4]    > 	at com.carrotsearch.randomizedtesting.ThreadLeakControl.forkTimeoutingTask(ThreadLeakControl.java:782)
[junit4:junit4]    > 	at com.carrotsearch.randomizedtesting.ThreadLeakControl$3.evaluate(ThreadLeakControl.java:442)
[junit4:junit4]    > 	at com.carrotsearch.randomizedtesting.RandomizedRunner.runSingleTest(RandomizedRunner.java:746)
[junit4:junit4]    > 	at com.carrotsearch.randomizedtesting.RandomizedRunner$3.evaluate(RandomizedRunner.java:648)
[junit4:junit4]    > 	at com.carrotsearch.randomizedtesting.RandomizedRunner$4.evaluate(RandomizedRunner.java:682)
[junit4:junit4]    > 	at com.carrotsearch.randomizedtesting.RandomizedRunner$5.evaluate(RandomizedRunner.java:693)
[junit4:junit4]    > 	at org.apache.lucene.util.AbstractBeforeAfterRule$1.evaluate(AbstractBeforeAfterRule.java:45)
[junit4:junit4]    > 	at org.apache.lucene.util.TestRuleStoreClassName$1.evaluate(TestRuleStoreClassName.java:42)
[junit4:junit4]    > 	at com.carrotsearch.randomizedtesting.rules.SystemPropertiesInvariantRule$1.evaluate(SystemPropertiesInvariantRule.java:55)
[junit4:junit4]    > 	at com.carrotsearch.randomizedtesting.rules.NoShadowingOrOverridesOnMethodsRule$1.evaluate(NoShadowingOrOverridesOnMethodsRule.java:39)
[junit4:junit4]    > 	at com.carrotsearch.randomizedtesting.rules.NoShadowingOrOverridesOnMethodsRule$1.evaluate(NoShadowingOrOverridesOnMethodsRule.java:39)
[junit4:junit4]    > 	at com.carrotsearch.randomizedtesting.rules.StatementAdapter.evaluate(StatementAdapter.java:36)
[junit4:junit4]    > 	at org.apache.lucene.util.TestRuleAssertionsRequired$1.evaluate(TestRuleAssertionsRequired.java:43)
[junit4:junit4]    > 	at org.apache.lucene.util.TestRuleMarkFailure$1.evaluate(TestRuleMarkFailure.java:48)
[junit4:junit4]    > 	at org.apache.lucene.util.TestRuleIgnoreAfterMaxFailures$1.evaluate(TestRuleIgnoreAfterMaxFailures.java:70)
[junit4:junit4]    > 	at org.apache.lucene.util.TestRuleIgnoreTestSuites$1.evaluate(TestRuleIgnoreTestSuites.java:55)
[junit4:junit4]    > 	at com.carrotsearch.randomizedtesting.rules.StatementAdapter.evaluate(StatementAdapter.java:36)
[junit4:junit4]    > 	at com.carrotsearch.randomizedtesting.ThreadLeakControl$StatementRunner.run(ThreadLeakControl.java:358)
[junit4:junit4]    > 	at java.lang.Thread.run(Thread.java:662)
[junit4:junit4]    > Throwable #2: com.carrotsearch.randomizedtesting.UncaughtExceptionError: Captured an uncaught exception in thread: Thread[id=78, name=Thread-49, state=RUNNABLE, group=TGRP-TestTimeLimitingCollector]
[junit4:junit4]    > Caused by: java.lang.OutOfMemoryError: Java heap space
[junit4:junit4]    > 	at __randomizedtesting.SeedInfo.seed([349C4306D54BF8B7]:0)
[junit4:junit4]    > 	at org.apache.lucene.store.BufferedIndexInput.refill(BufferedIndexInput.java:269)
[junit4:junit4]    > 	at org.apache.lucene.store.BufferedIndexInput.readByte(BufferedIndexInput.java:51)
[junit4:junit4]    > 	at org.apache.lucene.store.DataInput.readVInt(DataInput.java:108)
[junit4:junit4]    > 	at org.apache.lucene.store.BufferedIndexInput.readVInt(BufferedIndexInput.java:219)
[junit4:junit4]    > 	at org.apache.lucene.store.MockIndexInputWrapper.readVInt(MockIndexInputWrapper.java:161)
[junit4:junit4]    > 	at org.apache.lucene.codecs.lucene41.Lucene41PostingsReader.readVIntBlock(Lucene41PostingsReader.java:129)
[junit4:junit4]    > 	at org.apache.lucene.codecs.lucene41.Lucene41PostingsReader.access$300(Lucene41PostingsReader.java:55)
[junit4:junit4]    > 	at org.apache.lucene.codecs.lucene41.Lucene41PostingsReader$BlockDocsEnum.refillDocs(Lucene41PostingsReader.java:426)
[junit4:junit4]    > 	at org.apache.lucene.codecs.lucene41.Lucene41PostingsReader$BlockDocsEnum.nextDoc(Lucene41PostingsReader.java:448)
[junit4:junit4]    > 	at org.apache.lucene.index.MultiDocsEnum.nextDoc(MultiDocsEnum.java:124)
[junit4:junit4]    > 	at org.apache.lucene.search.TermScorer.nextDoc(TermScorer.java:69)
[junit4:junit4]    > 	at org.apache.lucene.search.DisjunctionSumScorer.nextDoc(DisjunctionSumScorer.java:74)
[junit4:junit4]    > 	at org.apache.lucene.search.BooleanScorer2.score(BooleanScorer2.java:282)
[junit4:junit4]    > 	at org.apache.lucene.search.IndexSearcher.search(IndexSearcher.java:589)
[junit4:junit4]    > 	at org.apache.lucene.search.IndexSearcher.search(IndexSearcher.java:293)
[junit4:junit4]    > 	at org.apache.lucene.search.TestTimeLimitingCollector.search(TestTimeLimitingCollector.java:124)
[junit4:junit4]    > 	at org.apache.lucene.search.TestTimeLimitingCollector.doTestSearch(TestTimeLimitingCollector.java:139)
[junit4:junit4]    > 	at org.apache.lucene.search.TestTimeLimitingCollector.access$200(TestTimeLimitingCollector.java:42)
[junit4:junit4]    > 	at org.apache.lucene.search.TestTimeLimitingCollector$1.run(TestTimeLimitingCollector.java:292)
[junit4:junit4]   2> NOTE: test params are: codec=Lucene41: {body=Pulsing41(freqCutoff=4 minBlockSize=78 maxBlockSize=156)}, sim=RandomSimilarityProvider(queryNorm=false,coord=yes): {body=DFR I(ne)Z(0.3)}, locale=sv_SE, timezone=Pacific/Truk
[junit4:junit4]   2> NOTE: Linux 3.2.0-26-generic amd64/Sun Microsystems Inc. 1.6.0_33 (64-bit)/cpus=8,threads=1,free=267245480,total=311689216
[junit4:junit4]   2> NOTE: All tests run in this JVM: [TestRollingUpdates, TestBufferedIndexInput, TestMockDirectoryWrapper, TestScorerPerf, TestRandomStoredFields, TestComplexExplanationsOfNonMatches, TestSpanSearchEquivalence, TestNoDeletionPolicy, TestBackwardsCompatibility, TestTimeLimitingCollector]
[junit4:junit4] Completed on J2 in 135.96s, 6 tests, 1 error <<< FAILURES!

[...truncated 51 lines...]
BUILD FAILED
/var/lib/jenkins/workspace/Lucene-trunk-Linux-Java6-64-test-only/checkout/lucene/build.xml:50: The following error occurred while executing this line:
/var/lib/jenkins/workspace/Lucene-trunk-Linux-Java6-64-test-only/checkout/lucene/common-build.xml:1148: The following error occurred while executing this line:
/var/lib/jenkins/workspace/Lucene-trunk-Linux-Java6-64-test-only/checkout/lucene/common-build.xml:817: There were test failures: 317 suites, 1819 tests, 1 error, 21 ignored (11 assumptions)

Total time: 4 minutes 8 seconds
Build step 'Invoke Ant' marked build as failure
Archiving artifacts
Recording test results
Email was triggered for: Failure
Sending email for trigger: Failure




Re: [JENKINS] Lucene-trunk-Linux-Java6-64-test-only - Build # 10239 - Failure!

Posted by Michael McCandless <lu...@mikemccandless.com>.
Argh, still no heap dump.

Mike McCandless

http://blog.mikemccandless.com

On Thu, Oct 18, 2012 at 8:13 AM,  <bu...@flonkings.com> wrote:
> Build: builds.flonkings.com/job/Lucene-trunk-Linux-Java6-64-test-only/10239/
>
> 1 tests failed.
> REGRESSION:  org.apache.lucene.search.TestTimeLimitingCollector.testSearchMultiThreaded
>
> Error Message:
> Captured an uncaught exception in thread: Thread[id=78, name=Thread-49, state=RUNNABLE, group=TGRP-TestTimeLimitingCollector]
>
> Stack Trace:
> com.carrotsearch.randomizedtesting.UncaughtExceptionError: Captured an uncaught exception in thread: Thread[id=78, name=Thread-49, state=RUNNABLE, group=TGRP-TestTimeLimitingCollector]
> Caused by: java.lang.OutOfMemoryError: Java heap space
>         at __randomizedtesting.SeedInfo.seed([349C4306D54BF8B7]:0)
>         at org.apache.lucene.store.BufferedIndexInput.refill(BufferedIndexInput.java:269)
>         at org.apache.lucene.store.BufferedIndexInput.readByte(BufferedIndexInput.java:51)
>         at org.apache.lucene.store.DataInput.readVInt(DataInput.java:108)
>         at org.apache.lucene.store.BufferedIndexInput.readVInt(BufferedIndexInput.java:219)
>         at org.apache.lucene.store.MockIndexInputWrapper.readVInt(MockIndexInputWrapper.java:161)
>         at org.apache.lucene.codecs.lucene41.Lucene41PostingsReader.readVIntBlock(Lucene41PostingsReader.java:129)
>         at org.apache.lucene.codecs.lucene41.Lucene41PostingsReader.access$300(Lucene41PostingsReader.java:55)
>         at org.apache.lucene.codecs.lucene41.Lucene41PostingsReader$BlockDocsEnum.refillDocs(Lucene41PostingsReader.java:426)
>         at org.apache.lucene.codecs.lucene41.Lucene41PostingsReader$BlockDocsEnum.nextDoc(Lucene41PostingsReader.java:448)
>         at org.apache.lucene.index.MultiDocsEnum.nextDoc(MultiDocsEnum.java:124)
>         at org.apache.lucene.search.TermScorer.nextDoc(TermScorer.java:69)
>         at org.apache.lucene.search.DisjunctionSumScorer.nextDoc(DisjunctionSumScorer.java:74)
>         at org.apache.lucene.search.BooleanScorer2.score(BooleanScorer2.java:282)
>         at org.apache.lucene.search.IndexSearcher.search(IndexSearcher.java:589)
>         at org.apache.lucene.search.IndexSearcher.search(IndexSearcher.java:293)
>         at org.apache.lucene.search.TestTimeLimitingCollector.search(TestTimeLimitingCollector.java:124)
>         at org.apache.lucene.search.TestTimeLimitingCollector.doTestSearch(TestTimeLimitingCollector.java:139)
>         at org.apache.lucene.search.TestTimeLimitingCollector.access$200(TestTimeLimitingCollector.java:42)
>         at org.apache.lucene.search.TestTimeLimitingCollector$1.run(TestTimeLimitingCollector.java:292)
>
>
>
>
> Build Log:
> [...truncated 1042 lines...]
> [junit4:junit4] Suite: org.apache.lucene.search.TestTimeLimitingCollector
> [junit4:junit4]   2> 2012-okt-18 22:12:03 com.carrotsearch.randomizedtesting.RandomizedRunner$QueueUncaughtExceptionsHandler uncaughtException
> [junit4:junit4]   2> VARNING: Uncaught exception in thread: Thread[Thread-49,5,TGRP-TestTimeLimitingCollector]
> [junit4:junit4]   2> java.lang.OutOfMemoryError: Java heap space
> [junit4:junit4]   2>    at __randomizedtesting.SeedInfo.seed([349C4306D54BF8B7]:0)
> [junit4:junit4]   2>    at org.apache.lucene.store.BufferedIndexInput.refill(BufferedIndexInput.java:269)
> [junit4:junit4]   2>    at org.apache.lucene.store.BufferedIndexInput.readByte(BufferedIndexInput.java:51)
> [junit4:junit4]   2>    at org.apache.lucene.store.DataInput.readVInt(DataInput.java:108)
> [junit4:junit4]   2>    at org.apache.lucene.store.BufferedIndexInput.readVInt(BufferedIndexInput.java:219)
> [junit4:junit4]   2>    at org.apache.lucene.store.MockIndexInputWrapper.readVInt(MockIndexInputWrapper.java:161)
> [junit4:junit4]   2>    at org.apache.lucene.codecs.lucene41.Lucene41PostingsReader.readVIntBlock(Lucene41PostingsReader.java:129)
> [junit4:junit4]   2>    at org.apache.lucene.codecs.lucene41.Lucene41PostingsReader.access$300(Lucene41PostingsReader.java:55)
> [junit4:junit4]   2>    at org.apache.lucene.codecs.lucene41.Lucene41PostingsReader$BlockDocsEnum.refillDocs(Lucene41PostingsReader.java:426)
> [junit4:junit4]   2>    at org.apache.lucene.codecs.lucene41.Lucene41PostingsReader$BlockDocsEnum.nextDoc(Lucene41PostingsReader.java:448)
> [junit4:junit4]   2>    at org.apache.lucene.index.MultiDocsEnum.nextDoc(MultiDocsEnum.java:124)
> [junit4:junit4]   2>    at org.apache.lucene.search.TermScorer.nextDoc(TermScorer.java:69)
> [junit4:junit4]   2>    at org.apache.lucene.search.DisjunctionSumScorer.nextDoc(DisjunctionSumScorer.java:74)
> [junit4:junit4]   2>    at org.apache.lucene.search.BooleanScorer2.score(BooleanScorer2.java:282)
> [junit4:junit4]   2>    at org.apache.lucene.search.IndexSearcher.search(IndexSearcher.java:589)
> [junit4:junit4]   2>    at org.apache.lucene.search.IndexSearcher.search(IndexSearcher.java:293)
> [junit4:junit4]   2>    at org.apache.lucene.search.TestTimeLimitingCollector.search(TestTimeLimitingCollector.java:124)
> [junit4:junit4]   2>    at org.apache.lucene.search.TestTimeLimitingCollector.doTestSearch(TestTimeLimitingCollector.java:139)
> [junit4:junit4]   2>    at org.apache.lucene.search.TestTimeLimitingCollector.access$200(TestTimeLimitingCollector.java:42)
> [junit4:junit4]   2>    at org.apache.lucene.search.TestTimeLimitingCollector$1.run(TestTimeLimitingCollector.java:292)
> [junit4:junit4]   2> NOTE: reproduce with: ant test  -Dtestcase=TestTimeLimitingCollector -Dtests.method=testSearchMultiThreaded -Dtests.seed=349C4306D54BF8B7 -Dtests.slow=true -Dtests.locale=sv_SE -Dtests.timezone=Pacific/Truk -Dtests.file.encoding=ISO-8859-1
> [junit4:junit4] ERROR    132s J2 | TestTimeLimitingCollector.testSearchMultiThreaded <<<
> [junit4:junit4]    > Throwable #1: java.lang.AssertionError: some threads failed! expected:<50> but was:<49>
> [junit4:junit4]    >    at org.junit.Assert.fail(Assert.java:93)
> [junit4:junit4]    >    at org.junit.Assert.failNotEquals(Assert.java:647)
> [junit4:junit4]    >    at org.junit.Assert.assertEquals(Assert.java:128)
> [junit4:junit4]    >    at org.junit.Assert.assertEquals(Assert.java:472)
> [junit4:junit4]    >    at org.apache.lucene.search.TestTimeLimitingCollector.doTestMultiThreads(TestTimeLimitingCollector.java:306)
> [junit4:junit4]    >    at org.apache.lucene.search.TestTimeLimitingCollector.testSearchMultiThreaded(TestTimeLimitingCollector.java:271)
> [junit4:junit4]    >    at sun.reflect.NativeMethodAccessorImpl.invoke0(Native Method)
> [junit4:junit4]    >    at sun.reflect.NativeMethodAccessorImpl.invoke(NativeMethodAccessorImpl.java:39)
> [junit4:junit4]    >    at sun.reflect.DelegatingMethodAccessorImpl.invoke(DelegatingMethodAccessorImpl.java:25)
> [junit4:junit4]    >    at java.lang.reflect.Method.invoke(Method.java:597)
> [junit4:junit4]    >    at com.carrotsearch.randomizedtesting.RandomizedRunner.invoke(RandomizedRunner.java:1559)
> [junit4:junit4]    >    at com.carrotsearch.randomizedtesting.RandomizedRunner.access$600(RandomizedRunner.java:79)
> [junit4:junit4]    >    at com.carrotsearch.randomizedtesting.RandomizedRunner$6.evaluate(RandomizedRunner.java:737)
> [junit4:junit4]    >    at com.carrotsearch.randomizedtesting.RandomizedRunner$7.evaluate(RandomizedRunner.java:773)
> [junit4:junit4]    >    at com.carrotsearch.randomizedtesting.RandomizedRunner$8.evaluate(RandomizedRunner.java:787)
> [junit4:junit4]    >    at org.apache.lucene.util.TestRuleSetupTeardownChained$1.evaluate(TestRuleSetupTeardownChained.java:50)
> [junit4:junit4]    >    at org.apache.lucene.util.TestRuleFieldCacheSanity$1.evaluate(TestRuleFieldCacheSanity.java:51)
> [junit4:junit4]    >    at org.apache.lucene.util.AbstractBeforeAfterRule$1.evaluate(AbstractBeforeAfterRule.java:45)
> [junit4:junit4]    >    at com.carrotsearch.randomizedtesting.rules.SystemPropertiesInvariantRule$1.evaluate(SystemPropertiesInvariantRule.java:55)
> [junit4:junit4]    >    at org.apache.lucene.util.TestRuleThreadAndTestName$1.evaluate(TestRuleThreadAndTestName.java:48)
> [junit4:junit4]    >    at org.apache.lucene.util.TestRuleIgnoreAfterMaxFailures$1.evaluate(TestRuleIgnoreAfterMaxFailures.java:70)
> [junit4:junit4]    >    at org.apache.lucene.util.TestRuleMarkFailure$1.evaluate(TestRuleMarkFailure.java:48)
> [junit4:junit4]    >    at com.carrotsearch.randomizedtesting.rules.StatementAdapter.evaluate(StatementAdapter.java:36)
> [junit4:junit4]    >    at com.carrotsearch.randomizedtesting.ThreadLeakControl$StatementRunner.run(ThreadLeakControl.java:358)
> [junit4:junit4]    >    at com.carrotsearch.randomizedtesting.ThreadLeakControl.forkTimeoutingTask(ThreadLeakControl.java:782)
> [junit4:junit4]    >    at com.carrotsearch.randomizedtesting.ThreadLeakControl$3.evaluate(ThreadLeakControl.java:442)
> [junit4:junit4]    >    at com.carrotsearch.randomizedtesting.RandomizedRunner.runSingleTest(RandomizedRunner.java:746)
> [junit4:junit4]    >    at com.carrotsearch.randomizedtesting.RandomizedRunner$3.evaluate(RandomizedRunner.java:648)
> [junit4:junit4]    >    at com.carrotsearch.randomizedtesting.RandomizedRunner$4.evaluate(RandomizedRunner.java:682)
> [junit4:junit4]    >    at com.carrotsearch.randomizedtesting.RandomizedRunner$5.evaluate(RandomizedRunner.java:693)
> [junit4:junit4]    >    at org.apache.lucene.util.AbstractBeforeAfterRule$1.evaluate(AbstractBeforeAfterRule.java:45)
> [junit4:junit4]    >    at org.apache.lucene.util.TestRuleStoreClassName$1.evaluate(TestRuleStoreClassName.java:42)
> [junit4:junit4]    >    at com.carrotsearch.randomizedtesting.rules.SystemPropertiesInvariantRule$1.evaluate(SystemPropertiesInvariantRule.java:55)
> [junit4:junit4]    >    at com.carrotsearch.randomizedtesting.rules.NoShadowingOrOverridesOnMethodsRule$1.evaluate(NoShadowingOrOverridesOnMethodsRule.java:39)
> [junit4:junit4]    >    at com.carrotsearch.randomizedtesting.rules.NoShadowingOrOverridesOnMethodsRule$1.evaluate(NoShadowingOrOverridesOnMethodsRule.java:39)
> [junit4:junit4]    >    at com.carrotsearch.randomizedtesting.rules.StatementAdapter.evaluate(StatementAdapter.java:36)
> [junit4:junit4]    >    at org.apache.lucene.util.TestRuleAssertionsRequired$1.evaluate(TestRuleAssertionsRequired.java:43)
> [junit4:junit4]    >    at org.apache.lucene.util.TestRuleMarkFailure$1.evaluate(TestRuleMarkFailure.java:48)
> [junit4:junit4]    >    at org.apache.lucene.util.TestRuleIgnoreAfterMaxFailures$1.evaluate(TestRuleIgnoreAfterMaxFailures.java:70)
> [junit4:junit4]    >    at org.apache.lucene.util.TestRuleIgnoreTestSuites$1.evaluate(TestRuleIgnoreTestSuites.java:55)
> [junit4:junit4]    >    at com.carrotsearch.randomizedtesting.rules.StatementAdapter.evaluate(StatementAdapter.java:36)
> [junit4:junit4]    >    at com.carrotsearch.randomizedtesting.ThreadLeakControl$StatementRunner.run(ThreadLeakControl.java:358)
> [junit4:junit4]    >    at java.lang.Thread.run(Thread.java:662)
> [junit4:junit4]    > Throwable #2: com.carrotsearch.randomizedtesting.UncaughtExceptionError: Captured an uncaught exception in thread: Thread[id=78, name=Thread-49, state=RUNNABLE, group=TGRP-TestTimeLimitingCollector]
> [junit4:junit4]    > Caused by: java.lang.OutOfMemoryError: Java heap space
> [junit4:junit4]    >    at __randomizedtesting.SeedInfo.seed([349C4306D54BF8B7]:0)
> [junit4:junit4]    >    at org.apache.lucene.store.BufferedIndexInput.refill(BufferedIndexInput.java:269)
> [junit4:junit4]    >    at org.apache.lucene.store.BufferedIndexInput.readByte(BufferedIndexInput.java:51)
> [junit4:junit4]    >    at org.apache.lucene.store.DataInput.readVInt(DataInput.java:108)
> [junit4:junit4]    >    at org.apache.lucene.store.BufferedIndexInput.readVInt(BufferedIndexInput.java:219)
> [junit4:junit4]    >    at org.apache.lucene.store.MockIndexInputWrapper.readVInt(MockIndexInputWrapper.java:161)
> [junit4:junit4]    >    at org.apache.lucene.codecs.lucene41.Lucene41PostingsReader.readVIntBlock(Lucene41PostingsReader.java:129)
> [junit4:junit4]    >    at org.apache.lucene.codecs.lucene41.Lucene41PostingsReader.access$300(Lucene41PostingsReader.java:55)
> [junit4:junit4]    >    at org.apache.lucene.codecs.lucene41.Lucene41PostingsReader$BlockDocsEnum.refillDocs(Lucene41PostingsReader.java:426)
> [junit4:junit4]    >    at org.apache.lucene.codecs.lucene41.Lucene41PostingsReader$BlockDocsEnum.nextDoc(Lucene41PostingsReader.java:448)
> [junit4:junit4]    >    at org.apache.lucene.index.MultiDocsEnum.nextDoc(MultiDocsEnum.java:124)
> [junit4:junit4]    >    at org.apache.lucene.search.TermScorer.nextDoc(TermScorer.java:69)
> [junit4:junit4]    >    at org.apache.lucene.search.DisjunctionSumScorer.nextDoc(DisjunctionSumScorer.java:74)
> [junit4:junit4]    >    at org.apache.lucene.search.BooleanScorer2.score(BooleanScorer2.java:282)
> [junit4:junit4]    >    at org.apache.lucene.search.IndexSearcher.search(IndexSearcher.java:589)
> [junit4:junit4]    >    at org.apache.lucene.search.IndexSearcher.search(IndexSearcher.java:293)
> [junit4:junit4]    >    at org.apache.lucene.search.TestTimeLimitingCollector.search(TestTimeLimitingCollector.java:124)
> [junit4:junit4]    >    at org.apache.lucene.search.TestTimeLimitingCollector.doTestSearch(TestTimeLimitingCollector.java:139)
> [junit4:junit4]    >    at org.apache.lucene.search.TestTimeLimitingCollector.access$200(TestTimeLimitingCollector.java:42)
> [junit4:junit4]    >    at org.apache.lucene.search.TestTimeLimitingCollector$1.run(TestTimeLimitingCollector.java:292)
> [junit4:junit4]   2> NOTE: test params are: codec=Lucene41: {body=Pulsing41(freqCutoff=4 minBlockSize=78 maxBlockSize=156)}, sim=RandomSimilarityProvider(queryNorm=false,coord=yes): {body=DFR I(ne)Z(0.3)}, locale=sv_SE, timezone=Pacific/Truk
> [junit4:junit4]   2> NOTE: Linux 3.2.0-26-generic amd64/Sun Microsystems Inc. 1.6.0_33 (64-bit)/cpus=8,threads=1,free=267245480,total=311689216
> [junit4:junit4]   2> NOTE: All tests run in this JVM: [TestRollingUpdates, TestBufferedIndexInput, TestMockDirectoryWrapper, TestScorerPerf, TestRandomStoredFields, TestComplexExplanationsOfNonMatches, TestSpanSearchEquivalence, TestNoDeletionPolicy, TestBackwardsCompatibility, TestTimeLimitingCollector]
> [junit4:junit4] Completed on J2 in 135.96s, 6 tests, 1 error <<< FAILURES!
>
> [...truncated 51 lines...]
> BUILD FAILED
> /var/lib/jenkins/workspace/Lucene-trunk-Linux-Java6-64-test-only/checkout/lucene/build.xml:50: The following error occurred while executing this line:
> /var/lib/jenkins/workspace/Lucene-trunk-Linux-Java6-64-test-only/checkout/lucene/common-build.xml:1148: The following error occurred while executing this line:
> /var/lib/jenkins/workspace/Lucene-trunk-Linux-Java6-64-test-only/checkout/lucene/common-build.xml:817: There were test failures: 317 suites, 1819 tests, 1 error, 21 ignored (11 assumptions)
>
> Total time: 4 minutes 8 seconds
> Build step 'Invoke Ant' marked build as failure
> Archiving artifacts
> Recording test results
> Email was triggered for: Failure
> Sending email for trigger: Failure
>
>
>
>
>
> ---------------------------------------------------------------------
> To unsubscribe, e-mail: dev-unsubscribe@lucene.apache.org
> For additional commands, e-mail: dev-help@lucene.apache.org

---------------------------------------------------------------------
To unsubscribe, e-mail: dev-unsubscribe@lucene.apache.org
For additional commands, e-mail: dev-help@lucene.apache.org