You are viewing a plain text version of this content. The canonical link for it is here.
Posted to dev@lucene.apache.org by Apache Hudson Server <hu...@hudson.apache.org> on 2011/03/11 05:30:25 UTC
[HUDSON] Lucene-Solr-tests-only-trunk - Build # 5794 - Failure
Build: https://hudson.apache.org/hudson/job/Lucene-Solr-tests-only-trunk/5794/
2 tests failed.
FAILED: org.apache.solr.update.DirectUpdateHandlerOptimizeTest.testWatchChildren
Error Message:
Forked Java VM exited abnormally. Please note the time in the report does not reflect the time until the VM exit.
Stack Trace:
junit.framework.AssertionFailedError: Forked Java VM exited abnormally. Please note the time in the report does not reflect the time until the VM exit.
at java.lang.Thread.run(Thread.java:636)
FAILED: TEST-org.apache.solr.cloud.ZkSolrClientTest.xml.<init>
Error Message:
Stack Trace:
Test report file /home/hudson/hudson-slave/workspace/Lucene-Solr-tests-only-trunk/checkout/solr/build/test-results/TEST-org.apache.solr.cloud.ZkSolrClientTest.xml was length 0
Build Log (for compile errors):
[...truncated 8475 lines...]
---------------------------------------------------------------------
To unsubscribe, e-mail: dev-unsubscribe@lucene.apache.org
For additional commands, e-mail: dev-help@lucene.apache.org
[HUDSON] Lucene-Solr-tests-only-trunk - Build # 5799 - Still
Failing
Posted by Apache Hudson Server <hu...@hudson.apache.org>.
Build: https://hudson.apache.org/hudson/job/Lucene-Solr-tests-only-trunk/5799/
2 tests failed.
FAILED: org.apache.solr.update.DirectUpdateHandlerOptimizeTest.testWatchChildren
Error Message:
Forked Java VM exited abnormally. Please note the time in the report does not reflect the time until the VM exit.
Stack Trace:
junit.framework.AssertionFailedError: Forked Java VM exited abnormally. Please note the time in the report does not reflect the time until the VM exit.
at java.lang.Thread.run(Thread.java:636)
FAILED: TEST-org.apache.solr.cloud.ZkSolrClientTest.xml.<init>
Error Message:
Stack Trace:
Test report file /home/hudson/hudson-slave/workspace/Lucene-Solr-tests-only-trunk/checkout/solr/build/test-results/TEST-org.apache.solr.cloud.ZkSolrClientTest.xml was length 0
Build Log (for compile errors):
[...truncated 8465 lines...]
---------------------------------------------------------------------
To unsubscribe, e-mail: dev-unsubscribe@lucene.apache.org
For additional commands, e-mail: dev-help@lucene.apache.org
[HUDSON] Lucene-Solr-tests-only-trunk - Build # 5798 - Still
Failing
Posted by Apache Hudson Server <hu...@hudson.apache.org>.
Build: https://hudson.apache.org/hudson/job/Lucene-Solr-tests-only-trunk/5798/
2 tests failed.
FAILED: org.apache.solr.update.DirectUpdateHandlerOptimizeTest.testWatchChildren
Error Message:
Forked Java VM exited abnormally. Please note the time in the report does not reflect the time until the VM exit.
Stack Trace:
junit.framework.AssertionFailedError: Forked Java VM exited abnormally. Please note the time in the report does not reflect the time until the VM exit.
at java.lang.Thread.run(Thread.java:636)
FAILED: TEST-org.apache.solr.cloud.ZkSolrClientTest.xml.<init>
Error Message:
Stack Trace:
Test report file /home/hudson/hudson-slave/workspace/Lucene-Solr-tests-only-trunk/checkout/solr/build/test-results/TEST-org.apache.solr.cloud.ZkSolrClientTest.xml was length 0
Build Log (for compile errors):
[...truncated 8475 lines...]
---------------------------------------------------------------------
To unsubscribe, e-mail: dev-unsubscribe@lucene.apache.org
For additional commands, e-mail: dev-help@lucene.apache.org
[HUDSON] Lucene-Solr-tests-only-trunk - Build # 5797 - Still
Failing
Posted by Apache Hudson Server <hu...@hudson.apache.org>.
Build: https://hudson.apache.org/hudson/job/Lucene-Solr-tests-only-trunk/5797/
2 tests failed.
FAILED: org.apache.solr.update.DirectUpdateHandlerOptimizeTest.testWatchChildren
Error Message:
Forked Java VM exited abnormally. Please note the time in the report does not reflect the time until the VM exit.
Stack Trace:
junit.framework.AssertionFailedError: Forked Java VM exited abnormally. Please note the time in the report does not reflect the time until the VM exit.
at java.lang.Thread.run(Thread.java:636)
FAILED: TEST-org.apache.solr.cloud.ZkSolrClientTest.xml.<init>
Error Message:
Stack Trace:
Test report file /home/hudson/hudson-slave/workspace/Lucene-Solr-tests-only-trunk/checkout/solr/build/test-results/TEST-org.apache.solr.cloud.ZkSolrClientTest.xml was length 0
Build Log (for compile errors):
[...truncated 8471 lines...]
---------------------------------------------------------------------
To unsubscribe, e-mail: dev-unsubscribe@lucene.apache.org
For additional commands, e-mail: dev-help@lucene.apache.org
[HUDSON] Lucene-Solr-tests-only-trunk - Build # 5796 - Still
Failing
Posted by Apache Hudson Server <hu...@hudson.apache.org>.
Build: https://hudson.apache.org/hudson/job/Lucene-Solr-tests-only-trunk/5796/
2 tests failed.
FAILED: org.apache.solr.update.DirectUpdateHandlerOptimizeTest.testWatchChildren
Error Message:
Forked Java VM exited abnormally. Please note the time in the report does not reflect the time until the VM exit.
Stack Trace:
junit.framework.AssertionFailedError: Forked Java VM exited abnormally. Please note the time in the report does not reflect the time until the VM exit.
at java.lang.Thread.run(Thread.java:636)
FAILED: TEST-org.apache.solr.cloud.ZkSolrClientTest.xml.<init>
Error Message:
Stack Trace:
Test report file /home/hudson/hudson-slave/workspace/Lucene-Solr-tests-only-trunk/checkout/solr/build/test-results/TEST-org.apache.solr.cloud.ZkSolrClientTest.xml was length 0
Build Log (for compile errors):
[...truncated 8473 lines...]
---------------------------------------------------------------------
To unsubscribe, e-mail: dev-unsubscribe@lucene.apache.org
For additional commands, e-mail: dev-help@lucene.apache.org
[HUDSON] Lucene-Solr-tests-only-trunk - Build # 5795 - Still
Failing
Posted by Apache Hudson Server <hu...@hudson.apache.org>.
Build: https://hudson.apache.org/hudson/job/Lucene-Solr-tests-only-trunk/5795/
2 tests failed.
FAILED: org.apache.solr.update.DirectUpdateHandlerOptimizeTest.testWatchChildren
Error Message:
Forked Java VM exited abnormally. Please note the time in the report does not reflect the time until the VM exit.
Stack Trace:
junit.framework.AssertionFailedError: Forked Java VM exited abnormally. Please note the time in the report does not reflect the time until the VM exit.
at java.lang.Thread.run(Thread.java:636)
FAILED: TEST-org.apache.solr.cloud.ZkSolrClientTest.xml.<init>
Error Message:
Stack Trace:
Test report file /home/hudson/hudson-slave/workspace/Lucene-Solr-tests-only-trunk/checkout/solr/build/test-results/TEST-org.apache.solr.cloud.ZkSolrClientTest.xml was length 0
Build Log (for compile errors):
[...truncated 8486 lines...]
---------------------------------------------------------------------
To unsubscribe, e-mail: dev-unsubscribe@lucene.apache.org
For additional commands, e-mail: dev-help@lucene.apache.org