You are viewing a plain text version of this content. The canonical link for it is here.
Posted to commits@myfaces.apache.org by Apache Jenkins Server <je...@builds.apache.org> on 2012/01/14 20:15:07 UTC
Build failed in Jenkins: myfaces-trinidad-core-1.0 #585
See <https://builds.apache.org/job/myfaces-trinidad-core-1.0/585/>
------------------------------------------
[...truncated 6332 lines...]
Downloaded: https://repository.apache.org/content/repositories/snapshots/org/apache/myfaces/trinidad/trinidad-blank/maven-metadata.xml (615 B at 2.8 KB/sec)
Uploading: https://repository.apache.org/content/repositories/snapshots/org/apache/myfaces/trinidad/trinidad-blank/1.0.14-SNAPSHOT/maven-metadata.xml
Uploaded: https://repository.apache.org/content/repositories/snapshots/org/apache/myfaces/trinidad/trinidad-blank/1.0.14-SNAPSHOT/maven-metadata.xml (1017 B at 2.6 KB/sec)
Uploading: https://repository.apache.org/content/repositories/snapshots/org/apache/myfaces/trinidad/trinidad-blank/maven-metadata.xml
Uploaded: https://repository.apache.org/content/repositories/snapshots/org/apache/myfaces/trinidad/trinidad-blank/maven-metadata.xml (615 B at 9.0 KB/sec)
Uploading: https://repository.apache.org/content/repositories/snapshots/org/apache/myfaces/trinidad/trinidad-blank/1.0.14-SNAPSHOT/trinidad-blank-1.0.14-20120114.184244-807-sources.jar
Uploaded: https://repository.apache.org/content/repositories/snapshots/org/apache/myfaces/trinidad/trinidad-blank/1.0.14-SNAPSHOT/trinidad-blank-1.0.14-20120114.184244-807-sources.jar (7 KB at 42.4 KB/sec)
Uploading: https://repository.apache.org/content/repositories/snapshots/org/apache/myfaces/trinidad/trinidad-blank/1.0.14-SNAPSHOT/maven-metadata.xml
Uploaded: https://repository.apache.org/content/repositories/snapshots/org/apache/myfaces/trinidad/trinidad-blank/1.0.14-SNAPSHOT/maven-metadata.xml (1017 B at 15.0 KB/sec)
[JENKINS] Archiving <https://builds.apache.org/job/myfaces-trinidad-core-1.0/ws/trinidad-examples/trinidad-blank/target/trinidad-blank-1.0.14-SNAPSHOT.war> to /home/hudson/hudson/jobs/myfaces-trinidad-core-1.0/modules/org.apache.myfaces.trinidad$trinidad-blank/builds/2012-01-14_18-05-22/archive/org.apache.myfaces.trinidad/trinidad-blank/1.0.14-20120114.184244-807/trinidad-blank-1.0.14-20120114.184244-807.war
[JENKINS] Archiving <https://builds.apache.org/job/myfaces-trinidad-core-1.0/ws/trinidad-examples/trinidad-blank/target/trinidad-blank-1.0.14-SNAPSHOT-sources.jar> to /home/hudson/hudson/jobs/myfaces-trinidad-core-1.0/modules/org.apache.myfaces.trinidad$trinidad-blank/builds/2012-01-14_18-05-22/archive/org.apache.myfaces.trinidad/trinidad-blank/1.0.14-20120114.184244-807/trinidad-blank-1.0.14-20120114.184244-807-sources.jar
[INFO]
[INFO] ------------------------------------------------------------------------
[INFO] Building Apache MyFaces Trinidad Demo 1.0.14-SNAPSHOT
[INFO] ------------------------------------------------------------------------
[INFO] [INFO] Deleting file set: <https://builds.apache.org/job/myfaces-trinidad-core-1.0/ws/trinidad-examples/trinidad-demo/target> (included: [**], excluded: [])
[INFO] --- maven-clean-plugin:2.3:clean (default-clean) @ trinidad-demo ---
[INFO]
[INFO] --- maven-xrts-plugin:1.2.6:generate-sources (default) @ trinidad-demo ---
[INFO]
[INFO] --- maven-remote-resources-plugin:1.0-alpha-6:process (default) @ trinidad-demo ---
[INFO] [INFO] Using 'UTF-8' encoding to copy filtered resources.
[INFO] Copying 0 resource
[INFO] Copying 2 resources
[INFO] --- maven-resources-plugin:2.4.3:resources (default-resources) @ trinidad-demo ---
[INFO]
[INFO] --- maven-compiler-plugin:2.3.1:compile (default-compile) @ trinidad-demo ---
[INFO] Compiling 85 source files to <https://builds.apache.org/job/myfaces-trinidad-core-1.0/ws/trinidad-examples/trinidad-demo/target/classes>
[INFO]
[INFO] --- maven-xrts-plugin:1.2.6:generate-test-sources (default) @ trinidad-demo ---
[INFO] [INFO] Using 'UTF-8' encoding to copy filtered resources.
[INFO] skip non existing resourceDirectory <https://builds.apache.org/job/myfaces-trinidad-core-1.0/ws/trinidad-examples/trinidad-demo/src/test/resources>
[INFO] Copying 2 resources
[INFO] --- maven-resources-plugin:2.4.3:testResources (default-testResources) @ trinidad-demo ---
[INFO] Compiling 5 source files to <https://builds.apache.org/job/myfaces-trinidad-core-1.0/ws/trinidad-examples/trinidad-demo/target/test-classes>
[INFO]
[INFO] --- maven-compiler-plugin:2.3.1:testCompile (default-testCompile) @ trinidad-demo ---
[INFO]
[INFO] --- maven-surefire-plugin:2.5:test (default-test) @ trinidad-demo ---
[INFO] Surefire report directory: <https://builds.apache.org/job/myfaces-trinidad-core-1.0/ws/trinidad-examples/trinidad-demo/target/surefire-reports>
-------------------------------------------------------
T E S T S
-------------------------------------------------------
There are no tests to run.
Results :
Tests run: 0, Failures: 0, Errors: 0, Skipped: 0
[JENKINS] Recording test results
[INFO] Packaging webapp
[INFO] [INFO] Assembling webapp [trinidad-demo] in [<https://builds.apache.org/job/myfaces-trinidad-core-1.0/ws/trinidad-examples/trinidad-demo/target/trinidad-demo-1.0.14-SNAPSHOT]>
[INFO] Processing war project
[INFO] Copying webapp resources [<https://builds.apache.org/job/myfaces-trinidad-core-1.0/ws/trinidad-examples/trinidad-demo/src/main/webapp]>
[INFO] Webapp assembled in [269 msecs]
[INFO] Building war: <https://builds.apache.org/job/myfaces-trinidad-core-1.0/ws/trinidad-examples/trinidad-demo/target/trinidad-demo-1.0.14-SNAPSHOT.war>
[INFO] WEB-INF/web.xml already added, skipping
[INFO] --- maven-war-plugin:2.1.1:war (default-war) @ trinidad-demo ---
[INFO]
[INFO] --- maven-xrts-plugin:1.2.6:generate-sources (default) @ trinidad-demo ---
[JENKINS] Archiving <https://builds.apache.org/job/myfaces-trinidad-core-1.0/ws/trinidad-examples/trinidad-demo/pom.xml> to /home/hudson/hudson/jobs/myfaces-trinidad-core-1.0/modules/org.apache.myfaces.trinidad$trinidad-demo/builds/2012-01-14_18-05-22/archive/org.apache.myfaces.trinidad/trinidad-demo/1.0.14-SNAPSHOT/trinidad-demo-1.0.14-SNAPSHOT.pom
[JENKINS] Archiving <https://builds.apache.org/job/myfaces-trinidad-core-1.0/ws/trinidad-examples/trinidad-demo/target/trinidad-demo-1.0.14-SNAPSHOT.war> to /home/hudson/hudson/jobs/myfaces-trinidad-core-1.0/modules/org.apache.myfaces.trinidad$trinidad-demo/builds/2012-01-14_18-05-22/archive/org.apache.myfaces.trinidad/trinidad-demo/1.0.14-SNAPSHOT/trinidad-demo-1.0.14-SNAPSHOT.war
Jan 14, 2012 6:59:35 PM hudson.maven.ExecutedMojo <init>
WARNING: Failed to getClass for org.apache.maven.plugin.source.SourceJarMojo
[INFO]
[INFO] --- maven-source-plugin:2.1.2:jar (attach-source) @ trinidad-demo ---
[INFO] META-INF already added, skipping
[INFO] META-INF already added, skipping
[INFO] META-INF/NOTICE already added, skipping
[INFO] META-INF/LICENSE already added, skipping
[INFO] Building jar: <https://builds.apache.org/job/myfaces-trinidad-core-1.0/ws/trinidad-examples/trinidad-demo/target/trinidad-demo-1.0.14-SNAPSHOT-sources.jar>
[INFO] META-INF already added, skipping
[INFO] META-INF already added, skipping
[INFO] META-INF/NOTICE already added, skipping
[INFO] META-INF/LICENSE already added, skipping
[INFO] [INFO] Installing <https://builds.apache.org/job/myfaces-trinidad-core-1.0/ws/trinidad-examples/trinidad-demo/target/trinidad-demo-1.0.14-SNAPSHOT.war> to /home/jenkins/.m2/repository/org/apache/myfaces/trinidad/trinidad-demo/1.0.14-SNAPSHOT/trinidad-demo-1.0.14-SNAPSHOT.war
[INFO] --- maven-install-plugin:2.3:install (default-install) @ trinidad-demo ---
[INFO] Installing <https://builds.apache.org/job/myfaces-trinidad-core-1.0/ws/trinidad-examples/trinidad-demo/pom.xml> to /home/jenkins/.m2/repository/org/apache/myfaces/trinidad/trinidad-demo/1.0.14-SNAPSHOT/trinidad-demo-1.0.14-SNAPSHOT.pom
[INFO] Installing <https://builds.apache.org/job/myfaces-trinidad-core-1.0/ws/trinidad-examples/trinidad-demo/target/trinidad-demo-1.0.14-SNAPSHOT-sources.jar> to /home/jenkins/.m2/repository/org/apache/myfaces/trinidad/trinidad-demo/1.0.14-SNAPSHOT/trinidad-demo-1.0.14-SNAPSHOT-sources.jar
[INFO]
[INFO] --- maven-xrts-plugin:1.2.6:generate-sources (default) @ trinidad-demo ---
[INFO]
[INFO] --- maven-remote-resources-plugin:1.0-alpha-6:process (default) @ trinidad-demo ---
[INFO] [INFO] Using 'UTF-8' encoding to copy filtered resources.
[INFO] Copying 0 resource
[INFO] Copying 2 resources
[INFO] Copying 2 resources
[INFO] --- maven-resources-plugin:2.4.3:resources (default-resources) @ trinidad-demo ---
[INFO]
[INFO] --- maven-compiler-plugin:2.3.1:compile (default-compile) @ trinidad-demo ---
[INFO] Nothing to compile - all classes are up to date
[INFO]
[INFO] --- maven-xrts-plugin:1.2.6:generate-test-sources (default) @ trinidad-demo ---
[INFO] [INFO] Using 'UTF-8' encoding to copy filtered resources.
[INFO] skip non existing resourceDirectory <https://builds.apache.org/job/myfaces-trinidad-core-1.0/ws/trinidad-examples/trinidad-demo/src/test/resources>
[INFO] Copying 2 resources
[INFO] Copying 2 resources
[INFO] --- maven-resources-plugin:2.4.3:testResources (default-testResources) @ trinidad-demo ---
[INFO] [INFO] Nothing to compile - all classes are up to date
[INFO] --- maven-compiler-plugin:2.3.1:testCompile (default-testCompile) @ trinidad-demo ---
[INFO]
[INFO] --- maven-surefire-plugin:2.5:test (default-test) @ trinidad-demo ---
[INFO] Surefire report directory: <https://builds.apache.org/job/myfaces-trinidad-core-1.0/ws/trinidad-examples/trinidad-demo/target/surefire-reports>
-------------------------------------------------------
T E S T S
-------------------------------------------------------
There are no tests to run.
Results :
Tests run: 0, Failures: 0, Errors: 0, Skipped: 0
[JENKINS] Recording test results
[INFO] [INFO] Packaging webapp
[INFO] Assembling webapp [trinidad-demo] in [<https://builds.apache.org/job/myfaces-trinidad-core-1.0/ws/trinidad-examples/trinidad-demo/target/trinidad-demo-1.0.14-SNAPSHOT]>
[INFO] Processing war project
[INFO] Copying webapp resources [<https://builds.apache.org/job/myfaces-trinidad-core-1.0/ws/trinidad-examples/trinidad-demo/src/main/webapp]>
[INFO] --- maven-war-plugin:2.1.1:war (default-war) @ trinidad-demo ---
[INFO] Webapp assembled in [346 msecs]
[INFO] Building war: <https://builds.apache.org/job/myfaces-trinidad-core-1.0/ws/trinidad-examples/trinidad-demo/target/trinidad-demo-1.0.14-SNAPSHOT.war>
[INFO] WEB-INF/web.xml already added, skipping
[INFO]
[INFO] --- maven-xrts-plugin:1.2.6:generate-sources (default) @ trinidad-demo ---
[JENKINS] Re-archiving <https://builds.apache.org/job/myfaces-trinidad-core-1.0/ws/trinidad-examples/trinidad-demo/target/trinidad-demo-1.0.14-SNAPSHOT.war>
[JENKINS] Archiving <https://builds.apache.org/job/myfaces-trinidad-core-1.0/ws/trinidad-examples/trinidad-demo/target/trinidad-demo-1.0.14-SNAPSHOT-sources.jar> to /home/hudson/hudson/jobs/myfaces-trinidad-core-1.0/modules/org.apache.myfaces.trinidad$trinidad-demo/builds/2012-01-14_18-05-22/archive/org.apache.myfaces.trinidad/trinidad-demo/1.0.14-SNAPSHOT/trinidad-demo-1.0.14-SNAPSHOT-sources.jar
Jan 14, 2012 7:09:35 PM hudson.maven.ExecutedMojo <init>
WARNING: Failed to getClass for org.apache.maven.plugin.source.SourceJarMojo
[INFO] [INFO] META-INF already added, skipping
[INFO] META-INF/NOTICE already added, skipping
[INFO] META-INF/LICENSE already added, skipping
[INFO] META-INF already added, skipping
[INFO] META-INF already added, skipping
[INFO] META-INF/NOTICE already added, skipping
[INFO] META-INF/LICENSE already added, skipping
[INFO] META-INF already added, skipping
[INFO] META-INF/NOTICE already added, skipping
[INFO] META-INF/LICENSE already added, skipping
[INFO] Building jar: <https://builds.apache.org/job/myfaces-trinidad-core-1.0/ws/trinidad-examples/trinidad-demo/target/trinidad-demo-1.0.14-SNAPSHOT-sources.jar>
[INFO] META-INF already added, skipping
[INFO] META-INF/NOTICE already added, skipping
[INFO] META-INF/LICENSE already added, skipping
[INFO] META-INF already added, skipping
[INFO] META-INF already added, skipping
[INFO] META-INF/NOTICE already added, skipping
[INFO] META-INF/LICENSE already added, skipping
[INFO] META-INF already added, skipping
[INFO] [INFO] META-INF/NOTICE already added, skipping
--- maven-source-plugin:2.1.2:jar (attach-source) @ trinidad-demo ---[INFO] META-INF/LICENSE already added, skipping
[WARNING] Artifact org.apache.myfaces.trinidad:trinidad-demo:java-source:sources:1.0.14-SNAPSHOT already attached to project, ignoring duplicate
[INFO]
[INFO] --- maven-install-plugin:2.3:install (default-install) @ trinidad-demo ---
[INFO] Installing <https://builds.apache.org/job/myfaces-trinidad-core-1.0/ws/trinidad-examples/trinidad-demo/target/trinidad-demo-1.0.14-SNAPSHOT.war> to /home/jenkins/.m2/repository/org/apache/myfaces/trinidad/trinidad-demo/1.0.14-SNAPSHOT/trinidad-demo-1.0.14-SNAPSHOT.war
[INFO] Installing <https://builds.apache.org/job/myfaces-trinidad-core-1.0/ws/trinidad-examples/trinidad-demo/pom.xml> to /home/jenkins/.m2/repository/org/apache/myfaces/trinidad/trinidad-demo/1.0.14-SNAPSHOT/trinidad-demo-1.0.14-SNAPSHOT.pom
[INFO] Installing <https://builds.apache.org/job/myfaces-trinidad-core-1.0/ws/trinidad-examples/trinidad-demo/target/trinidad-demo-1.0.14-SNAPSHOT-sources.jar> to /home/jenkins/.m2/repository/org/apache/myfaces/trinidad/trinidad-demo/1.0.14-SNAPSHOT/trinidad-demo-1.0.14-SNAPSHOT-sources.jar
[INFO]
Downloading: https://repository.apache.org/content/repositories/snapshots/org/apache/myfaces/trinidad/trinidad-demo/1.0.14-SNAPSHOT/maven-metadata.xml
[INFO] --- maven-deploy-plugin:2.5:deploy (default-deploy) @ trinidad-demo ---
Downloaded: https://repository.apache.org/content/repositories/snapshots/org/apache/myfaces/trinidad/trinidad-demo/1.0.14-SNAPSHOT/maven-metadata.xml (1016 B at 8.3 KB/sec)
Uploading: https://repository.apache.org/content/repositories/snapshots/org/apache/myfaces/trinidad/trinidad-demo/1.0.14-SNAPSHOT/trinidad-demo-1.0.14-20120114.190941-799.war
Uploaded: https://repository.apache.org/content/repositories/snapshots/org/apache/myfaces/trinidad/trinidad-demo/1.0.14-SNAPSHOT/trinidad-demo-1.0.14-20120114.190941-799.war (7939 KB at 9657.2 KB/sec)
Uploading: https://repository.apache.org/content/repositories/snapshots/org/apache/myfaces/trinidad/trinidad-demo/1.0.14-SNAPSHOT/trinidad-demo-1.0.14-20120114.190941-799.pom
Uploaded: https://repository.apache.org/content/repositories/snapshots/org/apache/myfaces/trinidad/trinidad-demo/1.0.14-SNAPSHOT/trinidad-demo-1.0.14-20120114.190941-799.pom (3 KB at 9.0 KB/sec)
Downloading: https://repository.apache.org/content/repositories/snapshots/org/apache/myfaces/trinidad/trinidad-demo/maven-metadata.xml
Downloaded: https://repository.apache.org/content/repositories/snapshots/org/apache/myfaces/trinidad/trinidad-demo/maven-metadata.xml (7 KB at 40.7 KB/sec)
Uploading: https://repository.apache.org/content/repositories/snapshots/org/apache/myfaces/trinidad/trinidad-demo/1.0.14-SNAPSHOT/maven-metadata.xml
Uploaded: https://repository.apache.org/content/repositories/snapshots/org/apache/myfaces/trinidad/trinidad-demo/1.0.14-SNAPSHOT/maven-metadata.xml (1016 B at 18.7 KB/sec)
Uploading: https://repository.apache.org/content/repositories/snapshots/org/apache/myfaces/trinidad/trinidad-demo/maven-metadata.xml
Uploaded: https://repository.apache.org/content/repositories/snapshots/org/apache/myfaces/trinidad/trinidad-demo/maven-metadata.xml (7 KB at 122.0 KB/sec)
Uploading: https://repository.apache.org/content/repositories/snapshots/org/apache/myfaces/trinidad/trinidad-demo/1.0.14-SNAPSHOT/trinidad-demo-1.0.14-20120114.190941-799-sources.jar
Uploaded: https://repository.apache.org/content/repositories/snapshots/org/apache/myfaces/trinidad/trinidad-demo/1.0.14-SNAPSHOT/trinidad-demo-1.0.14-20120114.190941-799-sources.jar (133 KB at 332.2 KB/sec)
Uploading: https://repository.apache.org/content/repositories/snapshots/org/apache/myfaces/trinidad/trinidad-demo/1.0.14-SNAPSHOT/maven-metadata.xml
Uploaded: https://repository.apache.org/content/repositories/snapshots/org/apache/myfaces/trinidad/trinidad-demo/1.0.14-SNAPSHOT/maven-metadata.xml (1016 B at 11.1 KB/sec)
[JENKINS] Archiving <https://builds.apache.org/job/myfaces-trinidad-core-1.0/ws/trinidad-examples/trinidad-demo/target/trinidad-demo-1.0.14-SNAPSHOT.war> to /home/hudson/hudson/jobs/myfaces-trinidad-core-1.0/modules/org.apache.myfaces.trinidad$trinidad-demo/builds/2012-01-14_18-05-22/archive/org.apache.myfaces.trinidad/trinidad-demo/1.0.14-20120114.190941-799/trinidad-demo-1.0.14-20120114.190941-799.war
[JENKINS] Archiving <https://builds.apache.org/job/myfaces-trinidad-core-1.0/ws/trinidad-examples/trinidad-demo/target/trinidad-demo-1.0.14-SNAPSHOT-sources.jar> to /home/hudson/hudson/jobs/myfaces-trinidad-core-1.0/modules/org.apache.myfaces.trinidad$trinidad-demo/builds/2012-01-14_18-05-22/archive/org.apache.myfaces.trinidad/trinidad-demo/1.0.14-20120114.190941-799/trinidad-demo-1.0.14-20120114.190941-799-sources.jar
[INFO] ------------------------------------------------------------------------
[INFO] Reactor Summary:
[INFO]
[INFO] Apache MyFaces Trinidad ........................... SUCCESS [1:08.147s]
[INFO] Apache MyFaces Trinidad Build ..................... SUCCESS [20.876s]
[INFO] Apache MyFaces Trinidad API ....................... SUCCESS [3:07.125s]
[INFO] Apache MyFaces Trinidad Impl ...................... SUCCESS [12:37.248s]
[INFO] Apache MyFaces Trinidad Examples .................. SUCCESS [1:35.888s]
[INFO] Apache MyFaces Trinidad Blank Demo ................ SUCCESS [11:10.428s]
[INFO] Apache MyFaces Trinidad Demo ...................... SUCCESS [20:37.327s]
[INFO] ------------------------------------------------------------------------
[INFO] BUILD SUCCESS
[INFO] ------------------------------------------------------------------------
[INFO] Total time: 1:09:08.835s
[INFO] Finished at: Sat Jan 14 19:14:40 UTC 2012
[INFO] Final Memory: 42M/509M
[INFO] ------------------------------------------------------------------------
Waiting for Jenkins to finish collecting data
channel stopped
Maven RedeployPublished use remote ubuntu3 maven settings from : /home/jenkins/.m2/settings.xml
[ERROR] uniqueVersion == false is not anymore supported in maven 3
[INFO] Deployment in https://repository.apache.org/content/repositories/snapshots (id=,uniqueVersion=false)
Deploying the main artifact trinidad-1.0.14-SNAPSHOT.pom
Downloading: https://repository.apache.org/content/repositories/snapshots/org/apache/myfaces/trinidad/trinidad/1.0.14-SNAPSHOT/maven-metadata.xml
Downloaded: https://repository.apache.org/content/repositories/snapshots/org/apache/myfaces/trinidad/trinidad/1.0.14-SNAPSHOT/maven-metadata.xml (618 B at 2.9 KB/sec)
Uploading: https://repository.apache.org/content/repositories/snapshots/org/apache/myfaces/trinidad/trinidad/1.0.14-SNAPSHOT/trinidad-1.0.14-20120114.191500-857.pom
Uploading: https://repository.apache.org/content/repositories/snapshots/org/apache/myfaces/trinidad/trinidad/1.0.14-SNAPSHOT/trinidad-1.0.14-20120114.191500-857.pom
ERROR: Failed to deploy artifacts: Could not transfer artifact org.apache.myfaces.trinidad:trinidad:pom:1.0.14-20120114.191500-857 from/to (https://repository.apache.org/content/repositories/snapshots): Failed to transfer file: https://repository.apache.org/content/repositories/snapshots/org/apache/myfaces/trinidad/trinidad/1.0.14-SNAPSHOT/trinidad-1.0.14-20120114.191500-857.pom. Return code is: 401, ReasonPhrase:Unauthorized.
org.apache.maven.artifact.deployer.ArtifactDeploymentException: Failed to deploy artifacts: Could not transfer artifact org.apache.myfaces.trinidad:trinidad:pom:1.0.14-20120114.191500-857 from/to (https://repository.apache.org/content/repositories/snapshots): Failed to transfer file: https://repository.apache.org/content/repositories/snapshots/org/apache/myfaces/trinidad/trinidad/1.0.14-SNAPSHOT/trinidad-1.0.14-20120114.191500-857.pom. Return code is: 401, ReasonPhrase:Unauthorized.
at org.apache.maven.artifact.deployer.DefaultArtifactDeployer.deploy(DefaultArtifactDeployer.java:141)
at hudson.maven.reporters.MavenArtifactRecord.deploy(MavenArtifactRecord.java:182)
at hudson.maven.RedeployPublisher.perform(RedeployPublisher.java:158)
at hudson.tasks.BuildStepMonitor$1.perform(BuildStepMonitor.java:19)
at hudson.model.AbstractBuild$AbstractRunner.perform(AbstractBuild.java:697)
at hudson.model.AbstractBuild$AbstractRunner.performAllBuildSteps(AbstractBuild.java:672)
at hudson.maven.MavenModuleSetBuild$RunnerImpl.post2(MavenModuleSetBuild.java:997)
at hudson.model.AbstractBuild$AbstractRunner.post(AbstractBuild.java:619)
at hudson.model.Run.run(Run.java:1429)
at hudson.maven.MavenModuleSetBuild.run(MavenModuleSetBuild.java:481)
at hudson.model.ResourceController.execute(ResourceController.java:88)
at hudson.model.Executor.run(Executor.java:238)
Caused by: org.sonatype.aether.deployment.DeploymentException: Failed to deploy artifacts: Could not transfer artifact org.apache.myfaces.trinidad:trinidad:pom:1.0.14-20120114.191500-857 from/to (https://repository.apache.org/content/repositories/snapshots): Failed to transfer file: https://repository.apache.org/content/repositories/snapshots/org/apache/myfaces/trinidad/trinidad/1.0.14-SNAPSHOT/trinidad-1.0.14-20120114.191500-857.pom. Return code is: 401, ReasonPhrase:Unauthorized.
at org.sonatype.aether.impl.internal.DefaultDeployer.deploy(DefaultDeployer.java:280)
at org.sonatype.aether.impl.internal.DefaultDeployer.deploy(DefaultDeployer.java:211)
at org.sonatype.aether.impl.internal.DefaultRepositorySystem.deploy(DefaultRepositorySystem.java:443)
at org.apache.maven.artifact.deployer.DefaultArtifactDeployer.deploy(DefaultArtifactDeployer.java:137)
... 11 more
Caused by: org.sonatype.aether.transfer.ArtifactTransferException: Could not transfer artifact org.apache.myfaces.trinidad:trinidad:pom:1.0.14-20120114.191500-857 from/to (https://repository.apache.org/content/repositories/snapshots): Failed to transfer file: https://repository.apache.org/content/repositories/snapshots/org/apache/myfaces/trinidad/trinidad/1.0.14-SNAPSHOT/trinidad-1.0.14-20120114.191500-857.pom. Return code is: 401, ReasonPhrase:Unauthorized.
at org.sonatype.aether.connector.wagon.WagonRepositoryConnector$4.wrap(WagonRepositoryConnector.java:950)
at org.sonatype.aether.connector.wagon.WagonRepositoryConnector$4.wrap(WagonRepositoryConnector.java:940)
at org.sonatype.aether.connector.wagon.WagonRepositoryConnector$PutTask.run(WagonRepositoryConnector.java:837)
at org.sonatype.aether.connector.wagon.WagonRepositoryConnector.put(WagonRepositoryConnector.java:467)
at org.sonatype.aether.impl.internal.DefaultDeployer.deploy(DefaultDeployer.java:274)
... 14 more
Caused by: org.apache.maven.wagon.TransferFailedException: Failed to transfer file: https://repository.apache.org/content/repositories/snapshots/org/apache/myfaces/trinidad/trinidad/1.0.14-SNAPSHOT/trinidad-1.0.14-20120114.191500-857.pom. Return code is: 401, ReasonPhrase:Unauthorized.
at org.apache.maven.wagon.shared.http4.AbstractHttpClientWagon.put(AbstractHttpClientWagon.java:562)
at org.apache.maven.wagon.shared.http4.AbstractHttpClientWagon.put(AbstractHttpClientWagon.java:471)
at org.apache.maven.wagon.shared.http4.AbstractHttpClientWagon.put(AbstractHttpClientWagon.java:451)
at org.sonatype.aether.connector.wagon.WagonRepositoryConnector$PutTask.run(WagonRepositoryConnector.java:811)
... 16 more
[INFO] Deployment failed after 6.5 sec
Build step 'Deploy artifacts to Maven repository' changed build result to FAILURE
Build failed in Jenkins: myfaces-trinidad-core-1.0 #590
Posted by Apache Jenkins Server <je...@builds.apache.org>.
See <https://builds.apache.org/job/myfaces-trinidad-core-1.0/590/>
------------------------------------------
[...truncated 6322 lines...]
[INFO] Installing <https://builds.apache.org/job/myfaces-trinidad-core-1.0/ws/trinidad-examples/trinidad-blank/target/trinidad-blank-1.0.14-SNAPSHOT-sources.jar> to /home/jenkins/.m2/repository/org/apache/myfaces/trinidad/trinidad-blank/1.0.14-SNAPSHOT/trinidad-blank-1.0.14-SNAPSHOT-sources.jar
[INFO] --- maven-install-plugin:2.3:install (default-install) @ trinidad-blank ---
[INFO] Downloading: https://repository.apache.org/content/repositories/snapshots/org/apache/myfaces/trinidad/trinidad-blank/1.0.14-SNAPSHOT/maven-metadata.xml
[INFO] --- maven-deploy-plugin:2.5:deploy (default-deploy) @ trinidad-blank ---
Downloaded: https://repository.apache.org/content/repositories/snapshots/org/apache/myfaces/trinidad/trinidad-blank/1.0.14-SNAPSHOT/maven-metadata.xml (1017 B at 5.5 KB/sec)
Uploading: https://repository.apache.org/content/repositories/snapshots/org/apache/myfaces/trinidad/trinidad-blank/1.0.14-SNAPSHOT/trinidad-blank-1.0.14-20120117.210722-811.war
Uploaded: https://repository.apache.org/content/repositories/snapshots/org/apache/myfaces/trinidad/trinidad-blank/1.0.14-SNAPSHOT/trinidad-blank-1.0.14-20120117.210722-811.war (6661 KB at 2693.3 KB/sec)
Uploading: https://repository.apache.org/content/repositories/snapshots/org/apache/myfaces/trinidad/trinidad-blank/1.0.14-SNAPSHOT/trinidad-blank-1.0.14-20120117.210722-811.pom
Uploaded: https://repository.apache.org/content/repositories/snapshots/org/apache/myfaces/trinidad/trinidad-blank/1.0.14-SNAPSHOT/trinidad-blank-1.0.14-20120117.210722-811.pom (3 KB at 9.4 KB/sec)
Downloading: https://repository.apache.org/content/repositories/snapshots/org/apache/myfaces/trinidad/trinidad-blank/maven-metadata.xml
Downloaded: https://repository.apache.org/content/repositories/snapshots/org/apache/myfaces/trinidad/trinidad-blank/maven-metadata.xml (615 B at 3.6 KB/sec)
Uploading: https://repository.apache.org/content/repositories/snapshots/org/apache/myfaces/trinidad/trinidad-blank/1.0.14-SNAPSHOT/maven-metadata.xml
Uploaded: https://repository.apache.org/content/repositories/snapshots/org/apache/myfaces/trinidad/trinidad-blank/1.0.14-SNAPSHOT/maven-metadata.xml (1017 B at 5.7 KB/sec)
Uploading: https://repository.apache.org/content/repositories/snapshots/org/apache/myfaces/trinidad/trinidad-blank/maven-metadata.xml
Uploaded: https://repository.apache.org/content/repositories/snapshots/org/apache/myfaces/trinidad/trinidad-blank/maven-metadata.xml (615 B at 2.9 KB/sec)
Uploading: https://repository.apache.org/content/repositories/snapshots/org/apache/myfaces/trinidad/trinidad-blank/1.0.14-SNAPSHOT/trinidad-blank-1.0.14-20120117.210722-811-sources.jar
Uploaded: https://repository.apache.org/content/repositories/snapshots/org/apache/myfaces/trinidad/trinidad-blank/1.0.14-SNAPSHOT/trinidad-blank-1.0.14-20120117.210722-811-sources.jar (7 KB at 18.8 KB/sec)
Uploading: https://repository.apache.org/content/repositories/snapshots/org/apache/myfaces/trinidad/trinidad-blank/1.0.14-SNAPSHOT/maven-metadata.xml
Uploaded: https://repository.apache.org/content/repositories/snapshots/org/apache/myfaces/trinidad/trinidad-blank/1.0.14-SNAPSHOT/maven-metadata.xml (1017 B at 5.7 KB/sec)
[JENKINS] Archiving <https://builds.apache.org/job/myfaces-trinidad-core-1.0/ws/trinidad-examples/trinidad-blank/target/trinidad-blank-1.0.14-SNAPSHOT.war> to /home/hudson/hudson/jobs/myfaces-trinidad-core-1.0/modules/org.apache.myfaces.trinidad$trinidad-blank/builds/2012-01-17_20-51-53/archive/org.apache.myfaces.trinidad/trinidad-blank/1.0.14-20120117.210722-811/trinidad-blank-1.0.14-20120117.210722-811.war
[JENKINS] Archiving <https://builds.apache.org/job/myfaces-trinidad-core-1.0/ws/trinidad-examples/trinidad-blank/target/trinidad-blank-1.0.14-SNAPSHOT-sources.jar> to /home/hudson/hudson/jobs/myfaces-trinidad-core-1.0/modules/org.apache.myfaces.trinidad$trinidad-blank/builds/2012-01-17_20-51-53/archive/org.apache.myfaces.trinidad/trinidad-blank/1.0.14-20120117.210722-811/trinidad-blank-1.0.14-20120117.210722-811-sources.jar
[INFO] [INFO] Deleting file set: <https://builds.apache.org/job/myfaces-trinidad-core-1.0/ws/trinidad-examples/trinidad-demo/target> (included: [**], excluded: [])
[INFO] ------------------------------------------------------------------------
[INFO] Building Apache MyFaces Trinidad Demo 1.0.14-SNAPSHOT
[INFO] ------------------------------------------------------------------------
[INFO]
[INFO] --- maven-clean-plugin:2.3:clean (default-clean) @ trinidad-demo ---
[INFO]
[INFO] --- maven-xrts-plugin:1.2.6:generate-sources (default) @ trinidad-demo ---
[INFO]
[INFO] --- maven-remote-resources-plugin:1.0-alpha-6:process (default) @ trinidad-demo ---
[INFO] Using 'UTF-8' encoding to copy filtered resources.
[INFO]
[INFO] --- maven-resources-plugin:2.4.3:resources (default-resources) @ trinidad-demo ---
[INFO] Copying 0 resource
[INFO] Copying 2 resources
[INFO]
[INFO] --- maven-compiler-plugin:2.3.1:compile (default-compile) @ trinidad-demo ---
[INFO] Compiling 85 source files to <https://builds.apache.org/job/myfaces-trinidad-core-1.0/ws/trinidad-examples/trinidad-demo/target/classes>
[INFO]
[INFO] --- maven-xrts-plugin:1.2.6:generate-test-sources (default) @ trinidad-demo ---
[INFO] [INFO] Using 'UTF-8' encoding to copy filtered resources.
[INFO] skip non existing resourceDirectory <https://builds.apache.org/job/myfaces-trinidad-core-1.0/ws/trinidad-examples/trinidad-demo/src/test/resources>
[INFO] Copying 2 resources
[INFO] --- maven-resources-plugin:2.4.3:testResources (default-testResources) @ trinidad-demo ---
[INFO]
[INFO] --- maven-compiler-plugin:2.3.1:testCompile (default-testCompile) @ trinidad-demo ---
[INFO] Compiling 5 source files to <https://builds.apache.org/job/myfaces-trinidad-core-1.0/ws/trinidad-examples/trinidad-demo/target/test-classes>
[INFO] [INFO] Surefire report directory: <https://builds.apache.org/job/myfaces-trinidad-core-1.0/ws/trinidad-examples/trinidad-demo/target/surefire-reports>
-------------------------------------------------------
T E S T S
-------------------------------------------------------
There are no tests to run.
Results :
Tests run: 0, Failures: 0, Errors: 0, Skipped: 0
[INFO] --- maven-surefire-plugin:2.5:test (default-test) @ trinidad-demo ---
[JENKINS] Recording test results
[INFO] [INFO] Packaging webapp
[INFO] Assembling webapp [trinidad-demo] in [<https://builds.apache.org/job/myfaces-trinidad-core-1.0/ws/trinidad-examples/trinidad-demo/target/trinidad-demo-1.0.14-SNAPSHOT]>
[INFO] Processing war project
[INFO] Copying webapp resources [<https://builds.apache.org/job/myfaces-trinidad-core-1.0/ws/trinidad-examples/trinidad-demo/src/main/webapp]>
[INFO] --- maven-war-plugin:2.1.1:war (default-war) @ trinidad-demo ---
[INFO] Webapp assembled in [870 msecs]
[INFO] Building war: <https://builds.apache.org/job/myfaces-trinidad-core-1.0/ws/trinidad-examples/trinidad-demo/target/trinidad-demo-1.0.14-SNAPSHOT.war>
[INFO] WEB-INF/web.xml already added, skipping
[INFO]
[INFO] --- maven-xrts-plugin:1.2.6:generate-sources (default) @ trinidad-demo ---
[JENKINS] Archiving <https://builds.apache.org/job/myfaces-trinidad-core-1.0/ws/trinidad-examples/trinidad-demo/pom.xml> to /home/hudson/hudson/jobs/myfaces-trinidad-core-1.0/modules/org.apache.myfaces.trinidad$trinidad-demo/builds/2012-01-17_20-51-53/archive/org.apache.myfaces.trinidad/trinidad-demo/1.0.14-SNAPSHOT/trinidad-demo-1.0.14-SNAPSHOT.pom
[JENKINS] Archiving <https://builds.apache.org/job/myfaces-trinidad-core-1.0/ws/trinidad-examples/trinidad-demo/target/trinidad-demo-1.0.14-SNAPSHOT.war> to /home/hudson/hudson/jobs/myfaces-trinidad-core-1.0/modules/org.apache.myfaces.trinidad$trinidad-demo/builds/2012-01-17_20-51-53/archive/org.apache.myfaces.trinidad/trinidad-demo/1.0.14-SNAPSHOT/trinidad-demo-1.0.14-SNAPSHOT.war
Jan 17, 2012 9:09:50 PM hudson.maven.ExecutedMojo <init>
WARNING: Failed to getClass for org.apache.maven.plugin.source.SourceJarMojo
[INFO]
[INFO] --- maven-source-plugin:2.1.2:jar (attach-source) @ trinidad-demo ---
[INFO] META-INF already added, skipping
[INFO] META-INF already added, skipping
[INFO] META-INF/LICENSE already added, skipping
[INFO] META-INF/NOTICE already added, skipping
[INFO] Building jar: <https://builds.apache.org/job/myfaces-trinidad-core-1.0/ws/trinidad-examples/trinidad-demo/target/trinidad-demo-1.0.14-SNAPSHOT-sources.jar>
[INFO] META-INF already added, skipping
[INFO] META-INF already added, skipping
[INFO] META-INF/LICENSE already added, skipping
[INFO] META-INF/NOTICE already added, skipping
[INFO] [INFO] Installing <https://builds.apache.org/job/myfaces-trinidad-core-1.0/ws/trinidad-examples/trinidad-demo/target/trinidad-demo-1.0.14-SNAPSHOT.war> to /home/jenkins/.m2/repository/org/apache/myfaces/trinidad/trinidad-demo/1.0.14-SNAPSHOT/trinidad-demo-1.0.14-SNAPSHOT.war
[INFO] Installing <https://builds.apache.org/job/myfaces-trinidad-core-1.0/ws/trinidad-examples/trinidad-demo/pom.xml> to /home/jenkins/.m2/repository/org/apache/myfaces/trinidad/trinidad-demo/1.0.14-SNAPSHOT/trinidad-demo-1.0.14-SNAPSHOT.pom
[INFO] Installing <https://builds.apache.org/job/myfaces-trinidad-core-1.0/ws/trinidad-examples/trinidad-demo/target/trinidad-demo-1.0.14-SNAPSHOT-sources.jar> to /home/jenkins/.m2/repository/org/apache/myfaces/trinidad/trinidad-demo/1.0.14-SNAPSHOT/trinidad-demo-1.0.14-SNAPSHOT-sources.jar
[INFO] --- maven-install-plugin:2.3:install (default-install) @ trinidad-demo ---
[INFO]
[INFO] --- maven-xrts-plugin:1.2.6:generate-sources (default) @ trinidad-demo ---
[INFO]
[INFO] --- maven-remote-resources-plugin:1.0-alpha-6:process (default) @ trinidad-demo ---
[INFO] Using 'UTF-8' encoding to copy filtered resources.
[INFO] [INFO] Copying 0 resource
[INFO] Copying 2 resources
[INFO] Copying 2 resources
[INFO] --- maven-resources-plugin:2.4.3:resources (default-resources) @ trinidad-demo ---
[INFO] [INFO] Nothing to compile - all classes are up to date
[INFO] --- maven-compiler-plugin:2.3.1:compile (default-compile) @ trinidad-demo ---
[INFO]
[INFO] --- maven-xrts-plugin:1.2.6:generate-test-sources (default) @ trinidad-demo ---
[INFO] Using 'UTF-8' encoding to copy filtered resources.
[INFO] [INFO] skip non existing resourceDirectory <https://builds.apache.org/job/myfaces-trinidad-core-1.0/ws/trinidad-examples/trinidad-demo/src/test/resources>
[INFO] Copying 2 resources
[INFO] Copying 2 resources
[INFO] --- maven-resources-plugin:2.4.3:testResources (default-testResources) @ trinidad-demo ---
[INFO] [INFO] Nothing to compile - all classes are up to date
[INFO] --- maven-compiler-plugin:2.3.1:testCompile (default-testCompile) @ trinidad-demo ---
[INFO] [INFO] Surefire report directory: <https://builds.apache.org/job/myfaces-trinidad-core-1.0/ws/trinidad-examples/trinidad-demo/target/surefire-reports>
-------------------------------------------------------
T E S T S
-------------------------------------------------------
There are no tests to run.
Results :
Tests run: 0, Failures: 0, Errors: 0, Skipped: 0
[INFO] --- maven-surefire-plugin:2.5:test (default-test) @ trinidad-demo ---
[JENKINS] Recording test results
[INFO] [INFO] Packaging webapp
[INFO] Assembling webapp [trinidad-demo] in [<https://builds.apache.org/job/myfaces-trinidad-core-1.0/ws/trinidad-examples/trinidad-demo/target/trinidad-demo-1.0.14-SNAPSHOT]>
[INFO] Processing war project
[INFO] Copying webapp resources [<https://builds.apache.org/job/myfaces-trinidad-core-1.0/ws/trinidad-examples/trinidad-demo/src/main/webapp]>
[INFO] --- maven-war-plugin:2.1.1:war (default-war) @ trinidad-demo ---
[INFO] Webapp assembled in [260 msecs]
[INFO] Building war: <https://builds.apache.org/job/myfaces-trinidad-core-1.0/ws/trinidad-examples/trinidad-demo/target/trinidad-demo-1.0.14-SNAPSHOT.war>
[INFO] WEB-INF/web.xml already added, skipping
[INFO]
[INFO] --- maven-xrts-plugin:1.2.6:generate-sources (default) @ trinidad-demo ---
[JENKINS] Re-archiving <https://builds.apache.org/job/myfaces-trinidad-core-1.0/ws/trinidad-examples/trinidad-demo/target/trinidad-demo-1.0.14-SNAPSHOT.war>
[JENKINS] Archiving <https://builds.apache.org/job/myfaces-trinidad-core-1.0/ws/trinidad-examples/trinidad-demo/target/trinidad-demo-1.0.14-SNAPSHOT-sources.jar> to /home/hudson/hudson/jobs/myfaces-trinidad-core-1.0/modules/org.apache.myfaces.trinidad$trinidad-demo/builds/2012-01-17_20-51-53/archive/org.apache.myfaces.trinidad/trinidad-demo/1.0.14-SNAPSHOT/trinidad-demo-1.0.14-SNAPSHOT-sources.jar
Jan 17, 2012 9:10:59 PM hudson.maven.ExecutedMojo <init>
WARNING: Failed to getClass for org.apache.maven.plugin.source.SourceJarMojo
[INFO]
[INFO] --- maven-source-plugin:2.1.2:jar (attach-source) @ trinidad-demo ---
[INFO] META-INF already added, skipping
[INFO] META-INF/LICENSE already added, skipping
[INFO] META-INF/NOTICE already added, skipping
[INFO] META-INF already added, skipping
[INFO] META-INF already added, skipping
[INFO] META-INF/LICENSE already added, skipping
[INFO] META-INF/NOTICE already added, skipping
[INFO] META-INF already added, skipping
[INFO] META-INF/LICENSE already added, skipping
[INFO] META-INF/NOTICE already added, skipping
[WARNING] Artifact org.apache.myfaces.trinidad:trinidad-demo:java-source:sources:1.0.14-SNAPSHOT already attached to project, ignoring duplicate
[INFO] [INFO] Installing <https://builds.apache.org/job/myfaces-trinidad-core-1.0/ws/trinidad-examples/trinidad-demo/target/trinidad-demo-1.0.14-SNAPSHOT.war> to /home/jenkins/.m2/repository/org/apache/myfaces/trinidad/trinidad-demo/1.0.14-SNAPSHOT/trinidad-demo-1.0.14-SNAPSHOT.war
[INFO] Installing <https://builds.apache.org/job/myfaces-trinidad-core-1.0/ws/trinidad-examples/trinidad-demo/pom.xml> to /home/jenkins/.m2/repository/org/apache/myfaces/trinidad/trinidad-demo/1.0.14-SNAPSHOT/trinidad-demo-1.0.14-SNAPSHOT.pom
[INFO] Installing <https://builds.apache.org/job/myfaces-trinidad-core-1.0/ws/trinidad-examples/trinidad-demo/target/trinidad-demo-1.0.14-SNAPSHOT-sources.jar> to /home/jenkins/.m2/repository/org/apache/myfaces/trinidad/trinidad-demo/1.0.14-SNAPSHOT/trinidad-demo-1.0.14-SNAPSHOT-sources.jar
[INFO] --- maven-install-plugin:2.3:install (default-install) @ trinidad-demo ---
[INFO] Downloading: https://repository.apache.org/content/repositories/snapshots/org/apache/myfaces/trinidad/trinidad-demo/1.0.14-SNAPSHOT/maven-metadata.xml
[INFO] --- maven-deploy-plugin:2.5:deploy (default-deploy) @ trinidad-demo ---
Downloaded: https://repository.apache.org/content/repositories/snapshots/org/apache/myfaces/trinidad/trinidad-demo/1.0.14-SNAPSHOT/maven-metadata.xml (1016 B at 3.2 KB/sec)
Uploading: https://repository.apache.org/content/repositories/snapshots/org/apache/myfaces/trinidad/trinidad-demo/1.0.14-SNAPSHOT/trinidad-demo-1.0.14-20120117.211101-803.war
Uploaded: https://repository.apache.org/content/repositories/snapshots/org/apache/myfaces/trinidad/trinidad-demo/1.0.14-SNAPSHOT/trinidad-demo-1.0.14-20120117.211101-803.war (7938 KB at 1267.8 KB/sec)
Uploading: https://repository.apache.org/content/repositories/snapshots/org/apache/myfaces/trinidad/trinidad-demo/1.0.14-SNAPSHOT/trinidad-demo-1.0.14-20120117.211101-803.pom
Uploaded: https://repository.apache.org/content/repositories/snapshots/org/apache/myfaces/trinidad/trinidad-demo/1.0.14-SNAPSHOT/trinidad-demo-1.0.14-20120117.211101-803.pom (3 KB at 9.2 KB/sec)
Downloading: https://repository.apache.org/content/repositories/snapshots/org/apache/myfaces/trinidad/trinidad-demo/maven-metadata.xml
Downloaded: https://repository.apache.org/content/repositories/snapshots/org/apache/myfaces/trinidad/trinidad-demo/maven-metadata.xml (7 KB at 43.5 KB/sec)
Uploading: https://repository.apache.org/content/repositories/snapshots/org/apache/myfaces/trinidad/trinidad-demo/1.0.14-SNAPSHOT/maven-metadata.xml
Uploaded: https://repository.apache.org/content/repositories/snapshots/org/apache/myfaces/trinidad/trinidad-demo/1.0.14-SNAPSHOT/maven-metadata.xml (1016 B at 5.2 KB/sec)
Uploading: https://repository.apache.org/content/repositories/snapshots/org/apache/myfaces/trinidad/trinidad-demo/maven-metadata.xml
Uploaded: https://repository.apache.org/content/repositories/snapshots/org/apache/myfaces/trinidad/trinidad-demo/maven-metadata.xml (7 KB at 38.4 KB/sec)
Uploading: https://repository.apache.org/content/repositories/snapshots/org/apache/myfaces/trinidad/trinidad-demo/1.0.14-SNAPSHOT/trinidad-demo-1.0.14-20120117.211101-803-sources.jar
Uploaded: https://repository.apache.org/content/repositories/snapshots/org/apache/myfaces/trinidad/trinidad-demo/1.0.14-SNAPSHOT/trinidad-demo-1.0.14-20120117.211101-803-sources.jar (133 KB at 312.6 KB/sec)
Uploading: https://repository.apache.org/content/repositories/snapshots/org/apache/myfaces/trinidad/trinidad-demo/1.0.14-SNAPSHOT/maven-metadata.xml
Uploaded: https://repository.apache.org/content/repositories/snapshots/org/apache/myfaces/trinidad/trinidad-demo/1.0.14-SNAPSHOT/maven-metadata.xml (1016 B at 5.6 KB/sec)
[JENKINS] Archiving <https://builds.apache.org/job/myfaces-trinidad-core-1.0/ws/trinidad-examples/trinidad-demo/target/trinidad-demo-1.0.14-SNAPSHOT.war> to /home/hudson/hudson/jobs/myfaces-trinidad-core-1.0/modules/org.apache.myfaces.trinidad$trinidad-demo/builds/2012-01-17_20-51-53/archive/org.apache.myfaces.trinidad/trinidad-demo/1.0.14-20120117.211101-803/trinidad-demo-1.0.14-20120117.211101-803.war
[JENKINS] Archiving <https://builds.apache.org/job/myfaces-trinidad-core-1.0/ws/trinidad-examples/trinidad-demo/target/trinidad-demo-1.0.14-SNAPSHOT-sources.jar> to /home/hudson/hudson/jobs/myfaces-trinidad-core-1.0/modules/org.apache.myfaces.trinidad$trinidad-demo/builds/2012-01-17_20-51-53/archive/org.apache.myfaces.trinidad/trinidad-demo/1.0.14-20120117.211101-803/trinidad-demo-1.0.14-20120117.211101-803-sources.jar
[INFO] ------------------------------------------------------------------------
[INFO] Reactor Summary:
[INFO]
[INFO] Apache MyFaces Trinidad ........................... SUCCESS [1:02.570s]
[INFO] Apache MyFaces Trinidad Build ..................... SUCCESS [34.974s]
[INFO] Apache MyFaces Trinidad API ....................... SUCCESS [1:27.013s]
[INFO] Apache MyFaces Trinidad Impl ...................... SUCCESS [4:20.429s]
[INFO] Apache MyFaces Trinidad Examples .................. SUCCESS [4.099s]
[INFO] Apache MyFaces Trinidad Blank Demo ................ SUCCESS [1:49.988s]
[INFO] Apache MyFaces Trinidad Demo ...................... SUCCESS [2:25.556s]
[INFO] ------------------------------------------------------------------------
[INFO] BUILD SUCCESS
[INFO] ------------------------------------------------------------------------
[INFO] Total time: 19:49.795s
[INFO] Finished at: Tue Jan 17 21:12:05 UTC 2012
[INFO] Final Memory: 41M/313M
[INFO] ------------------------------------------------------------------------
channel stopped
Maven RedeployPublished use remote ubuntu1 maven settings from : /home/jenkins/.m2/settings.xml
[ERROR] uniqueVersion == false is not anymore supported in maven 3
[INFO] Deployment in https://repository.apache.org/content/repositories/snapshots (id=,uniqueVersion=false)
Deploying the main artifact trinidad-1.0.14-SNAPSHOT.pom
Downloading: https://repository.apache.org/content/repositories/snapshots/org/apache/myfaces/trinidad/trinidad/1.0.14-SNAPSHOT/maven-metadata.xml
Downloaded: https://repository.apache.org/content/repositories/snapshots/org/apache/myfaces/trinidad/trinidad/1.0.14-SNAPSHOT/maven-metadata.xml (618 B at 0.7 KB/sec)
Uploading: https://repository.apache.org/content/repositories/snapshots/org/apache/myfaces/trinidad/trinidad/1.0.14-SNAPSHOT/trinidad-1.0.14-20120117.211207-861.pom
Uploading: https://repository.apache.org/content/repositories/snapshots/org/apache/myfaces/trinidad/trinidad/1.0.14-SNAPSHOT/trinidad-1.0.14-20120117.211207-861.pom
ERROR: Failed to deploy artifacts: Could not transfer artifact org.apache.myfaces.trinidad:trinidad:pom:1.0.14-20120117.211207-861 from/to (https://repository.apache.org/content/repositories/snapshots): Failed to transfer file: https://repository.apache.org/content/repositories/snapshots/org/apache/myfaces/trinidad/trinidad/1.0.14-SNAPSHOT/trinidad-1.0.14-20120117.211207-861.pom. Return code is: 401, ReasonPhrase:Unauthorized.
org.apache.maven.artifact.deployer.ArtifactDeploymentException: Failed to deploy artifacts: Could not transfer artifact org.apache.myfaces.trinidad:trinidad:pom:1.0.14-20120117.211207-861 from/to (https://repository.apache.org/content/repositories/snapshots): Failed to transfer file: https://repository.apache.org/content/repositories/snapshots/org/apache/myfaces/trinidad/trinidad/1.0.14-SNAPSHOT/trinidad-1.0.14-20120117.211207-861.pom. Return code is: 401, ReasonPhrase:Unauthorized.
at org.apache.maven.artifact.deployer.DefaultArtifactDeployer.deploy(DefaultArtifactDeployer.java:141)
at hudson.maven.reporters.MavenArtifactRecord.deploy(MavenArtifactRecord.java:182)
at hudson.maven.RedeployPublisher.perform(RedeployPublisher.java:158)
at hudson.tasks.BuildStepMonitor$1.perform(BuildStepMonitor.java:19)
at hudson.model.AbstractBuild$AbstractRunner.perform(AbstractBuild.java:697)
at hudson.model.AbstractBuild$AbstractRunner.performAllBuildSteps(AbstractBuild.java:672)
at hudson.maven.MavenModuleSetBuild$RunnerImpl.post2(MavenModuleSetBuild.java:997)
at hudson.model.AbstractBuild$AbstractRunner.post(AbstractBuild.java:619)
at hudson.model.Run.run(Run.java:1429)
at hudson.maven.MavenModuleSetBuild.run(MavenModuleSetBuild.java:481)
at hudson.model.ResourceController.execute(ResourceController.java:88)
at hudson.model.Executor.run(Executor.java:238)
Caused by: org.sonatype.aether.deployment.DeploymentException: Failed to deploy artifacts: Could not transfer artifact org.apache.myfaces.trinidad:trinidad:pom:1.0.14-20120117.211207-861 from/to (https://repository.apache.org/content/repositories/snapshots): Failed to transfer file: https://repository.apache.org/content/repositories/snapshots/org/apache/myfaces/trinidad/trinidad/1.0.14-SNAPSHOT/trinidad-1.0.14-20120117.211207-861.pom. Return code is: 401, ReasonPhrase:Unauthorized.
at org.sonatype.aether.impl.internal.DefaultDeployer.deploy(DefaultDeployer.java:280)
at org.sonatype.aether.impl.internal.DefaultDeployer.deploy(DefaultDeployer.java:211)
at org.sonatype.aether.impl.internal.DefaultRepositorySystem.deploy(DefaultRepositorySystem.java:443)
at org.apache.maven.artifact.deployer.DefaultArtifactDeployer.deploy(DefaultArtifactDeployer.java:137)
... 11 more
Caused by: org.sonatype.aether.transfer.ArtifactTransferException: Could not transfer artifact org.apache.myfaces.trinidad:trinidad:pom:1.0.14-20120117.211207-861 from/to (https://repository.apache.org/content/repositories/snapshots): Failed to transfer file: https://repository.apache.org/content/repositories/snapshots/org/apache/myfaces/trinidad/trinidad/1.0.14-SNAPSHOT/trinidad-1.0.14-20120117.211207-861.pom. Return code is: 401, ReasonPhrase:Unauthorized.
at org.sonatype.aether.connector.wagon.WagonRepositoryConnector$4.wrap(WagonRepositoryConnector.java:950)
at org.sonatype.aether.connector.wagon.WagonRepositoryConnector$4.wrap(WagonRepositoryConnector.java:940)
at org.sonatype.aether.connector.wagon.WagonRepositoryConnector$PutTask.run(WagonRepositoryConnector.java:837)
at org.sonatype.aether.connector.wagon.WagonRepositoryConnector.put(WagonRepositoryConnector.java:467)
at org.sonatype.aether.impl.internal.DefaultDeployer.deploy(DefaultDeployer.java:274)
... 14 more
Caused by: org.apache.maven.wagon.TransferFailedException: Failed to transfer file: https://repository.apache.org/content/repositories/snapshots/org/apache/myfaces/trinidad/trinidad/1.0.14-SNAPSHOT/trinidad-1.0.14-20120117.211207-861.pom. Return code is: 401, ReasonPhrase:Unauthorized.
at org.apache.maven.wagon.shared.http4.AbstractHttpClientWagon.put(AbstractHttpClientWagon.java:562)
at org.apache.maven.wagon.shared.http4.AbstractHttpClientWagon.put(AbstractHttpClientWagon.java:471)
at org.apache.maven.wagon.shared.http4.AbstractHttpClientWagon.put(AbstractHttpClientWagon.java:451)
at org.sonatype.aether.connector.wagon.WagonRepositoryConnector$PutTask.run(WagonRepositoryConnector.java:811)
... 16 more
[INFO] Deployment failed after 1.1 sec
Build step 'Deploy artifacts to Maven repository' changed build result to FAILURE
Build failed in Jenkins: myfaces-trinidad-core-1.0 #589
Posted by Apache Jenkins Server <je...@builds.apache.org>.
See <https://builds.apache.org/job/myfaces-trinidad-core-1.0/589/>
------------------------------------------
[...truncated 6320 lines...]
[INFO] --- maven-install-plugin:2.3:install (default-install) @ trinidad-blank ---
[INFO] Installing <https://builds.apache.org/job/myfaces-trinidad-core-1.0/ws/trinidad-examples/trinidad-blank/pom.xml> to /home/jenkins/.m2/repository/org/apache/myfaces/trinidad/trinidad-blank/1.0.14-SNAPSHOT/trinidad-blank-1.0.14-SNAPSHOT.pom
[INFO] Installing <https://builds.apache.org/job/myfaces-trinidad-core-1.0/ws/trinidad-examples/trinidad-blank/target/trinidad-blank-1.0.14-SNAPSHOT-sources.jar> to /home/jenkins/.m2/repository/org/apache/myfaces/trinidad/trinidad-blank/1.0.14-SNAPSHOT/trinidad-blank-1.0.14-SNAPSHOT-sources.jar
[INFO] Downloading: https://repository.apache.org/content/repositories/snapshots/org/apache/myfaces/trinidad/trinidad-blank/1.0.14-SNAPSHOT/maven-metadata.xml
[INFO] --- maven-deploy-plugin:2.5:deploy (default-deploy) @ trinidad-blank ---
Downloaded: https://repository.apache.org/content/repositories/snapshots/org/apache/myfaces/trinidad/trinidad-blank/1.0.14-SNAPSHOT/maven-metadata.xml (1017 B at 2.2 KB/sec)
Uploading: https://repository.apache.org/content/repositories/snapshots/org/apache/myfaces/trinidad/trinidad-blank/1.0.14-SNAPSHOT/trinidad-blank-1.0.14-20120117.202005-810.war
Uploaded: https://repository.apache.org/content/repositories/snapshots/org/apache/myfaces/trinidad/trinidad-blank/1.0.14-SNAPSHOT/trinidad-blank-1.0.14-20120117.202005-810.war (6662 KB at 6755.9 KB/sec)
Uploading: https://repository.apache.org/content/repositories/snapshots/org/apache/myfaces/trinidad/trinidad-blank/1.0.14-SNAPSHOT/trinidad-blank-1.0.14-20120117.202005-810.pom
Uploaded: https://repository.apache.org/content/repositories/snapshots/org/apache/myfaces/trinidad/trinidad-blank/1.0.14-SNAPSHOT/trinidad-blank-1.0.14-20120117.202005-810.pom (3 KB at 6.3 KB/sec)
Downloading: https://repository.apache.org/content/repositories/snapshots/org/apache/myfaces/trinidad/trinidad-blank/maven-metadata.xml
Downloaded: https://repository.apache.org/content/repositories/snapshots/org/apache/myfaces/trinidad/trinidad-blank/maven-metadata.xml (615 B at 3.0 KB/sec)
Uploading: https://repository.apache.org/content/repositories/snapshots/org/apache/myfaces/trinidad/trinidad-blank/1.0.14-SNAPSHOT/maven-metadata.xml
Uploaded: https://repository.apache.org/content/repositories/snapshots/org/apache/myfaces/trinidad/trinidad-blank/1.0.14-SNAPSHOT/maven-metadata.xml (1017 B at 1.4 KB/sec)
Uploading: https://repository.apache.org/content/repositories/snapshots/org/apache/myfaces/trinidad/trinidad-blank/maven-metadata.xml
Uploaded: https://repository.apache.org/content/repositories/snapshots/org/apache/myfaces/trinidad/trinidad-blank/maven-metadata.xml (615 B at 1.1 KB/sec)
Uploading: https://repository.apache.org/content/repositories/snapshots/org/apache/myfaces/trinidad/trinidad-blank/1.0.14-SNAPSHOT/trinidad-blank-1.0.14-20120117.202005-810-sources.jar
Uploaded: https://repository.apache.org/content/repositories/snapshots/org/apache/myfaces/trinidad/trinidad-blank/1.0.14-SNAPSHOT/trinidad-blank-1.0.14-20120117.202005-810-sources.jar (7 KB at 32.4 KB/sec)
Uploading: https://repository.apache.org/content/repositories/snapshots/org/apache/myfaces/trinidad/trinidad-blank/1.0.14-SNAPSHOT/maven-metadata.xml
Uploaded: https://repository.apache.org/content/repositories/snapshots/org/apache/myfaces/trinidad/trinidad-blank/1.0.14-SNAPSHOT/maven-metadata.xml (1017 B at 12.0 KB/sec)
[JENKINS] Archiving <https://builds.apache.org/job/myfaces-trinidad-core-1.0/ws/trinidad-examples/trinidad-blank/target/trinidad-blank-1.0.14-SNAPSHOT.war> to /home/hudson/hudson/jobs/myfaces-trinidad-core-1.0/modules/org.apache.myfaces.trinidad$trinidad-blank/builds/2012-01-17_20-16-01/archive/org.apache.myfaces.trinidad/trinidad-blank/1.0.14-20120117.202005-810/trinidad-blank-1.0.14-20120117.202005-810.war
[JENKINS] Archiving <https://builds.apache.org/job/myfaces-trinidad-core-1.0/ws/trinidad-examples/trinidad-blank/target/trinidad-blank-1.0.14-SNAPSHOT-sources.jar> to /home/hudson/hudson/jobs/myfaces-trinidad-core-1.0/modules/org.apache.myfaces.trinidad$trinidad-blank/builds/2012-01-17_20-16-01/archive/org.apache.myfaces.trinidad/trinidad-blank/1.0.14-20120117.202005-810/trinidad-blank-1.0.14-20120117.202005-810-sources.jar
[INFO]
[INFO] ------------------------------------------------------------------------
[INFO] Building Apache MyFaces Trinidad Demo 1.0.14-SNAPSHOT
[INFO] ------------------------------------------------------------------------
[INFO] [INFO] Deleting file set: <https://builds.apache.org/job/myfaces-trinidad-core-1.0/ws/trinidad-examples/trinidad-demo/target> (included: [**], excluded: [])
[INFO] --- maven-clean-plugin:2.3:clean (default-clean) @ trinidad-demo ---
[INFO]
[INFO] --- maven-xrts-plugin:1.2.6:generate-sources (default) @ trinidad-demo ---
[INFO]
[INFO] --- maven-remote-resources-plugin:1.0-alpha-6:process (default) @ trinidad-demo ---
[INFO] [INFO] Using 'UTF-8' encoding to copy filtered resources.
[INFO] --- maven-resources-plugin:2.4.3:resources (default-resources) @ trinidad-demo ---
[INFO] Copying 0 resource
[INFO] Copying 2 resources
[INFO]
[INFO] --- maven-compiler-plugin:2.3.1:compile (default-compile) @ trinidad-demo ---
[INFO] Compiling 85 source files to <https://builds.apache.org/job/myfaces-trinidad-core-1.0/ws/trinidad-examples/trinidad-demo/target/classes>
[INFO]
[INFO] --- maven-xrts-plugin:1.2.6:generate-test-sources (default) @ trinidad-demo ---
[INFO] [INFO] Using 'UTF-8' encoding to copy filtered resources.
[INFO] skip non existing resourceDirectory <https://builds.apache.org/job/myfaces-trinidad-core-1.0/ws/trinidad-examples/trinidad-demo/src/test/resources>
[INFO] Copying 2 resources
[INFO] --- maven-resources-plugin:2.4.3:testResources (default-testResources) @ trinidad-demo ---
[INFO]
[INFO] --- maven-compiler-plugin:2.3.1:testCompile (default-testCompile) @ trinidad-demo ---
[INFO] Compiling 5 source files to <https://builds.apache.org/job/myfaces-trinidad-core-1.0/ws/trinidad-examples/trinidad-demo/target/test-classes>
[INFO]
[INFO] [INFO] Surefire report directory: <https://builds.apache.org/job/myfaces-trinidad-core-1.0/ws/trinidad-examples/trinidad-demo/target/surefire-reports>
--- maven-surefire-plugin:2.5:test (default-test) @ trinidad-demo ---
-------------------------------------------------------
T E S T S
-------------------------------------------------------
There are no tests to run.
Results :
Tests run: 0, Failures: 0, Errors: 0, Skipped: 0
[JENKINS] Recording test results
[INFO] [INFO] Packaging webapp
[INFO] Assembling webapp [trinidad-demo] in [<https://builds.apache.org/job/myfaces-trinidad-core-1.0/ws/trinidad-examples/trinidad-demo/target/trinidad-demo-1.0.14-SNAPSHOT]>
[INFO] Processing war project
[INFO] Copying webapp resources [<https://builds.apache.org/job/myfaces-trinidad-core-1.0/ws/trinidad-examples/trinidad-demo/src/main/webapp]>
[INFO] --- maven-war-plugin:2.1.1:war (default-war) @ trinidad-demo ---
[INFO] Webapp assembled in [675 msecs]
[INFO] Building war: <https://builds.apache.org/job/myfaces-trinidad-core-1.0/ws/trinidad-examples/trinidad-demo/target/trinidad-demo-1.0.14-SNAPSHOT.war>
[INFO] WEB-INF/web.xml already added, skipping
[INFO]
[INFO] --- maven-xrts-plugin:1.2.6:generate-sources (default) @ trinidad-demo ---
[JENKINS] Archiving <https://builds.apache.org/job/myfaces-trinidad-core-1.0/ws/trinidad-examples/trinidad-demo/pom.xml> to /home/hudson/hudson/jobs/myfaces-trinidad-core-1.0/modules/org.apache.myfaces.trinidad$trinidad-demo/builds/2012-01-17_20-16-01/archive/org.apache.myfaces.trinidad/trinidad-demo/1.0.14-SNAPSHOT/trinidad-demo-1.0.14-SNAPSHOT.pom
[JENKINS] Archiving <https://builds.apache.org/job/myfaces-trinidad-core-1.0/ws/trinidad-examples/trinidad-demo/target/trinidad-demo-1.0.14-SNAPSHOT.war> to /home/hudson/hudson/jobs/myfaces-trinidad-core-1.0/modules/org.apache.myfaces.trinidad$trinidad-demo/builds/2012-01-17_20-16-01/archive/org.apache.myfaces.trinidad/trinidad-demo/1.0.14-SNAPSHOT/trinidad-demo-1.0.14-SNAPSHOT.war
Jan 17, 2012 8:20:41 PM hudson.maven.ExecutedMojo <init>
WARNING: Failed to getClass for org.apache.maven.plugin.source.SourceJarMojo
[INFO]
[INFO] --- maven-source-plugin:2.1.2:jar (attach-source) @ trinidad-demo ---
[INFO] META-INF already added, skipping
[INFO] META-INF already added, skipping
[INFO] META-INF/NOTICE already added, skipping
[INFO] META-INF/LICENSE already added, skipping
[INFO] Building jar: <https://builds.apache.org/job/myfaces-trinidad-core-1.0/ws/trinidad-examples/trinidad-demo/target/trinidad-demo-1.0.14-SNAPSHOT-sources.jar>
[INFO] META-INF already added, skipping
[INFO] META-INF already added, skipping
[INFO] META-INF/NOTICE already added, skipping
[INFO] META-INF/LICENSE already added, skipping
[INFO] [INFO] Installing <https://builds.apache.org/job/myfaces-trinidad-core-1.0/ws/trinidad-examples/trinidad-demo/target/trinidad-demo-1.0.14-SNAPSHOT.war> to /home/jenkins/.m2/repository/org/apache/myfaces/trinidad/trinidad-demo/1.0.14-SNAPSHOT/trinidad-demo-1.0.14-SNAPSHOT.war
[INFO] --- maven-install-plugin:2.3:install (default-install) @ trinidad-demo ---
[INFO] Installing <https://builds.apache.org/job/myfaces-trinidad-core-1.0/ws/trinidad-examples/trinidad-demo/pom.xml> to /home/jenkins/.m2/repository/org/apache/myfaces/trinidad/trinidad-demo/1.0.14-SNAPSHOT/trinidad-demo-1.0.14-SNAPSHOT.pom
[INFO] Installing <https://builds.apache.org/job/myfaces-trinidad-core-1.0/ws/trinidad-examples/trinidad-demo/target/trinidad-demo-1.0.14-SNAPSHOT-sources.jar> to /home/jenkins/.m2/repository/org/apache/myfaces/trinidad/trinidad-demo/1.0.14-SNAPSHOT/trinidad-demo-1.0.14-SNAPSHOT-sources.jar
[INFO]
[INFO] --- maven-xrts-plugin:1.2.6:generate-sources (default) @ trinidad-demo ---
[INFO]
[INFO] --- maven-remote-resources-plugin:1.0-alpha-6:process (default) @ trinidad-demo ---
[INFO] [INFO] Using 'UTF-8' encoding to copy filtered resources.
[INFO] Copying 0 resource
[INFO] Copying 2 resources
[INFO] --- maven-resources-plugin:2.4.3:resources (default-resources) @ trinidad-demo ---
[INFO] Copying 2 resources
[INFO]
[INFO] --- maven-compiler-plugin:2.3.1:compile (default-compile) @ trinidad-demo ---
[INFO] Nothing to compile - all classes are up to date
[INFO]
[INFO] --- maven-xrts-plugin:1.2.6:generate-test-sources (default) @ trinidad-demo ---
[INFO] [INFO] Using 'UTF-8' encoding to copy filtered resources.
[INFO] skip non existing resourceDirectory <https://builds.apache.org/job/myfaces-trinidad-core-1.0/ws/trinidad-examples/trinidad-demo/src/test/resources>
[INFO] Copying 2 resources
[INFO] Copying 2 resources
[INFO] --- maven-resources-plugin:2.4.3:testResources (default-testResources) @ trinidad-demo ---
[INFO]
[INFO] --- maven-compiler-plugin:2.3.1:testCompile (default-testCompile) @ trinidad-demo ---
[INFO] Nothing to compile - all classes are up to date
[INFO]
[INFO] [INFO] Surefire report directory: <https://builds.apache.org/job/myfaces-trinidad-core-1.0/ws/trinidad-examples/trinidad-demo/target/surefire-reports>
--- maven-surefire-plugin:2.5:test (default-test) @ trinidad-demo ---
-------------------------------------------------------
T E S T S
-------------------------------------------------------
There are no tests to run.
Results :
Tests run: 0, Failures: 0, Errors: 0, Skipped: 0
[JENKINS] Recording test results
[INFO] [INFO] Packaging webapp
[INFO] Assembling webapp [trinidad-demo] in [<https://builds.apache.org/job/myfaces-trinidad-core-1.0/ws/trinidad-examples/trinidad-demo/target/trinidad-demo-1.0.14-SNAPSHOT]>
[INFO] Processing war project
[INFO] Copying webapp resources [<https://builds.apache.org/job/myfaces-trinidad-core-1.0/ws/trinidad-examples/trinidad-demo/src/main/webapp]>
[INFO] --- maven-war-plugin:2.1.1:war (default-war) @ trinidad-demo ---
[INFO] Webapp assembled in [245 msecs]
[INFO] Building war: <https://builds.apache.org/job/myfaces-trinidad-core-1.0/ws/trinidad-examples/trinidad-demo/target/trinidad-demo-1.0.14-SNAPSHOT.war>
[INFO] WEB-INF/web.xml already added, skipping
[INFO]
[INFO] --- maven-xrts-plugin:1.2.6:generate-sources (default) @ trinidad-demo ---
[JENKINS] Re-archiving <https://builds.apache.org/job/myfaces-trinidad-core-1.0/ws/trinidad-examples/trinidad-demo/target/trinidad-demo-1.0.14-SNAPSHOT.war>
[JENKINS] Archiving <https://builds.apache.org/job/myfaces-trinidad-core-1.0/ws/trinidad-examples/trinidad-demo/target/trinidad-demo-1.0.14-SNAPSHOT-sources.jar> to /home/hudson/hudson/jobs/myfaces-trinidad-core-1.0/modules/org.apache.myfaces.trinidad$trinidad-demo/builds/2012-01-17_20-16-01/archive/org.apache.myfaces.trinidad/trinidad-demo/1.0.14-SNAPSHOT/trinidad-demo-1.0.14-SNAPSHOT-sources.jar
Jan 17, 2012 8:21:04 PM hudson.maven.ExecutedMojo <init>
WARNING: Failed to getClass for org.apache.maven.plugin.source.SourceJarMojo
[INFO]
[INFO] --- maven-source-plugin:2.1.2:jar (attach-source) @ trinidad-demo ---
[INFO] META-INF already added, skipping
[INFO] META-INF/NOTICE already added, skipping
[INFO] META-INF/LICENSE already added, skipping
[INFO] META-INF already added, skipping
[INFO] META-INF already added, skipping
[INFO] META-INF/NOTICE already added, skipping
[INFO] META-INF/LICENSE already added, skipping
[INFO] META-INF already added, skipping
[INFO] META-INF/NOTICE already added, skipping
[INFO] META-INF/LICENSE already added, skipping
[WARNING] Artifact org.apache.myfaces.trinidad:trinidad-demo:java-source:sources:1.0.14-SNAPSHOT already attached to project, ignoring duplicate
[INFO] [INFO] Installing <https://builds.apache.org/job/myfaces-trinidad-core-1.0/ws/trinidad-examples/trinidad-demo/target/trinidad-demo-1.0.14-SNAPSHOT.war> to /home/jenkins/.m2/repository/org/apache/myfaces/trinidad/trinidad-demo/1.0.14-SNAPSHOT/trinidad-demo-1.0.14-SNAPSHOT.war
[INFO] --- maven-install-plugin:2.3:install (default-install) @ trinidad-demo ---
[INFO] Installing <https://builds.apache.org/job/myfaces-trinidad-core-1.0/ws/trinidad-examples/trinidad-demo/pom.xml> to /home/jenkins/.m2/repository/org/apache/myfaces/trinidad/trinidad-demo/1.0.14-SNAPSHOT/trinidad-demo-1.0.14-SNAPSHOT.pom
[INFO] Installing <https://builds.apache.org/job/myfaces-trinidad-core-1.0/ws/trinidad-examples/trinidad-demo/target/trinidad-demo-1.0.14-SNAPSHOT-sources.jar> to /home/jenkins/.m2/repository/org/apache/myfaces/trinidad/trinidad-demo/1.0.14-SNAPSHOT/trinidad-demo-1.0.14-SNAPSHOT-sources.jar
[INFO] Downloading: https://repository.apache.org/content/repositories/snapshots/org/apache/myfaces/trinidad/trinidad-demo/1.0.14-SNAPSHOT/maven-metadata.xml
[INFO] --- maven-deploy-plugin:2.5:deploy (default-deploy) @ trinidad-demo ---
Downloaded: https://repository.apache.org/content/repositories/snapshots/org/apache/myfaces/trinidad/trinidad-demo/1.0.14-SNAPSHOT/maven-metadata.xml (1016 B at 2.7 KB/sec)
Uploading: https://repository.apache.org/content/repositories/snapshots/org/apache/myfaces/trinidad/trinidad-demo/1.0.14-SNAPSHOT/trinidad-demo-1.0.14-20120117.202106-802.war
Uploaded: https://repository.apache.org/content/repositories/snapshots/org/apache/myfaces/trinidad/trinidad-demo/1.0.14-SNAPSHOT/trinidad-demo-1.0.14-20120117.202106-802.war (7939 KB at 5906.3 KB/sec)
Uploading: https://repository.apache.org/content/repositories/snapshots/org/apache/myfaces/trinidad/trinidad-demo/1.0.14-SNAPSHOT/trinidad-demo-1.0.14-20120117.202106-802.pom
Uploaded: https://repository.apache.org/content/repositories/snapshots/org/apache/myfaces/trinidad/trinidad-demo/1.0.14-SNAPSHOT/trinidad-demo-1.0.14-20120117.202106-802.pom (3 KB at 6.4 KB/sec)
Downloading: https://repository.apache.org/content/repositories/snapshots/org/apache/myfaces/trinidad/trinidad-demo/maven-metadata.xml
Downloaded: https://repository.apache.org/content/repositories/snapshots/org/apache/myfaces/trinidad/trinidad-demo/maven-metadata.xml (7 KB at 61.0 KB/sec)
Uploading: https://repository.apache.org/content/repositories/snapshots/org/apache/myfaces/trinidad/trinidad-demo/1.0.14-SNAPSHOT/maven-metadata.xml
Uploaded: https://repository.apache.org/content/repositories/snapshots/org/apache/myfaces/trinidad/trinidad-demo/1.0.14-SNAPSHOT/maven-metadata.xml (1016 B at 6.4 KB/sec)
Uploading: https://repository.apache.org/content/repositories/snapshots/org/apache/myfaces/trinidad/trinidad-demo/maven-metadata.xml
Uploaded: https://repository.apache.org/content/repositories/snapshots/org/apache/myfaces/trinidad/trinidad-demo/maven-metadata.xml (7 KB at 61.0 KB/sec)
Uploading: https://repository.apache.org/content/repositories/snapshots/org/apache/myfaces/trinidad/trinidad-demo/1.0.14-SNAPSHOT/trinidad-demo-1.0.14-20120117.202106-802-sources.jar
Uploaded: https://repository.apache.org/content/repositories/snapshots/org/apache/myfaces/trinidad/trinidad-demo/1.0.14-SNAPSHOT/trinidad-demo-1.0.14-20120117.202106-802-sources.jar (133 KB at 385.5 KB/sec)
Uploading: https://repository.apache.org/content/repositories/snapshots/org/apache/myfaces/trinidad/trinidad-demo/1.0.14-SNAPSHOT/maven-metadata.xml
Uploaded: https://repository.apache.org/content/repositories/snapshots/org/apache/myfaces/trinidad/trinidad-demo/1.0.14-SNAPSHOT/maven-metadata.xml (1016 B at 12.6 KB/sec)
[JENKINS] Archiving <https://builds.apache.org/job/myfaces-trinidad-core-1.0/ws/trinidad-examples/trinidad-demo/target/trinidad-demo-1.0.14-SNAPSHOT.war> to /home/hudson/hudson/jobs/myfaces-trinidad-core-1.0/modules/org.apache.myfaces.trinidad$trinidad-demo/builds/2012-01-17_20-16-01/archive/org.apache.myfaces.trinidad/trinidad-demo/1.0.14-20120117.202106-802/trinidad-demo-1.0.14-20120117.202106-802.war
[JENKINS] Archiving <https://builds.apache.org/job/myfaces-trinidad-core-1.0/ws/trinidad-examples/trinidad-demo/target/trinidad-demo-1.0.14-SNAPSHOT-sources.jar> to /home/hudson/hudson/jobs/myfaces-trinidad-core-1.0/modules/org.apache.myfaces.trinidad$trinidad-demo/builds/2012-01-17_20-16-01/archive/org.apache.myfaces.trinidad/trinidad-demo/1.0.14-20120117.202106-802/trinidad-demo-1.0.14-20120117.202106-802-sources.jar
[INFO] ------------------------------------------------------------------------
[INFO] Reactor Summary:
[INFO]
[INFO] Apache MyFaces Trinidad ........................... SUCCESS [16.590s]
[INFO] Apache MyFaces Trinidad Build ..................... SUCCESS [15.577s]
[INFO] Apache MyFaces Trinidad API ....................... SUCCESS [43.383s]
[INFO] Apache MyFaces Trinidad Impl ...................... SUCCESS [1:42.534s]
[INFO] Apache MyFaces Trinidad Examples .................. SUCCESS [9.133s]
[INFO] Apache MyFaces Trinidad Blank Demo ................ SUCCESS [33.794s]
[INFO] Apache MyFaces Trinidad Demo ...................... SUCCESS [52.330s]
[INFO] ------------------------------------------------------------------------
[INFO] BUILD SUCCESS
[INFO] ------------------------------------------------------------------------
[INFO] Total time: 5:22.636s
[INFO] Finished at: Tue Jan 17 20:21:27 UTC 2012
[INFO] Final Memory: 58M/535M
[INFO] ------------------------------------------------------------------------
channel stopped
Maven RedeployPublished use remote ubuntu3 maven settings from : /home/jenkins/.m2/settings.xml
[ERROR] uniqueVersion == false is not anymore supported in maven 3
[INFO] Deployment in https://repository.apache.org/content/repositories/snapshots (id=,uniqueVersion=false)
Deploying the main artifact trinidad-1.0.14-SNAPSHOT.pom
Downloading: https://repository.apache.org/content/repositories/snapshots/org/apache/myfaces/trinidad/trinidad/1.0.14-SNAPSHOT/maven-metadata.xml
Downloaded: https://repository.apache.org/content/repositories/snapshots/org/apache/myfaces/trinidad/trinidad/1.0.14-SNAPSHOT/maven-metadata.xml (618 B at 8.6 KB/sec)
Uploading: https://repository.apache.org/content/repositories/snapshots/org/apache/myfaces/trinidad/trinidad/1.0.14-SNAPSHOT/trinidad-1.0.14-20120117.202127-860.pom
Uploading: https://repository.apache.org/content/repositories/snapshots/org/apache/myfaces/trinidad/trinidad/1.0.14-SNAPSHOT/trinidad-1.0.14-20120117.202127-860.pom
ERROR: Failed to deploy artifacts: Could not transfer artifact org.apache.myfaces.trinidad:trinidad:pom:1.0.14-20120117.202127-860 from/to (https://repository.apache.org/content/repositories/snapshots): Failed to transfer file: https://repository.apache.org/content/repositories/snapshots/org/apache/myfaces/trinidad/trinidad/1.0.14-SNAPSHOT/trinidad-1.0.14-20120117.202127-860.pom. Return code is: 401, ReasonPhrase:Unauthorized.
org.apache.maven.artifact.deployer.ArtifactDeploymentException: Failed to deploy artifacts: Could not transfer artifact org.apache.myfaces.trinidad:trinidad:pom:1.0.14-20120117.202127-860 from/to (https://repository.apache.org/content/repositories/snapshots): Failed to transfer file: https://repository.apache.org/content/repositories/snapshots/org/apache/myfaces/trinidad/trinidad/1.0.14-SNAPSHOT/trinidad-1.0.14-20120117.202127-860.pom. Return code is: 401, ReasonPhrase:Unauthorized.
at org.apache.maven.artifact.deployer.DefaultArtifactDeployer.deploy(DefaultArtifactDeployer.java:141)
at hudson.maven.reporters.MavenArtifactRecord.deploy(MavenArtifactRecord.java:182)
at hudson.maven.RedeployPublisher.perform(RedeployPublisher.java:158)
at hudson.tasks.BuildStepMonitor$1.perform(BuildStepMonitor.java:19)
at hudson.model.AbstractBuild$AbstractRunner.perform(AbstractBuild.java:697)
at hudson.model.AbstractBuild$AbstractRunner.performAllBuildSteps(AbstractBuild.java:672)
at hudson.maven.MavenModuleSetBuild$RunnerImpl.post2(MavenModuleSetBuild.java:997)
at hudson.model.AbstractBuild$AbstractRunner.post(AbstractBuild.java:619)
at hudson.model.Run.run(Run.java:1429)
at hudson.maven.MavenModuleSetBuild.run(MavenModuleSetBuild.java:481)
at hudson.model.ResourceController.execute(ResourceController.java:88)
at hudson.model.Executor.run(Executor.java:238)
Caused by: org.sonatype.aether.deployment.DeploymentException: Failed to deploy artifacts: Could not transfer artifact org.apache.myfaces.trinidad:trinidad:pom:1.0.14-20120117.202127-860 from/to (https://repository.apache.org/content/repositories/snapshots): Failed to transfer file: https://repository.apache.org/content/repositories/snapshots/org/apache/myfaces/trinidad/trinidad/1.0.14-SNAPSHOT/trinidad-1.0.14-20120117.202127-860.pom. Return code is: 401, ReasonPhrase:Unauthorized.
at org.sonatype.aether.impl.internal.DefaultDeployer.deploy(DefaultDeployer.java:280)
at org.sonatype.aether.impl.internal.DefaultDeployer.deploy(DefaultDeployer.java:211)
at org.sonatype.aether.impl.internal.DefaultRepositorySystem.deploy(DefaultRepositorySystem.java:443)
at org.apache.maven.artifact.deployer.DefaultArtifactDeployer.deploy(DefaultArtifactDeployer.java:137)
... 11 more
Caused by: org.sonatype.aether.transfer.ArtifactTransferException: Could not transfer artifact org.apache.myfaces.trinidad:trinidad:pom:1.0.14-20120117.202127-860 from/to (https://repository.apache.org/content/repositories/snapshots): Failed to transfer file: https://repository.apache.org/content/repositories/snapshots/org/apache/myfaces/trinidad/trinidad/1.0.14-SNAPSHOT/trinidad-1.0.14-20120117.202127-860.pom. Return code is: 401, ReasonPhrase:Unauthorized.
at org.sonatype.aether.connector.wagon.WagonRepositoryConnector$4.wrap(WagonRepositoryConnector.java:950)
at org.sonatype.aether.connector.wagon.WagonRepositoryConnector$4.wrap(WagonRepositoryConnector.java:940)
at org.sonatype.aether.connector.wagon.WagonRepositoryConnector$PutTask.run(WagonRepositoryConnector.java:837)
at org.sonatype.aether.connector.wagon.WagonRepositoryConnector.put(WagonRepositoryConnector.java:467)
at org.sonatype.aether.impl.internal.DefaultDeployer.deploy(DefaultDeployer.java:274)
... 14 more
Caused by: org.apache.maven.wagon.TransferFailedException: Failed to transfer file: https://repository.apache.org/content/repositories/snapshots/org/apache/myfaces/trinidad/trinidad/1.0.14-SNAPSHOT/trinidad-1.0.14-20120117.202127-860.pom. Return code is: 401, ReasonPhrase:Unauthorized.
at org.apache.maven.wagon.shared.http4.AbstractHttpClientWagon.put(AbstractHttpClientWagon.java:562)
at org.apache.maven.wagon.shared.http4.AbstractHttpClientWagon.put(AbstractHttpClientWagon.java:471)
at org.apache.maven.wagon.shared.http4.AbstractHttpClientWagon.put(AbstractHttpClientWagon.java:451)
at org.sonatype.aether.connector.wagon.WagonRepositoryConnector$PutTask.run(WagonRepositoryConnector.java:811)
... 16 more
[INFO] Deployment failed after 0.33 sec
Build step 'Deploy artifacts to Maven repository' changed build result to FAILURE
Build failed in Jenkins: myfaces-trinidad-core-1.0 #588
Posted by Apache Jenkins Server <je...@builds.apache.org>.
See <https://builds.apache.org/job/myfaces-trinidad-core-1.0/588/>
------------------------------------------
[...truncated 6323 lines...]
Downloading: https://repository.apache.org/content/repositories/snapshots/org/apache/myfaces/trinidad/trinidad-blank/maven-metadata.xml
Downloaded: https://repository.apache.org/content/repositories/snapshots/org/apache/myfaces/trinidad/trinidad-blank/maven-metadata.xml (615 B at 4.4 KB/sec)
Uploading: https://repository.apache.org/content/repositories/snapshots/org/apache/myfaces/trinidad/trinidad-blank/1.0.14-SNAPSHOT/maven-metadata.xml
Uploaded: https://repository.apache.org/content/repositories/snapshots/org/apache/myfaces/trinidad/trinidad-blank/1.0.14-SNAPSHOT/maven-metadata.xml (1017 B at 3.9 KB/sec)
Uploading: https://repository.apache.org/content/repositories/snapshots/org/apache/myfaces/trinidad/trinidad-blank/maven-metadata.xml
Uploaded: https://repository.apache.org/content/repositories/snapshots/org/apache/myfaces/trinidad/trinidad-blank/maven-metadata.xml (615 B at 2.6 KB/sec)
Uploading: https://repository.apache.org/content/repositories/snapshots/org/apache/myfaces/trinidad/trinidad-blank/1.0.14-SNAPSHOT/trinidad-blank-1.0.14-20120117.001404-809-sources.jar
Uploaded: https://repository.apache.org/content/repositories/snapshots/org/apache/myfaces/trinidad/trinidad-blank/1.0.14-SNAPSHOT/trinidad-blank-1.0.14-20120117.001404-809-sources.jar (7 KB at 35.6 KB/sec)
Uploading: https://repository.apache.org/content/repositories/snapshots/org/apache/myfaces/trinidad/trinidad-blank/1.0.14-SNAPSHOT/maven-metadata.xml
Uploaded: https://repository.apache.org/content/repositories/snapshots/org/apache/myfaces/trinidad/trinidad-blank/1.0.14-SNAPSHOT/maven-metadata.xml (1017 B at 2.9 KB/sec)
[JENKINS] Archiving <https://builds.apache.org/job/myfaces-trinidad-core-1.0/ws/trinidad-examples/trinidad-blank/target/trinidad-blank-1.0.14-SNAPSHOT.war> to /home/hudson/hudson/jobs/myfaces-trinidad-core-1.0/modules/org.apache.myfaces.trinidad$trinidad-blank/builds/2012-01-17_00-05-38/archive/org.apache.myfaces.trinidad/trinidad-blank/1.0.14-20120117.001404-809/trinidad-blank-1.0.14-20120117.001404-809.war
[JENKINS] Archiving <https://builds.apache.org/job/myfaces-trinidad-core-1.0/ws/trinidad-examples/trinidad-blank/target/trinidad-blank-1.0.14-SNAPSHOT-sources.jar> to /home/hudson/hudson/jobs/myfaces-trinidad-core-1.0/modules/org.apache.myfaces.trinidad$trinidad-blank/builds/2012-01-17_00-05-38/archive/org.apache.myfaces.trinidad/trinidad-blank/1.0.14-20120117.001404-809/trinidad-blank-1.0.14-20120117.001404-809-sources.jar
[INFO] [INFO] Deleting file set: <https://builds.apache.org/job/myfaces-trinidad-core-1.0/ws/trinidad-examples/trinidad-demo/target> (included: [**], excluded: [])
[INFO] ------------------------------------------------------------------------
[INFO] Building Apache MyFaces Trinidad Demo 1.0.14-SNAPSHOT
[INFO] ------------------------------------------------------------------------
[INFO]
[INFO] --- maven-clean-plugin:2.3:clean (default-clean) @ trinidad-demo ---
[INFO]
[INFO] --- maven-xrts-plugin:1.2.6:generate-sources (default) @ trinidad-demo ---
[INFO]
[INFO] --- maven-remote-resources-plugin:1.0-alpha-6:process (default) @ trinidad-demo ---
[INFO] Using 'UTF-8' encoding to copy filtered resources.
[INFO] [INFO] Copying 0 resource
[INFO] Copying 2 resources
[INFO] --- maven-resources-plugin:2.4.3:resources (default-resources) @ trinidad-demo ---
[INFO]
[INFO] --- maven-compiler-plugin:2.3.1:compile (default-compile) @ trinidad-demo ---
[INFO] Compiling 85 source files to <https://builds.apache.org/job/myfaces-trinidad-core-1.0/ws/trinidad-examples/trinidad-demo/target/classes>
[INFO]
[INFO] --- maven-xrts-plugin:1.2.6:generate-test-sources (default) @ trinidad-demo ---
[INFO] [INFO] Using 'UTF-8' encoding to copy filtered resources.
[INFO] skip non existing resourceDirectory <https://builds.apache.org/job/myfaces-trinidad-core-1.0/ws/trinidad-examples/trinidad-demo/src/test/resources>
[INFO] Copying 2 resources
[INFO] --- maven-resources-plugin:2.4.3:testResources (default-testResources) @ trinidad-demo ---
[INFO] [INFO] Compiling 5 source files to <https://builds.apache.org/job/myfaces-trinidad-core-1.0/ws/trinidad-examples/trinidad-demo/target/test-classes>
[INFO] --- maven-compiler-plugin:2.3.1:testCompile (default-testCompile) @ trinidad-demo ---
[INFO] [INFO] Surefire report directory: <https://builds.apache.org/job/myfaces-trinidad-core-1.0/ws/trinidad-examples/trinidad-demo/target/surefire-reports>
-------------------------------------------------------
T E S T S
-------------------------------------------------------
There are no tests to run.
Results :
Tests run: 0, Failures: 0, Errors: 0, Skipped: 0
[INFO] --- maven-surefire-plugin:2.5:test (default-test) @ trinidad-demo ---
[JENKINS] Recording test results
[INFO] [INFO] Packaging webapp
[INFO] Assembling webapp [trinidad-demo] in [<https://builds.apache.org/job/myfaces-trinidad-core-1.0/ws/trinidad-examples/trinidad-demo/target/trinidad-demo-1.0.14-SNAPSHOT]>
[INFO] Processing war project
[INFO] Copying webapp resources [<https://builds.apache.org/job/myfaces-trinidad-core-1.0/ws/trinidad-examples/trinidad-demo/src/main/webapp]>
[INFO] --- maven-war-plugin:2.1.1:war (default-war) @ trinidad-demo ---
[INFO] Webapp assembled in [472 msecs]
[INFO] Building war: <https://builds.apache.org/job/myfaces-trinidad-core-1.0/ws/trinidad-examples/trinidad-demo/target/trinidad-demo-1.0.14-SNAPSHOT.war>
[INFO] WEB-INF/web.xml already added, skipping
[INFO]
[INFO] --- maven-xrts-plugin:1.2.6:generate-sources (default) @ trinidad-demo ---
[JENKINS] Archiving <https://builds.apache.org/job/myfaces-trinidad-core-1.0/ws/trinidad-examples/trinidad-demo/pom.xml> to /home/hudson/hudson/jobs/myfaces-trinidad-core-1.0/modules/org.apache.myfaces.trinidad$trinidad-demo/builds/2012-01-17_00-05-38/archive/org.apache.myfaces.trinidad/trinidad-demo/1.0.14-SNAPSHOT/trinidad-demo-1.0.14-SNAPSHOT.pom
[JENKINS] Archiving <https://builds.apache.org/job/myfaces-trinidad-core-1.0/ws/trinidad-examples/trinidad-demo/target/trinidad-demo-1.0.14-SNAPSHOT.war> to /home/hudson/hudson/jobs/myfaces-trinidad-core-1.0/modules/org.apache.myfaces.trinidad$trinidad-demo/builds/2012-01-17_00-05-38/archive/org.apache.myfaces.trinidad/trinidad-demo/1.0.14-SNAPSHOT/trinidad-demo-1.0.14-SNAPSHOT.war
Jan 17, 2012 12:15:37 AM hudson.maven.ExecutedMojo <init>
WARNING: Failed to getClass for org.apache.maven.plugin.source.SourceJarMojo
[INFO]
[INFO] --- maven-source-plugin:2.1.2:jar (attach-source) @ trinidad-demo ---
[INFO] META-INF already added, skipping
[INFO] META-INF already added, skipping
[INFO] META-INF/NOTICE already added, skipping
[INFO] META-INF/LICENSE already added, skipping
[INFO] Building jar: <https://builds.apache.org/job/myfaces-trinidad-core-1.0/ws/trinidad-examples/trinidad-demo/target/trinidad-demo-1.0.14-SNAPSHOT-sources.jar>
[INFO] META-INF already added, skipping
[INFO] META-INF already added, skipping
[INFO] META-INF/NOTICE already added, skipping
[INFO] META-INF/LICENSE already added, skipping
[INFO] [INFO] Installing <https://builds.apache.org/job/myfaces-trinidad-core-1.0/ws/trinidad-examples/trinidad-demo/target/trinidad-demo-1.0.14-SNAPSHOT.war> to /home/jenkins/.m2/repository/org/apache/myfaces/trinidad/trinidad-demo/1.0.14-SNAPSHOT/trinidad-demo-1.0.14-SNAPSHOT.war
[INFO] Installing <https://builds.apache.org/job/myfaces-trinidad-core-1.0/ws/trinidad-examples/trinidad-demo/pom.xml> to /home/jenkins/.m2/repository/org/apache/myfaces/trinidad/trinidad-demo/1.0.14-SNAPSHOT/trinidad-demo-1.0.14-SNAPSHOT.pom
[INFO] --- maven-install-plugin:2.3:install (default-install) @ trinidad-demo ---[INFO] Installing <https://builds.apache.org/job/myfaces-trinidad-core-1.0/ws/trinidad-examples/trinidad-demo/target/trinidad-demo-1.0.14-SNAPSHOT-sources.jar> to /home/jenkins/.m2/repository/org/apache/myfaces/trinidad/trinidad-demo/1.0.14-SNAPSHOT/trinidad-demo-1.0.14-SNAPSHOT-sources.jar
[INFO]
[INFO] --- maven-xrts-plugin:1.2.6:generate-sources (default) @ trinidad-demo ---
[INFO]
[INFO] --- maven-remote-resources-plugin:1.0-alpha-6:process (default) @ trinidad-demo ---
[INFO] [INFO] Using 'UTF-8' encoding to copy filtered resources.
[INFO] Copying 0 resource
[INFO] Copying 2 resources
[INFO] Copying 2 resources
[INFO] --- maven-resources-plugin:2.4.3:resources (default-resources) @ trinidad-demo ---
[INFO] [INFO] Nothing to compile - all classes are up to date
[INFO] --- maven-compiler-plugin:2.3.1:compile (default-compile) @ trinidad-demo ---
[INFO]
[INFO] --- maven-xrts-plugin:1.2.6:generate-test-sources (default) @ trinidad-demo ---
[INFO] [INFO] Using 'UTF-8' encoding to copy filtered resources.
[INFO] skip non existing resourceDirectory <https://builds.apache.org/job/myfaces-trinidad-core-1.0/ws/trinidad-examples/trinidad-demo/src/test/resources>
[INFO] Copying 2 resources
[INFO] Copying 2 resources
[INFO] --- maven-resources-plugin:2.4.3:testResources (default-testResources) @ trinidad-demo ---
[INFO] [INFO] Nothing to compile - all classes are up to date
[INFO] --- maven-compiler-plugin:2.3.1:testCompile (default-testCompile) @ trinidad-demo ---
[INFO] [INFO] Surefire report directory: <https://builds.apache.org/job/myfaces-trinidad-core-1.0/ws/trinidad-examples/trinidad-demo/target/surefire-reports>
-------------------------------------------------------
T E S T S
-------------------------------------------------------
There are no tests to run.
Results :
Tests run: 0, Failures: 0, Errors: 0, Skipped: 0
[INFO] --- maven-surefire-plugin:2.5:test (default-test) @ trinidad-demo ---
[JENKINS] Recording test results
[INFO] Packaging webapp
[INFO] Assembling webapp [trinidad-demo] in [<https://builds.apache.org/job/myfaces-trinidad-core-1.0/ws/trinidad-examples/trinidad-demo/target/trinidad-demo-1.0.14-SNAPSHOT]>
[INFO] Processing war project
[INFO] Copying webapp resources [<https://builds.apache.org/job/myfaces-trinidad-core-1.0/ws/trinidad-examples/trinidad-demo/src/main/webapp]>
[INFO] [INFO] Webapp assembled in [312 msecs]
[INFO] --- maven-war-plugin:2.1.1:war (default-war) @ trinidad-demo ---
[INFO] Building war: <https://builds.apache.org/job/myfaces-trinidad-core-1.0/ws/trinidad-examples/trinidad-demo/target/trinidad-demo-1.0.14-SNAPSHOT.war>
[INFO] WEB-INF/web.xml already added, skipping
[INFO]
[INFO] --- maven-xrts-plugin:1.2.6:generate-sources (default) @ trinidad-demo ---
[JENKINS] Re-archiving <https://builds.apache.org/job/myfaces-trinidad-core-1.0/ws/trinidad-examples/trinidad-demo/target/trinidad-demo-1.0.14-SNAPSHOT.war>
[JENKINS] Archiving <https://builds.apache.org/job/myfaces-trinidad-core-1.0/ws/trinidad-examples/trinidad-demo/target/trinidad-demo-1.0.14-SNAPSHOT-sources.jar> to /home/hudson/hudson/jobs/myfaces-trinidad-core-1.0/modules/org.apache.myfaces.trinidad$trinidad-demo/builds/2012-01-17_00-05-38/archive/org.apache.myfaces.trinidad/trinidad-demo/1.0.14-SNAPSHOT/trinidad-demo-1.0.14-SNAPSHOT-sources.jar
Jan 17, 2012 12:16:27 AM hudson.maven.ExecutedMojo <init>
WARNING: Failed to getClass for org.apache.maven.plugin.source.SourceJarMojo
[INFO]
[INFO] --- maven-source-plugin:2.1.2:jar (attach-source) @ trinidad-demo ---
[INFO] META-INF already added, skipping
[INFO] META-INF/NOTICE already added, skipping
[INFO] META-INF/LICENSE already added, skipping
[INFO] META-INF already added, skipping
[INFO] META-INF already added, skipping
[INFO] META-INF/NOTICE already added, skipping
[INFO] META-INF/LICENSE already added, skipping
[INFO] META-INF already added, skipping
[INFO] META-INF/NOTICE already added, skipping
[INFO] META-INF/LICENSE already added, skipping
[INFO] Building jar: <https://builds.apache.org/job/myfaces-trinidad-core-1.0/ws/trinidad-examples/trinidad-demo/target/trinidad-demo-1.0.14-SNAPSHOT-sources.jar>
[INFO] META-INF already added, skipping
[INFO] META-INF/NOTICE already added, skipping
[INFO] META-INF/LICENSE already added, skipping
[INFO] META-INF already added, skipping
[INFO] META-INF already added, skipping
[INFO] META-INF/NOTICE already added, skipping
[INFO] META-INF/LICENSE already added, skipping
[INFO] META-INF already added, skipping
[INFO] META-INF/NOTICE already added, skipping
[INFO] META-INF/LICENSE already added, skipping
[WARNING] Artifact org.apache.myfaces.trinidad:trinidad-demo:java-source:sources:1.0.14-SNAPSHOT already attached to project, ignoring duplicate
[INFO] [INFO] Installing <https://builds.apache.org/job/myfaces-trinidad-core-1.0/ws/trinidad-examples/trinidad-demo/target/trinidad-demo-1.0.14-SNAPSHOT.war> to /home/jenkins/.m2/repository/org/apache/myfaces/trinidad/trinidad-demo/1.0.14-SNAPSHOT/trinidad-demo-1.0.14-SNAPSHOT.war
[INFO] Installing <https://builds.apache.org/job/myfaces-trinidad-core-1.0/ws/trinidad-examples/trinidad-demo/pom.xml> to /home/jenkins/.m2/repository/org/apache/myfaces/trinidad/trinidad-demo/1.0.14-SNAPSHOT/trinidad-demo-1.0.14-SNAPSHOT.pom
[INFO] Installing <https://builds.apache.org/job/myfaces-trinidad-core-1.0/ws/trinidad-examples/trinidad-demo/target/trinidad-demo-1.0.14-SNAPSHOT-sources.jar> to /home/jenkins/.m2/repository/org/apache/myfaces/trinidad/trinidad-demo/1.0.14-SNAPSHOT/trinidad-demo-1.0.14-SNAPSHOT-sources.jar
[INFO] --- maven-install-plugin:2.3:install (default-install) @ trinidad-demo ---
[INFO] Downloading: https://repository.apache.org/content/repositories/snapshots/org/apache/myfaces/trinidad/trinidad-demo/1.0.14-SNAPSHOT/maven-metadata.xml
[INFO] --- maven-deploy-plugin:2.5:deploy (default-deploy) @ trinidad-demo ---
Downloaded: https://repository.apache.org/content/repositories/snapshots/org/apache/myfaces/trinidad/trinidad-demo/1.0.14-SNAPSHOT/maven-metadata.xml (1016 B at 1.7 KB/sec)
Uploading: https://repository.apache.org/content/repositories/snapshots/org/apache/myfaces/trinidad/trinidad-demo/1.0.14-SNAPSHOT/trinidad-demo-1.0.14-20120117.001630-801.war
Uploaded: https://repository.apache.org/content/repositories/snapshots/org/apache/myfaces/trinidad/trinidad-demo/1.0.14-SNAPSHOT/trinidad-demo-1.0.14-20120117.001630-801.war (7934 KB at 1389.0 KB/sec)
Uploading: https://repository.apache.org/content/repositories/snapshots/org/apache/myfaces/trinidad/trinidad-demo/1.0.14-SNAPSHOT/trinidad-demo-1.0.14-20120117.001630-801.pom
Uploaded: https://repository.apache.org/content/repositories/snapshots/org/apache/myfaces/trinidad/trinidad-demo/1.0.14-SNAPSHOT/trinidad-demo-1.0.14-20120117.001630-801.pom (3 KB at 9.9 KB/sec)
Downloading: https://repository.apache.org/content/repositories/snapshots/org/apache/myfaces/trinidad/trinidad-demo/maven-metadata.xml
Downloaded: https://repository.apache.org/content/repositories/snapshots/org/apache/myfaces/trinidad/trinidad-demo/maven-metadata.xml (7 KB at 54.3 KB/sec)
Uploading: https://repository.apache.org/content/repositories/snapshots/org/apache/myfaces/trinidad/trinidad-demo/1.0.14-SNAPSHOT/maven-metadata.xml
Uploaded: https://repository.apache.org/content/repositories/snapshots/org/apache/myfaces/trinidad/trinidad-demo/1.0.14-SNAPSHOT/maven-metadata.xml (1016 B at 3.5 KB/sec)
Uploading: https://repository.apache.org/content/repositories/snapshots/org/apache/myfaces/trinidad/trinidad-demo/maven-metadata.xml
Uploaded: https://repository.apache.org/content/repositories/snapshots/org/apache/myfaces/trinidad/trinidad-demo/maven-metadata.xml (7 KB at 17.7 KB/sec)
Uploading: https://repository.apache.org/content/repositories/snapshots/org/apache/myfaces/trinidad/trinidad-demo/1.0.14-SNAPSHOT/trinidad-demo-1.0.14-20120117.001630-801-sources.jar
Uploaded: https://repository.apache.org/content/repositories/snapshots/org/apache/myfaces/trinidad/trinidad-demo/1.0.14-SNAPSHOT/trinidad-demo-1.0.14-20120117.001630-801-sources.jar (133 KB at 289.3 KB/sec)
Uploading: https://repository.apache.org/content/repositories/snapshots/org/apache/myfaces/trinidad/trinidad-demo/1.0.14-SNAPSHOT/maven-metadata.xml
Uploaded: https://repository.apache.org/content/repositories/snapshots/org/apache/myfaces/trinidad/trinidad-demo/1.0.14-SNAPSHOT/maven-metadata.xml (1016 B at 5.5 KB/sec)
[JENKINS] Archiving <https://builds.apache.org/job/myfaces-trinidad-core-1.0/ws/trinidad-examples/trinidad-demo/target/trinidad-demo-1.0.14-SNAPSHOT.war> to /home/hudson/hudson/jobs/myfaces-trinidad-core-1.0/modules/org.apache.myfaces.trinidad$trinidad-demo/builds/2012-01-17_00-05-38/archive/org.apache.myfaces.trinidad/trinidad-demo/1.0.14-20120117.001630-801/trinidad-demo-1.0.14-20120117.001630-801.war
[JENKINS] Archiving <https://builds.apache.org/job/myfaces-trinidad-core-1.0/ws/trinidad-examples/trinidad-demo/target/trinidad-demo-1.0.14-SNAPSHOT-sources.jar> to /home/hudson/hudson/jobs/myfaces-trinidad-core-1.0/modules/org.apache.myfaces.trinidad$trinidad-demo/builds/2012-01-17_00-05-38/archive/org.apache.myfaces.trinidad/trinidad-demo/1.0.14-20120117.001630-801/trinidad-demo-1.0.14-20120117.001630-801-sources.jar
[INFO] ------------------------------------------------------------------------
[INFO] Reactor Summary:
[INFO]
[INFO] Apache MyFaces Trinidad ........................... SUCCESS [41.881s]
[INFO] Apache MyFaces Trinidad Build ..................... SUCCESS [26.356s]
[INFO] Apache MyFaces Trinidad API ....................... SUCCESS [1:10.903s]
[INFO] Apache MyFaces Trinidad Impl ...................... SUCCESS [3:05.261s]
[INFO] Apache MyFaces Trinidad Examples .................. SUCCESS [5.295s]
[INFO] Apache MyFaces Trinidad Blank Demo ................ SUCCESS [1:31.260s]
[INFO] Apache MyFaces Trinidad Demo ...................... SUCCESS [1:50.456s]
[INFO] ------------------------------------------------------------------------
[INFO] BUILD SUCCESS
[INFO] ------------------------------------------------------------------------
[INFO] Total time: 11:30.930s
[INFO] Finished at: Tue Jan 17 00:17:20 UTC 2012
[INFO] Final Memory: 51M/383M
[INFO] ------------------------------------------------------------------------
channel stopped
Maven RedeployPublished use remote ubuntu5 maven settings from : /home/jenkins/.m2/settings.xml
[ERROR] uniqueVersion == false is not anymore supported in maven 3
[INFO] Deployment in https://repository.apache.org/content/repositories/snapshots (id=,uniqueVersion=false)
Deploying the main artifact trinidad-1.0.14-SNAPSHOT.pom
Downloading: https://repository.apache.org/content/repositories/snapshots/org/apache/myfaces/trinidad/trinidad/1.0.14-SNAPSHOT/maven-metadata.xml
Downloaded: https://repository.apache.org/content/repositories/snapshots/org/apache/myfaces/trinidad/trinidad/1.0.14-SNAPSHOT/maven-metadata.xml (618 B at 0.8 KB/sec)
Uploading: https://repository.apache.org/content/repositories/snapshots/org/apache/myfaces/trinidad/trinidad/1.0.14-SNAPSHOT/trinidad-1.0.14-20120117.001722-859.pom
Uploading: https://repository.apache.org/content/repositories/snapshots/org/apache/myfaces/trinidad/trinidad/1.0.14-SNAPSHOT/trinidad-1.0.14-20120117.001722-859.pom
ERROR: Failed to deploy artifacts: Could not transfer artifact org.apache.myfaces.trinidad:trinidad:pom:1.0.14-20120117.001722-859 from/to (https://repository.apache.org/content/repositories/snapshots): Failed to transfer file: https://repository.apache.org/content/repositories/snapshots/org/apache/myfaces/trinidad/trinidad/1.0.14-SNAPSHOT/trinidad-1.0.14-20120117.001722-859.pom. Return code is: 401, ReasonPhrase:Unauthorized.
org.apache.maven.artifact.deployer.ArtifactDeploymentException: Failed to deploy artifacts: Could not transfer artifact org.apache.myfaces.trinidad:trinidad:pom:1.0.14-20120117.001722-859 from/to (https://repository.apache.org/content/repositories/snapshots): Failed to transfer file: https://repository.apache.org/content/repositories/snapshots/org/apache/myfaces/trinidad/trinidad/1.0.14-SNAPSHOT/trinidad-1.0.14-20120117.001722-859.pom. Return code is: 401, ReasonPhrase:Unauthorized.
at org.apache.maven.artifact.deployer.DefaultArtifactDeployer.deploy(DefaultArtifactDeployer.java:141)
at hudson.maven.reporters.MavenArtifactRecord.deploy(MavenArtifactRecord.java:182)
at hudson.maven.RedeployPublisher.perform(RedeployPublisher.java:158)
at hudson.tasks.BuildStepMonitor$1.perform(BuildStepMonitor.java:19)
at hudson.model.AbstractBuild$AbstractRunner.perform(AbstractBuild.java:697)
at hudson.model.AbstractBuild$AbstractRunner.performAllBuildSteps(AbstractBuild.java:672)
at hudson.maven.MavenModuleSetBuild$RunnerImpl.post2(MavenModuleSetBuild.java:997)
at hudson.model.AbstractBuild$AbstractRunner.post(AbstractBuild.java:619)
at hudson.model.Run.run(Run.java:1429)
at hudson.maven.MavenModuleSetBuild.run(MavenModuleSetBuild.java:481)
at hudson.model.ResourceController.execute(ResourceController.java:88)
at hudson.model.Executor.run(Executor.java:238)
Caused by: org.sonatype.aether.deployment.DeploymentException: Failed to deploy artifacts: Could not transfer artifact org.apache.myfaces.trinidad:trinidad:pom:1.0.14-20120117.001722-859 from/to (https://repository.apache.org/content/repositories/snapshots): Failed to transfer file: https://repository.apache.org/content/repositories/snapshots/org/apache/myfaces/trinidad/trinidad/1.0.14-SNAPSHOT/trinidad-1.0.14-20120117.001722-859.pom. Return code is: 401, ReasonPhrase:Unauthorized.
at org.sonatype.aether.impl.internal.DefaultDeployer.deploy(DefaultDeployer.java:280)
at org.sonatype.aether.impl.internal.DefaultDeployer.deploy(DefaultDeployer.java:211)
at org.sonatype.aether.impl.internal.DefaultRepositorySystem.deploy(DefaultRepositorySystem.java:443)
at org.apache.maven.artifact.deployer.DefaultArtifactDeployer.deploy(DefaultArtifactDeployer.java:137)
... 11 more
Caused by: org.sonatype.aether.transfer.ArtifactTransferException: Could not transfer artifact org.apache.myfaces.trinidad:trinidad:pom:1.0.14-20120117.001722-859 from/to (https://repository.apache.org/content/repositories/snapshots): Failed to transfer file: https://repository.apache.org/content/repositories/snapshots/org/apache/myfaces/trinidad/trinidad/1.0.14-SNAPSHOT/trinidad-1.0.14-20120117.001722-859.pom. Return code is: 401, ReasonPhrase:Unauthorized.
at org.sonatype.aether.connector.wagon.WagonRepositoryConnector$4.wrap(WagonRepositoryConnector.java:950)
at org.sonatype.aether.connector.wagon.WagonRepositoryConnector$4.wrap(WagonRepositoryConnector.java:940)
at org.sonatype.aether.connector.wagon.WagonRepositoryConnector$PutTask.run(WagonRepositoryConnector.java:837)
at org.sonatype.aether.connector.wagon.WagonRepositoryConnector.put(WagonRepositoryConnector.java:467)
at org.sonatype.aether.impl.internal.DefaultDeployer.deploy(DefaultDeployer.java:274)
... 14 more
Caused by: org.apache.maven.wagon.TransferFailedException: Failed to transfer file: https://repository.apache.org/content/repositories/snapshots/org/apache/myfaces/trinidad/trinidad/1.0.14-SNAPSHOT/trinidad-1.0.14-20120117.001722-859.pom. Return code is: 401, ReasonPhrase:Unauthorized.
at org.apache.maven.wagon.shared.http4.AbstractHttpClientWagon.put(AbstractHttpClientWagon.java:562)
at org.apache.maven.wagon.shared.http4.AbstractHttpClientWagon.put(AbstractHttpClientWagon.java:471)
at org.apache.maven.wagon.shared.http4.AbstractHttpClientWagon.put(AbstractHttpClientWagon.java:451)
at org.sonatype.aether.connector.wagon.WagonRepositoryConnector$PutTask.run(WagonRepositoryConnector.java:811)
... 16 more
[INFO] Deployment failed after 1.1 sec
Build step 'Deploy artifacts to Maven repository' changed build result to FAILURE
Build failed in Jenkins: myfaces-trinidad-core-1.0 #587
Posted by Apache Jenkins Server <je...@builds.apache.org>.
See <https://builds.apache.org/job/myfaces-trinidad-core-1.0/587/>
------------------------------------------
[...truncated 6333 lines...]
Downloading: https://repository.apache.org/content/repositories/snapshots/org/apache/myfaces/trinidad/trinidad-blank/maven-metadata.xml
Downloaded: https://repository.apache.org/content/repositories/snapshots/org/apache/myfaces/trinidad/trinidad-blank/maven-metadata.xml (615 B at 6.3 KB/sec)
Uploading: https://repository.apache.org/content/repositories/snapshots/org/apache/myfaces/trinidad/trinidad-blank/1.0.14-SNAPSHOT/maven-metadata.xml
Uploaded: https://repository.apache.org/content/repositories/snapshots/org/apache/myfaces/trinidad/trinidad-blank/1.0.14-SNAPSHOT/maven-metadata.xml (1017 B at 1.4 KB/sec)
Uploading: https://repository.apache.org/content/repositories/snapshots/org/apache/myfaces/trinidad/trinidad-blank/maven-metadata.xml
Uploaded: https://repository.apache.org/content/repositories/snapshots/org/apache/myfaces/trinidad/trinidad-blank/maven-metadata.xml (615 B at 3.4 KB/sec)
Uploading: https://repository.apache.org/content/repositories/snapshots/org/apache/myfaces/trinidad/trinidad-blank/1.0.14-SNAPSHOT/trinidad-blank-1.0.14-20120116.001523-808-sources.jar
Uploaded: https://repository.apache.org/content/repositories/snapshots/org/apache/myfaces/trinidad/trinidad-blank/1.0.14-SNAPSHOT/trinidad-blank-1.0.14-20120116.001523-808-sources.jar (7 KB at 7.3 KB/sec)
Uploading: https://repository.apache.org/content/repositories/snapshots/org/apache/myfaces/trinidad/trinidad-blank/1.0.14-SNAPSHOT/maven-metadata.xml
Uploaded: https://repository.apache.org/content/repositories/snapshots/org/apache/myfaces/trinidad/trinidad-blank/1.0.14-SNAPSHOT/maven-metadata.xml (1017 B at 3.3 KB/sec)
[JENKINS] Archiving <https://builds.apache.org/job/myfaces-trinidad-core-1.0/ws/trinidad-examples/trinidad-blank/target/trinidad-blank-1.0.14-SNAPSHOT.war> to /home/hudson/hudson/jobs/myfaces-trinidad-core-1.0/modules/org.apache.myfaces.trinidad$trinidad-blank/builds/2012-01-16_00-06-38/archive/org.apache.myfaces.trinidad/trinidad-blank/1.0.14-20120116.001523-808/trinidad-blank-1.0.14-20120116.001523-808.war
[JENKINS] Archiving <https://builds.apache.org/job/myfaces-trinidad-core-1.0/ws/trinidad-examples/trinidad-blank/target/trinidad-blank-1.0.14-SNAPSHOT-sources.jar> to /home/hudson/hudson/jobs/myfaces-trinidad-core-1.0/modules/org.apache.myfaces.trinidad$trinidad-blank/builds/2012-01-16_00-06-38/archive/org.apache.myfaces.trinidad/trinidad-blank/1.0.14-20120116.001523-808/trinidad-blank-1.0.14-20120116.001523-808-sources.jar
[INFO] [INFO] Deleting file set: <https://builds.apache.org/job/myfaces-trinidad-core-1.0/ws/trinidad-examples/trinidad-demo/target> (included: [**], excluded: [])
[INFO] ------------------------------------------------------------------------
[INFO] Building Apache MyFaces Trinidad Demo 1.0.14-SNAPSHOT
[INFO] ------------------------------------------------------------------------
[INFO]
[INFO] --- maven-clean-plugin:2.3:clean (default-clean) @ trinidad-demo ---
[INFO]
[INFO] --- maven-xrts-plugin:1.2.6:generate-sources (default) @ trinidad-demo ---
[INFO]
[INFO] --- maven-remote-resources-plugin:1.0-alpha-6:process (default) @ trinidad-demo ---
[INFO] [INFO] Using 'UTF-8' encoding to copy filtered resources.
[INFO] Copying 0 resource
[INFO] Copying 2 resources
[INFO] --- maven-resources-plugin:2.4.3:resources (default-resources) @ trinidad-demo ---
[INFO]
[INFO] --- maven-compiler-plugin:2.3.1:compile (default-compile) @ trinidad-demo ---
[INFO] Compiling 85 source files to <https://builds.apache.org/job/myfaces-trinidad-core-1.0/ws/trinidad-examples/trinidad-demo/target/classes>
[INFO]
[INFO] --- maven-xrts-plugin:1.2.6:generate-test-sources (default) @ trinidad-demo ---
[INFO] [INFO] Using 'UTF-8' encoding to copy filtered resources.
[INFO] skip non existing resourceDirectory <https://builds.apache.org/job/myfaces-trinidad-core-1.0/ws/trinidad-examples/trinidad-demo/src/test/resources>
[INFO] Copying 2 resources
[INFO] --- maven-resources-plugin:2.4.3:testResources (default-testResources) @ trinidad-demo ---
[INFO] [INFO] Compiling 5 source files to <https://builds.apache.org/job/myfaces-trinidad-core-1.0/ws/trinidad-examples/trinidad-demo/target/test-classes>
[INFO] --- maven-compiler-plugin:2.3.1:testCompile (default-testCompile) @ trinidad-demo ---
[INFO] [INFO] Surefire report directory: <https://builds.apache.org/job/myfaces-trinidad-core-1.0/ws/trinidad-examples/trinidad-demo/target/surefire-reports>
-------------------------------------------------------
T E S T S
-------------------------------------------------------
There are no tests to run.
Results :
Tests run: 0, Failures: 0, Errors: 0, Skipped: 0
[INFO] --- maven-surefire-plugin:2.5:test (default-test) @ trinidad-demo ---
[JENKINS] Recording test results
[INFO] [INFO] Packaging webapp
[INFO] Assembling webapp [trinidad-demo] in [<https://builds.apache.org/job/myfaces-trinidad-core-1.0/ws/trinidad-examples/trinidad-demo/target/trinidad-demo-1.0.14-SNAPSHOT]>
[INFO] Processing war project
[INFO] Copying webapp resources [<https://builds.apache.org/job/myfaces-trinidad-core-1.0/ws/trinidad-examples/trinidad-demo/src/main/webapp]>
[INFO] --- maven-war-plugin:2.1.1:war (default-war) @ trinidad-demo ---
[INFO] Webapp assembled in [787 msecs]
[INFO] Building war: <https://builds.apache.org/job/myfaces-trinidad-core-1.0/ws/trinidad-examples/trinidad-demo/target/trinidad-demo-1.0.14-SNAPSHOT.war>
[INFO] WEB-INF/web.xml already added, skipping
[INFO]
[INFO] --- maven-xrts-plugin:1.2.6:generate-sources (default) @ trinidad-demo ---
[JENKINS] Archiving <https://builds.apache.org/job/myfaces-trinidad-core-1.0/ws/trinidad-examples/trinidad-demo/pom.xml> to /home/hudson/hudson/jobs/myfaces-trinidad-core-1.0/modules/org.apache.myfaces.trinidad$trinidad-demo/builds/2012-01-16_00-06-38/archive/org.apache.myfaces.trinidad/trinidad-demo/1.0.14-SNAPSHOT/trinidad-demo-1.0.14-SNAPSHOT.pom
[JENKINS] Archiving <https://builds.apache.org/job/myfaces-trinidad-core-1.0/ws/trinidad-examples/trinidad-demo/target/trinidad-demo-1.0.14-SNAPSHOT.war> to /home/hudson/hudson/jobs/myfaces-trinidad-core-1.0/modules/org.apache.myfaces.trinidad$trinidad-demo/builds/2012-01-16_00-06-38/archive/org.apache.myfaces.trinidad/trinidad-demo/1.0.14-SNAPSHOT/trinidad-demo-1.0.14-SNAPSHOT.war
Jan 16, 2012 12:17:10 AM hudson.maven.ExecutedMojo <init>
WARNING: Failed to getClass for org.apache.maven.plugin.source.SourceJarMojo
[INFO]
[INFO] --- maven-source-plugin:2.1.2:jar (attach-source) @ trinidad-demo ---
[INFO] META-INF already added, skipping
[INFO] META-INF already added, skipping
[INFO] META-INF/NOTICE already added, skipping
[INFO] META-INF/LICENSE already added, skipping
[INFO] Building jar: <https://builds.apache.org/job/myfaces-trinidad-core-1.0/ws/trinidad-examples/trinidad-demo/target/trinidad-demo-1.0.14-SNAPSHOT-sources.jar>
[INFO] META-INF already added, skipping
[INFO] META-INF already added, skipping
[INFO] META-INF/NOTICE already added, skipping
[INFO] META-INF/LICENSE already added, skipping
[INFO] [INFO] Installing <https://builds.apache.org/job/myfaces-trinidad-core-1.0/ws/trinidad-examples/trinidad-demo/target/trinidad-demo-1.0.14-SNAPSHOT.war> to /home/jenkins/.m2/repository/org/apache/myfaces/trinidad/trinidad-demo/1.0.14-SNAPSHOT/trinidad-demo-1.0.14-SNAPSHOT.war
[INFO] --- maven-install-plugin:2.3:install (default-install) @ trinidad-demo ---
[INFO] Installing <https://builds.apache.org/job/myfaces-trinidad-core-1.0/ws/trinidad-examples/trinidad-demo/pom.xml> to /home/jenkins/.m2/repository/org/apache/myfaces/trinidad/trinidad-demo/1.0.14-SNAPSHOT/trinidad-demo-1.0.14-SNAPSHOT.pom
[INFO] Installing <https://builds.apache.org/job/myfaces-trinidad-core-1.0/ws/trinidad-examples/trinidad-demo/target/trinidad-demo-1.0.14-SNAPSHOT-sources.jar> to /home/jenkins/.m2/repository/org/apache/myfaces/trinidad/trinidad-demo/1.0.14-SNAPSHOT/trinidad-demo-1.0.14-SNAPSHOT-sources.jar
[INFO]
[INFO] --- maven-xrts-plugin:1.2.6:generate-sources (default) @ trinidad-demo ---
[INFO]
[INFO] --- maven-remote-resources-plugin:1.0-alpha-6:process (default) @ trinidad-demo ---
[INFO] Using 'UTF-8' encoding to copy filtered resources.
[INFO] [INFO] Copying 0 resource
[INFO] Copying 2 resources
[INFO] Copying 2 resources
[INFO] --- maven-resources-plugin:2.4.3:resources (default-resources) @ trinidad-demo ---
[INFO]
[INFO] --- maven-compiler-plugin:2.3.1:compile (default-compile) @ trinidad-demo ---
[INFO] Nothing to compile - all classes are up to date
[INFO]
[INFO] --- maven-xrts-plugin:1.2.6:generate-test-sources (default) @ trinidad-demo ---
[INFO] [INFO] Using 'UTF-8' encoding to copy filtered resources.
[INFO] skip non existing resourceDirectory <https://builds.apache.org/job/myfaces-trinidad-core-1.0/ws/trinidad-examples/trinidad-demo/src/test/resources>
[INFO] Copying 2 resources
[INFO] Copying 2 resources
[INFO] --- maven-resources-plugin:2.4.3:testResources (default-testResources) @ trinidad-demo ---
[INFO] [INFO] Nothing to compile - all classes are up to date
[INFO] --- maven-compiler-plugin:2.3.1:testCompile (default-testCompile) @ trinidad-demo ---
[INFO] [INFO] Surefire report directory: <https://builds.apache.org/job/myfaces-trinidad-core-1.0/ws/trinidad-examples/trinidad-demo/target/surefire-reports>
[INFO] --- maven-surefire-plugin:2.5:test (default-test) @ trinidad-demo ----------------------------------------------------------
T E S T S
-------------------------------------------------------
There are no tests to run.
Results :
Tests run: 0, Failures: 0, Errors: 0, Skipped: 0
[JENKINS] Recording test results
[INFO] [INFO] Packaging webapp
[INFO] Assembling webapp [trinidad-demo] in [<https://builds.apache.org/job/myfaces-trinidad-core-1.0/ws/trinidad-examples/trinidad-demo/target/trinidad-demo-1.0.14-SNAPSHOT]>
[INFO] Processing war project
[INFO] Copying webapp resources [<https://builds.apache.org/job/myfaces-trinidad-core-1.0/ws/trinidad-examples/trinidad-demo/src/main/webapp]>
[INFO] --- maven-war-plugin:2.1.1:war (default-war) @ trinidad-demo ---
[INFO] Webapp assembled in [327 msecs]
[INFO] Building war: <https://builds.apache.org/job/myfaces-trinidad-core-1.0/ws/trinidad-examples/trinidad-demo/target/trinidad-demo-1.0.14-SNAPSHOT.war>
[INFO] WEB-INF/web.xml already added, skipping
[INFO]
[INFO] --- maven-xrts-plugin:1.2.6:generate-sources (default) @ trinidad-demo ---
[JENKINS] Re-archiving <https://builds.apache.org/job/myfaces-trinidad-core-1.0/ws/trinidad-examples/trinidad-demo/target/trinidad-demo-1.0.14-SNAPSHOT.war>
[JENKINS] Archiving <https://builds.apache.org/job/myfaces-trinidad-core-1.0/ws/trinidad-examples/trinidad-demo/target/trinidad-demo-1.0.14-SNAPSHOT-sources.jar> to /home/hudson/hudson/jobs/myfaces-trinidad-core-1.0/modules/org.apache.myfaces.trinidad$trinidad-demo/builds/2012-01-16_00-06-38/archive/org.apache.myfaces.trinidad/trinidad-demo/1.0.14-SNAPSHOT/trinidad-demo-1.0.14-SNAPSHOT-sources.jar
Jan 16, 2012 12:18:04 AM hudson.maven.ExecutedMojo <init>
WARNING: Failed to getClass for org.apache.maven.plugin.source.SourceJarMojo
[INFO]
[INFO] --- maven-source-plugin:2.1.2:jar (attach-source) @ trinidad-demo ---
[INFO] META-INF already added, skipping
[INFO] META-INF/NOTICE already added, skipping
[INFO] META-INF/LICENSE already added, skipping
[INFO] META-INF already added, skipping
[INFO] META-INF already added, skipping
[INFO] META-INF/NOTICE already added, skipping
[INFO] META-INF/LICENSE already added, skipping
[INFO] META-INF already added, skipping
[INFO] META-INF/NOTICE already added, skipping
[INFO] META-INF/LICENSE already added, skipping
[INFO] Building jar: <https://builds.apache.org/job/myfaces-trinidad-core-1.0/ws/trinidad-examples/trinidad-demo/target/trinidad-demo-1.0.14-SNAPSHOT-sources.jar>
[INFO] META-INF already added, skipping
[INFO] META-INF/NOTICE already added, skipping
[INFO] META-INF/LICENSE already added, skipping
[INFO] META-INF already added, skipping
[INFO] META-INF already added, skipping
[INFO] META-INF/NOTICE already added, skipping
[INFO] META-INF/LICENSE already added, skipping
[INFO] META-INF already added, skipping
[INFO] META-INF/NOTICE already added, skipping
[INFO] META-INF/LICENSE already added, skipping
[WARNING] Artifact org.apache.myfaces.trinidad:trinidad-demo:java-source:sources:1.0.14-SNAPSHOT already attached to project, ignoring duplicate
[INFO] [INFO] Installing <https://builds.apache.org/job/myfaces-trinidad-core-1.0/ws/trinidad-examples/trinidad-demo/target/trinidad-demo-1.0.14-SNAPSHOT.war> to /home/jenkins/.m2/repository/org/apache/myfaces/trinidad/trinidad-demo/1.0.14-SNAPSHOT/trinidad-demo-1.0.14-SNAPSHOT.war
[INFO] Installing <https://builds.apache.org/job/myfaces-trinidad-core-1.0/ws/trinidad-examples/trinidad-demo/pom.xml> to /home/jenkins/.m2/repository/org/apache/myfaces/trinidad/trinidad-demo/1.0.14-SNAPSHOT/trinidad-demo-1.0.14-SNAPSHOT.pom
[INFO] Installing <https://builds.apache.org/job/myfaces-trinidad-core-1.0/ws/trinidad-examples/trinidad-demo/target/trinidad-demo-1.0.14-SNAPSHOT-sources.jar> to /home/jenkins/.m2/repository/org/apache/myfaces/trinidad/trinidad-demo/1.0.14-SNAPSHOT/trinidad-demo-1.0.14-SNAPSHOT-sources.jar
[INFO] --- maven-install-plugin:2.3:install (default-install) @ trinidad-demo ---
[INFO] Downloading: https://repository.apache.org/content/repositories/snapshots/org/apache/myfaces/trinidad/trinidad-demo/1.0.14-SNAPSHOT/maven-metadata.xml
[INFO] --- maven-deploy-plugin:2.5:deploy (default-deploy) @ trinidad-demo ---
Downloaded: https://repository.apache.org/content/repositories/snapshots/org/apache/myfaces/trinidad/trinidad-demo/1.0.14-SNAPSHOT/maven-metadata.xml (1016 B at 1.0 KB/sec)
Uploading: https://repository.apache.org/content/repositories/snapshots/org/apache/myfaces/trinidad/trinidad-demo/1.0.14-SNAPSHOT/trinidad-demo-1.0.14-20120116.001808-800.war
Uploaded: https://repository.apache.org/content/repositories/snapshots/org/apache/myfaces/trinidad/trinidad-demo/1.0.14-SNAPSHOT/trinidad-demo-1.0.14-20120116.001808-800.war (7934 KB at 1359.1 KB/sec)
Uploading: https://repository.apache.org/content/repositories/snapshots/org/apache/myfaces/trinidad/trinidad-demo/1.0.14-SNAPSHOT/trinidad-demo-1.0.14-20120116.001808-800.pom
Uploaded: https://repository.apache.org/content/repositories/snapshots/org/apache/myfaces/trinidad/trinidad-demo/1.0.14-SNAPSHOT/trinidad-demo-1.0.14-20120116.001808-800.pom (3 KB at 9.1 KB/sec)
Downloading: https://repository.apache.org/content/repositories/snapshots/org/apache/myfaces/trinidad/trinidad-demo/maven-metadata.xml
Downloaded: https://repository.apache.org/content/repositories/snapshots/org/apache/myfaces/trinidad/trinidad-demo/maven-metadata.xml (7 KB at 29.0 KB/sec)
Uploading: https://repository.apache.org/content/repositories/snapshots/org/apache/myfaces/trinidad/trinidad-demo/1.0.14-SNAPSHOT/maven-metadata.xml
Uploaded: https://repository.apache.org/content/repositories/snapshots/org/apache/myfaces/trinidad/trinidad-demo/1.0.14-SNAPSHOT/maven-metadata.xml (1016 B at 4.6 KB/sec)
Uploading: https://repository.apache.org/content/repositories/snapshots/org/apache/myfaces/trinidad/trinidad-demo/maven-metadata.xml
Uploaded: https://repository.apache.org/content/repositories/snapshots/org/apache/myfaces/trinidad/trinidad-demo/maven-metadata.xml (7 KB at 39.7 KB/sec)
Uploading: https://repository.apache.org/content/repositories/snapshots/org/apache/myfaces/trinidad/trinidad-demo/1.0.14-SNAPSHOT/trinidad-demo-1.0.14-20120116.001808-800-sources.jar
Uploaded: https://repository.apache.org/content/repositories/snapshots/org/apache/myfaces/trinidad/trinidad-demo/1.0.14-SNAPSHOT/trinidad-demo-1.0.14-20120116.001808-800-sources.jar (133 KB at 384.3 KB/sec)
Uploading: https://repository.apache.org/content/repositories/snapshots/org/apache/myfaces/trinidad/trinidad-demo/1.0.14-SNAPSHOT/maven-metadata.xml
Uploaded: https://repository.apache.org/content/repositories/snapshots/org/apache/myfaces/trinidad/trinidad-demo/1.0.14-SNAPSHOT/maven-metadata.xml (1016 B at 6.8 KB/sec)
[JENKINS] Archiving <https://builds.apache.org/job/myfaces-trinidad-core-1.0/ws/trinidad-examples/trinidad-demo/target/trinidad-demo-1.0.14-SNAPSHOT.war> to /home/hudson/hudson/jobs/myfaces-trinidad-core-1.0/modules/org.apache.myfaces.trinidad$trinidad-demo/builds/2012-01-16_00-06-38/archive/org.apache.myfaces.trinidad/trinidad-demo/1.0.14-20120116.001808-800/trinidad-demo-1.0.14-20120116.001808-800.war
[JENKINS] Archiving <https://builds.apache.org/job/myfaces-trinidad-core-1.0/ws/trinidad-examples/trinidad-demo/target/trinidad-demo-1.0.14-SNAPSHOT-sources.jar> to /home/hudson/hudson/jobs/myfaces-trinidad-core-1.0/modules/org.apache.myfaces.trinidad$trinidad-demo/builds/2012-01-16_00-06-38/archive/org.apache.myfaces.trinidad/trinidad-demo/1.0.14-20120116.001808-800/trinidad-demo-1.0.14-20120116.001808-800-sources.jar
[INFO] ------------------------------------------------------------------------
[INFO] Reactor Summary:
[INFO]
[INFO] Apache MyFaces Trinidad ........................... SUCCESS [38.347s]
[INFO] Apache MyFaces Trinidad Build ..................... SUCCESS [24.842s]
[INFO] Apache MyFaces Trinidad API ....................... SUCCESS [1:13.904s]
[INFO] Apache MyFaces Trinidad Impl ...................... SUCCESS [3:10.653s]
[INFO] Apache MyFaces Trinidad Examples .................. SUCCESS [5.441s]
[INFO] Apache MyFaces Trinidad Blank Demo ................ SUCCESS [1:44.157s]
[INFO] Apache MyFaces Trinidad Demo ...................... SUCCESS [2:02.310s]
[INFO] ------------------------------------------------------------------------
[INFO] BUILD SUCCESS
[INFO] ------------------------------------------------------------------------
[INFO] Total time: 12:12.864s
[INFO] Finished at: Mon Jan 16 00:19:04 UTC 2012
[INFO] Final Memory: 50M/383M
[INFO] ------------------------------------------------------------------------
channel stopped
Maven RedeployPublished use remote ubuntu5 maven settings from : /home/jenkins/.m2/settings.xml
[ERROR] uniqueVersion == false is not anymore supported in maven 3
[INFO] Deployment in https://repository.apache.org/content/repositories/snapshots (id=,uniqueVersion=false)
Deploying the main artifact trinidad-1.0.14-SNAPSHOT.pom
Downloading: https://repository.apache.org/content/repositories/snapshots/org/apache/myfaces/trinidad/trinidad/1.0.14-SNAPSHOT/maven-metadata.xml
Downloaded: https://repository.apache.org/content/repositories/snapshots/org/apache/myfaces/trinidad/trinidad/1.0.14-SNAPSHOT/maven-metadata.xml (618 B at 0.3 KB/sec)
Uploading: https://repository.apache.org/content/repositories/snapshots/org/apache/myfaces/trinidad/trinidad/1.0.14-SNAPSHOT/trinidad-1.0.14-20120116.001908-858.pom
Uploading: https://repository.apache.org/content/repositories/snapshots/org/apache/myfaces/trinidad/trinidad/1.0.14-SNAPSHOT/trinidad-1.0.14-20120116.001908-858.pom
ERROR: Failed to deploy artifacts: Could not transfer artifact org.apache.myfaces.trinidad:trinidad:pom:1.0.14-20120116.001908-858 from/to (https://repository.apache.org/content/repositories/snapshots): Failed to transfer file: https://repository.apache.org/content/repositories/snapshots/org/apache/myfaces/trinidad/trinidad/1.0.14-SNAPSHOT/trinidad-1.0.14-20120116.001908-858.pom. Return code is: 401, ReasonPhrase:Unauthorized.
org.apache.maven.artifact.deployer.ArtifactDeploymentException: Failed to deploy artifacts: Could not transfer artifact org.apache.myfaces.trinidad:trinidad:pom:1.0.14-20120116.001908-858 from/to (https://repository.apache.org/content/repositories/snapshots): Failed to transfer file: https://repository.apache.org/content/repositories/snapshots/org/apache/myfaces/trinidad/trinidad/1.0.14-SNAPSHOT/trinidad-1.0.14-20120116.001908-858.pom. Return code is: 401, ReasonPhrase:Unauthorized.
at org.apache.maven.artifact.deployer.DefaultArtifactDeployer.deploy(DefaultArtifactDeployer.java:141)
at hudson.maven.reporters.MavenArtifactRecord.deploy(MavenArtifactRecord.java:182)
at hudson.maven.RedeployPublisher.perform(RedeployPublisher.java:158)
at hudson.tasks.BuildStepMonitor$1.perform(BuildStepMonitor.java:19)
at hudson.model.AbstractBuild$AbstractRunner.perform(AbstractBuild.java:697)
at hudson.model.AbstractBuild$AbstractRunner.performAllBuildSteps(AbstractBuild.java:672)
at hudson.maven.MavenModuleSetBuild$RunnerImpl.post2(MavenModuleSetBuild.java:997)
at hudson.model.AbstractBuild$AbstractRunner.post(AbstractBuild.java:619)
at hudson.model.Run.run(Run.java:1429)
at hudson.maven.MavenModuleSetBuild.run(MavenModuleSetBuild.java:481)
at hudson.model.ResourceController.execute(ResourceController.java:88)
at hudson.model.Executor.run(Executor.java:238)
Caused by: org.sonatype.aether.deployment.DeploymentException: Failed to deploy artifacts: Could not transfer artifact org.apache.myfaces.trinidad:trinidad:pom:1.0.14-20120116.001908-858 from/to (https://repository.apache.org/content/repositories/snapshots): Failed to transfer file: https://repository.apache.org/content/repositories/snapshots/org/apache/myfaces/trinidad/trinidad/1.0.14-SNAPSHOT/trinidad-1.0.14-20120116.001908-858.pom. Return code is: 401, ReasonPhrase:Unauthorized.
at org.sonatype.aether.impl.internal.DefaultDeployer.deploy(DefaultDeployer.java:280)
at org.sonatype.aether.impl.internal.DefaultDeployer.deploy(DefaultDeployer.java:211)
at org.sonatype.aether.impl.internal.DefaultRepositorySystem.deploy(DefaultRepositorySystem.java:443)
at org.apache.maven.artifact.deployer.DefaultArtifactDeployer.deploy(DefaultArtifactDeployer.java:137)
... 11 more
Caused by: org.sonatype.aether.transfer.ArtifactTransferException: Could not transfer artifact org.apache.myfaces.trinidad:trinidad:pom:1.0.14-20120116.001908-858 from/to (https://repository.apache.org/content/repositories/snapshots): Failed to transfer file: https://repository.apache.org/content/repositories/snapshots/org/apache/myfaces/trinidad/trinidad/1.0.14-SNAPSHOT/trinidad-1.0.14-20120116.001908-858.pom. Return code is: 401, ReasonPhrase:Unauthorized.
at org.sonatype.aether.connector.wagon.WagonRepositoryConnector$4.wrap(WagonRepositoryConnector.java:950)
at org.sonatype.aether.connector.wagon.WagonRepositoryConnector$4.wrap(WagonRepositoryConnector.java:940)
at org.sonatype.aether.connector.wagon.WagonRepositoryConnector$PutTask.run(WagonRepositoryConnector.java:837)
at org.sonatype.aether.connector.wagon.WagonRepositoryConnector.put(WagonRepositoryConnector.java:467)
at org.sonatype.aether.impl.internal.DefaultDeployer.deploy(DefaultDeployer.java:274)
... 14 more
Caused by: org.apache.maven.wagon.TransferFailedException: Failed to transfer file: https://repository.apache.org/content/repositories/snapshots/org/apache/myfaces/trinidad/trinidad/1.0.14-SNAPSHOT/trinidad-1.0.14-20120116.001908-858.pom. Return code is: 401, ReasonPhrase:Unauthorized.
at org.apache.maven.wagon.shared.http4.AbstractHttpClientWagon.put(AbstractHttpClientWagon.java:562)
at org.apache.maven.wagon.shared.http4.AbstractHttpClientWagon.put(AbstractHttpClientWagon.java:471)
at org.apache.maven.wagon.shared.http4.AbstractHttpClientWagon.put(AbstractHttpClientWagon.java:451)
at org.sonatype.aether.connector.wagon.WagonRepositoryConnector$PutTask.run(WagonRepositoryConnector.java:811)
... 16 more
[INFO] Deployment failed after 2.7 sec
Build step 'Deploy artifacts to Maven repository' changed build result to FAILURE
Build failed in Jenkins: myfaces-trinidad-core-1.0 #586
Posted by Apache Jenkins Server <je...@builds.apache.org>.
See <https://builds.apache.org/job/myfaces-trinidad-core-1.0/586/>
------------------------------------------
Started by timer
Building remotely on solaris1
hudson.util.IOException2: remote file operation failed: <https://builds.apache.org/job/myfaces-trinidad-core-1.0/ws/> at hudson.remoting.Channel@7fedd758:solaris1
at hudson.FilePath.act(FilePath.java:780)
at hudson.FilePath.act(FilePath.java:766)
at hudson.scm.SubversionSCM.checkout(SubversionSCM.java:731)
at hudson.scm.SubversionSCM.checkout(SubversionSCM.java:676)
at hudson.model.AbstractProject.checkout(AbstractProject.java:1195)
at hudson.model.AbstractBuild$AbstractRunner.checkout(AbstractBuild.java:573)
at hudson.model.AbstractBuild$AbstractRunner.run(AbstractBuild.java:462)
at hudson.model.Run.run(Run.java:1404)
at hudson.maven.MavenModuleSetBuild.run(MavenModuleSetBuild.java:481)
at hudson.model.ResourceController.execute(ResourceController.java:88)
at hudson.model.Executor.run(Executor.java:238)
Caused by: java.io.IOException: Remote call on solaris1 failed
at hudson.remoting.Channel.call(Channel.java:690)
at hudson.FilePath.act(FilePath.java:773)
... 10 more
Caused by: java.lang.NoClassDefFoundError
at hudson.scm.SubversionSCM$CheckOutTask.invoke(SubversionSCM.java:751)
at hudson.scm.SubversionSCM$CheckOutTask.invoke(SubversionSCM.java:738)
at hudson.FilePath$FileCallableWrapper.call(FilePath.java:2045)
at hudson.remoting.UserRequest.perform(UserRequest.java:118)
at hudson.remoting.UserRequest.perform(UserRequest.java:48)
at hudson.remoting.Request$2.run(Request.java:287)
at java.util.concurrent.Executors$RunnableAdapter.call(Executors.java:417)
at java.util.concurrent.FutureTask$Sync.innerRun(FutureTask.java:269)
at java.util.concurrent.FutureTask.run(FutureTask.java:123)
at java.util.concurrent.ThreadPoolExecutor$Worker.runTask(ThreadPoolExecutor.java:651)
at java.util.concurrent.ThreadPoolExecutor$Worker.run(ThreadPoolExecutor.java:676)
at java.lang.Thread.run(Thread.java:595)