You are viewing a plain text version of this content. The canonical link for it is here.
Posted to builds@beam.apache.org by Apache Jenkins Server <je...@builds.apache.org> on 2023/06/10 08:07:55 UTC
Build failed in Jenkins: beam_LoadTests_Go_GBK_Flink_Batch #919
See <https://ci-beam.apache.org/job/beam_LoadTests_Go_GBK_Flink_Batch/919/display/redirect>
Changes:
------------------------------------------
[...truncated 48.11 KB...]
github.com/apache/beam/sdks/v2/go/pkg/beam/core/runtime/exec.(*invoker).invokeWithOpts(0xc0002da3c0, {0x18cd550?, 0xc000289300}, {0x0, 0x0, 0x0, 0x0, 0x0}, {0x23bbaf0, 0x1, ...}, ...)
<https://ci-beam.apache.org/job/beam_LoadTests_Go_GBK_Flink_Batch/ws/src/sdks/go/pkg/beam/core/runtime/exec/fn.go>:297 +0xfec
github.com/apache/beam/sdks/v2/go/pkg/beam/core/runtime/exec.(*ParDo).invokeProcessFn(0xc0002f2000, {0x18cd550, 0xc000289300}, {0x0, 0x0, 0x0, 0x0, 0x0}, {0x23bbaf0, 0x1, ...}, ...)
<https://ci-beam.apache.org/job/beam_LoadTests_Go_GBK_Flink_Batch/ws/src/sdks/go/pkg/beam/core/runtime/exec/pardo.go>:508 +0x2b5
github.com/apache/beam/sdks/v2/go/pkg/beam/core/runtime/exec.(*ParDo).processSingleWindow(0xc0002f2000, 0xc00060c990)
<https://ci-beam.apache.org/job/beam_LoadTests_Go_GBK_Flink_Batch/ws/src/sdks/go/pkg/beam/core/runtime/exec/pardo.go>:194 +0x9b
github.com/apache/beam/sdks/v2/go/pkg/beam/core/runtime/exec.(*ProcessSizedElementsAndRestrictions).ProcessElement(0xc00015bf40, {0x18cd550, 0xc0001236c0}, 0xc00018fe30, {0x0, 0x0, 0x0})
<https://ci-beam.apache.org/job/beam_LoadTests_Go_GBK_Flink_Batch/ws/src/sdks/go/pkg/beam/core/runtime/exec/sdf.go>:556 +0x63d
github.com/apache/beam/sdks/v2/go/pkg/beam/core/runtime/exec.(*DataSource).Process.func1(0xc00015c2e8, {0xc0000b7340?, 0xc0004ba8c0?})
<https://ci-beam.apache.org/job/beam_LoadTests_Go_GBK_Flink_Batch/ws/src/sdks/go/pkg/beam/core/runtime/exec/datasource.go>:241 +0x21e
github.com/apache/beam/sdks/v2/go/pkg/beam/core/runtime/exec.(*DataSource).process(0xc0004a1340, {0x18cd550, 0xc0001236c0}, 0xc0000b7630, 0xc0000b7610)
<https://ci-beam.apache.org/job/beam_LoadTests_Go_GBK_Flink_Batch/ws/src/sdks/go/pkg/beam/core/runtime/exec/datasource.go>:147 +0x4f6
github.com/apache/beam/sdks/v2/go/pkg/beam/core/runtime/exec.(*DataSource).Process(0xc0004a1340, {0x18cd550, 0xc0001236c0})
<https://ci-beam.apache.org/job/beam_LoadTests_Go_GBK_Flink_Batch/ws/src/sdks/go/pkg/beam/core/runtime/exec/datasource.go>:215 +0x226
github.com/apache/beam/sdks/v2/go/pkg/beam/core/runtime/exec.(*Plan).Execute.func2({0x18cd550?, 0xc0001236c0?})
<https://ci-beam.apache.org/job/beam_LoadTests_Go_GBK_Flink_Batch/ws/src/sdks/go/pkg/beam/core/runtime/exec/plan.go>:151 +0x42
github.com/apache/beam/sdks/v2/go/pkg/beam/core/runtime/exec.callNoPanic({0x18cd550?, 0xc0001236c0?}, 0x415d50?)
<https://ci-beam.apache.org/job/beam_LoadTests_Go_GBK_Flink_Batch/ws/src/sdks/go/pkg/beam/core/runtime/exec/util.go>:62 +0x6c
github.com/apache/beam/sdks/v2/go/pkg/beam/core/runtime/exec.(*Plan).Execute(0xc0001a35f0, {0x18cd550, 0xc0001236c0}, {0x2362c98, 0x1}, {{0x18bf410?, 0xc000289240?}, {0x18f9998?, 0xc0002c8c30?}})
<https://ci-beam.apache.org/job/beam_LoadTests_Go_GBK_Flink_Batch/ws/src/sdks/go/pkg/beam/core/runtime/exec/plan.go>:150 +0x3df
github.com/apache/beam/sdks/v2/go/pkg/beam/core/runtime/harness.(*control).handleInstruction(0xc000156000, {0x18cd438?, 0xc000609ce0?}, 0xc0000965a0)
<https://ci-beam.apache.org/job/beam_LoadTests_Go_GBK_Flink_Batch/ws/src/sdks/go/pkg/beam/core/runtime/harness/harness.go>:408 +0xa53
github.com/apache/beam/sdks/v2/go/pkg/beam/core/runtime/harness.MainWithOptions.func4({0x18cd438?, 0xc000609ce0?}, 0x0?)
<https://ci-beam.apache.org/job/beam_LoadTests_Go_GBK_Flink_Batch/ws/src/sdks/go/pkg/beam/core/runtime/harness/harness.go>:195 +0x7a
created by github.com/apache/beam/sdks/v2/go/pkg/beam/core/runtime/harness.MainWithOptions
<https://ci-beam.apache.org/job/beam_LoadTests_Go_GBK_Flink_Batch/ws/src/sdks/go/pkg/beam/core/runtime/harness/harness.go>:213 +0xf1d
at java.util.concurrent.CompletableFuture.reportGet(CompletableFuture.java:395)
at java.util.concurrent.CompletableFuture.get(CompletableFuture.java:1999)
at org.apache.beam.sdk.util.MoreFutures.get(MoreFutures.java:61)
at org.apache.beam.runners.fnexecution.control.SdkHarnessClient$BundleProcessor$ActiveBundle.close(SdkHarnessClient.java:522)
at org.apache.beam.runners.fnexecution.control.DefaultJobBundleFactory$SimpleStageBundleFactory$1.close(DefaultJobBundleFactory.java:556)
at org.apache.beam.runners.flink.translation.functions.FlinkExecutableStageFunction.$closeResource(FlinkExecutableStageFunction.java:269)
at org.apache.beam.runners.flink.translation.functions.FlinkExecutableStageFunction.mapPartition(FlinkExecutableStageFunction.java:269)
at org.apache.flink.runtime.operators.MapPartitionDriver.run(MapPartitionDriver.java:113)
at org.apache.flink.runtime.operators.BatchTask.run(BatchTask.java:514)
at org.apache.flink.runtime.operators.BatchTask.invoke(BatchTask.java:357)
at org.apache.flink.runtime.taskmanager.Task.runWithSystemExitMonitoring(Task.java:948)
at org.apache.flink.runtime.taskmanager.Task.restoreAndInvoke(Task.java:927)
at org.apache.flink.runtime.taskmanager.Task.doRun(Task.java:741)
at org.apache.flink.runtime.taskmanager.Task.run(Task.java:563)
at java.lang.Thread.run(Thread.java:829)
Caused by: java.lang.RuntimeException: Error received from SDK harness for instruction 3: process bundle failed for instruction 3 using plan 1-4 : panic: datamgr.go [{3 fn/write/n4:0}]: error flushing buffer of length 4000000
caused by:
rpc error: code = Unknown desc =
Full error:
while executing Process for Plan[1-4]:
2: DataSink[S[fn/write/n4:0@localhost:33879]] Coder:W;fn/wire/n4:0<KV;c1<bytes;c0,bytes;c0>>!GWC
3: PCollection[n4] Out:[2]
4: ParDo[load.RuntimeMonitor] Out:[2] Sig: func([]uint8, []uint8, func([]uint8, []uint8))
5: PCollection[n3] Out:[4]
6: SDF.ProcessSizedElementsAndRestrictions[synthetic.sourceFn] UID:6 Out:[5]
1: DataSource[S[fn/read/n2/SplitAndSize0:0@localhost:33879], local_output] Out:6 Coder:W;fn/wire/n2/SplitAndSize0:0<KV;c5/SplitAndSize0<KV;c5/PairWithRestriction0<R;c5[synthetic.SourceConfig],KV;c9<offsetrange.Restriction[offsetrange.Restriction;c6];c7,bool;c8>>,double;DoubleCoder0>>!GWC
caused by:
panic: datamgr.go [{3 fn/write/n4:0}]: error flushing buffer of length 4000000
caused by:
rpc error: code = Unknown desc = goroutine 30 [running]:
runtime/debug.Stack()
/home/jenkins/sdk/go1.20.4/src/runtime/debug/stack.go:24 +0x65
github.com/apache/beam/sdks/v2/go/pkg/beam/core/runtime/exec.callNoPanic.func1()
<https://ci-beam.apache.org/job/beam_LoadTests_Go_GBK_Flink_Batch/ws/src/sdks/go/pkg/beam/core/runtime/exec/util.go>:58 +0xa5
panic({0x14a3060, 0xc0005f5780})
/home/jenkins/sdk/go1.20.4/src/runtime/panic.go:884 +0x213
github.com/apache/beam/sdks/v2/go/pkg/beam/register.(*emit2[...]).invoke(0x18cec60, {0xc000a783f8, 0x40a90d?, 0x1?}, {0xc000a78400?, 0x9, 0x9})
<https://ci-beam.apache.org/job/beam_LoadTests_Go_GBK_Flink_Batch/ws/src/sdks/go/pkg/beam/register/emitter.go>:81 +0x22f
github.com/apache/beam/sdks/v2/go/test/load.(*RuntimeMonitor).ProcessElement(0x240e3b0?, {0xc000a783f8?, 0x1?, 0x1?}, {0xc000a78400?, 0x9?, 0x9?}, 0xc00015c2d0?)
<https://ci-beam.apache.org/job/beam_LoadTests_Go_GBK_Flink_Batch/ws/src/sdks/go/test/load/util.go>:87 +0x39
github.com/apache/beam/sdks/v2/go/pkg/beam/register.registerDoFn3x0StructWrappersAndFuncs[...].func2.1({0xc000a78400, 0x9, 0x9}, 0x46eb0a)
<https://ci-beam.apache.org/job/beam_LoadTests_Go_GBK_Flink_Batch/ws/src/sdks/go/pkg/beam/register/register.go>:2469 +0x9c
github.com/apache/beam/sdks/v2/go/pkg/beam/register.(*caller3x0[...]).Call3x0(0x46c383?, {0x12cfee0?, 0xc000a73b30?}, {0x12cfee0?, 0xc000a73b48?}, {0x1302160?, 0xc00015c2d0?})
<https://ci-beam.apache.org/job/beam_LoadTests_Go_GBK_Flink_Batch/ws/src/sdks/go/pkg/beam/register/register.go>:2458 +0x7f
github.com/apache/beam/sdks/v2/go/pkg/beam/core/runtime/exec.(*invoker).initCall.func4({0x0, 0x0, 0x0, 0x0, 0x0}, {0x23bbaf0?, 0x1?, 0x1?}, 0xffdf3b645a1cac09?)
<https://ci-beam.apache.org/job/beam_LoadTests_Go_GBK_Flink_Batch/ws/src/sdks/go/pkg/beam/core/runtime/exec/fn_arity.go>:55 +0x75
github.com/apache/beam/sdks/v2/go/pkg/beam/core/runtime/exec.(*invoker).invokeWithOpts(0xc0002da280, {0x18cd550?, 0xc000289340}, {0x0, 0x0, 0x0, 0x0, 0x0}, {0x23bbaf0, 0x1, ...}, ...)
<https://ci-beam.apache.org/job/beam_LoadTests_Go_GBK_Flink_Batch/ws/src/sdks/go/pkg/beam/core/runtime/exec/fn.go>:297 +0xfec
github.com/apache/beam/sdks/v2/go/pkg/beam/core/runtime/exec.(*ParDo).invokeProcessFn(0xc00014dd40, {0x18cd550, 0xc000289340}, {0x0, 0x0, 0x0, 0x0, 0x0}, {0x23bbaf0, 0x1, ...}, ...)
<https://ci-beam.apache.org/job/beam_LoadTests_Go_GBK_Flink_Batch/ws/src/sdks/go/pkg/beam/core/runtime/exec/pardo.go>:508 +0x2b5
github.com/apache/beam/sdks/v2/go/pkg/beam/core/runtime/exec.(*ParDo).processSingleWindow(0xc00014dd40, 0xc000a7a090)
<https://ci-beam.apache.org/job/beam_LoadTests_Go_GBK_Flink_Batch/ws/src/sdks/go/pkg/beam/core/runtime/exec/pardo.go>:194 +0x9b
github.com/apache/beam/sdks/v2/go/pkg/beam/core/runtime/exec.(*ParDo).processMainInput(0x4273c0?, 0x18cd550?)
<https://ci-beam.apache.org/job/beam_LoadTests_Go_GBK_Flink_Batch/ws/src/sdks/go/pkg/beam/core/runtime/exec/pardo.go>:172 +0x91
github.com/apache/beam/sdks/v2/go/pkg/beam/core/runtime/exec.(*ParDo).ProcessElement(0xc00014dd40, {0x18?, 0xc000062c00?}, 0xc0002bcbe8, {0x0, 0x0, 0x0})
<https://ci-beam.apache.org/job/beam_LoadTests_Go_GBK_Flink_Batch/ws/src/sdks/go/pkg/beam/core/runtime/exec/pardo.go>:156 +0x125
github.com/apache/beam/sdks/v2/go/pkg/beam/core/runtime/exec.(*PCollection).ProcessElement(0xc000a78400?, {0x18cd550?, 0xc000289300?}, 0x4214c7?, {0x0?, 0x200?, 0x40?})
<https://ci-beam.apache.org/job/beam_LoadTests_Go_GBK_Flink_Batch/ws/src/sdks/go/pkg/beam/core/runtime/exec/pcollection.go>:100 +0x151
github.com/apache/beam/sdks/v2/go/pkg/beam/register.(*emit2[...]).invoke(0x18cec60, {0xc000a783f8, 0xc0000b66e8?, 0x18bb7f8?}, {0xc000a78400?, 0x9, 0x9})
<https://ci-beam.apache.org/job/beam_LoadTests_Go_GBK_Flink_Batch/ws/src/sdks/go/pkg/beam/register/emitter.go>:80 +0x20f
github.com/apache/beam/sdks/v2/go/pkg/beam/io/synthetic.(*sourceFn).ProcessElement(0xc00023bfa0, 0x7f0a8dbd5108?, {0xbebc200, 0x1, 0x1, 0x9, 0x0, 0x0}, 0xc00015c618)
<https://ci-beam.apache.org/job/beam_LoadTests_Go_GBK_Flink_Batch/ws/src/sdks/go/pkg/beam/io/synthetic/source.go>:151 +0x123
github.com/apache/beam/sdks/v2/go/pkg/beam/register.registerDoFn3x1StructWrappersAndFuncs[...].func2.1({0xbebc200?, 0x1, 0x1, 0x9, 0x0, 0x0}, 0x0)
<https://ci-beam.apache.org/job/beam_LoadTests_Go_GBK_Flink_Batch/ws/src/sdks/go/pkg/beam/register/register.go>:3382 +0xb0
github.com/apache/beam/sdks/v2/go/pkg/beam/register.(*caller3x1[...]).Call3x1(0x0?, {0x157e0a0?, 0xc00015c5e8?}, {0x15d4a80?, 0xc0000a4240?}, {0x1302160?, 0xc00015c618?})
<https://ci-beam.apache.org/job/beam_LoadTests_Go_GBK_Flink_Batch/ws/src/sdks/go/pkg/beam/register/register.go>:3371 +0xb6
github.com/apache/beam/sdks/v2/go/pkg/beam/core/runtime/exec.(*invoker).initCall.func13({0x0, 0x0, 0x0, 0x0, 0x0}, {0x23bbaf0, 0x1, 0x1}, 0x7f0a8dbd5108?)
<https://ci-beam.apache.org/job/beam_LoadTests_Go_GBK_Flink_Batch/ws/src/sdks/go/pkg/beam/core/runtime/exec/fn_arity.go>:109 +0xad
github.com/apache/beam/sdks/v2/go/pkg/beam/core/runtime/exec.(*invoker).invokeWithOpts(0xc0002da3c0, {0x18cd550?, 0xc000289300}, {0x0, 0x0, 0x0, 0x0, 0x0}, {0x23bbaf0, 0x1, ...}, ...)
<https://ci-beam.apache.org/job/beam_LoadTests_Go_GBK_Flink_Batch/ws/src/sdks/go/pkg/beam/core/runtime/exec/fn.go>:297 +0xfec
github.com/apache/beam/sdks/v2/go/pkg/beam/core/runtime/exec.(*ParDo).invokeProcessFn(0xc0002f2000, {0x18cd550, 0xc000289300}, {0x0, 0x0, 0x0, 0x0, 0x0}, {0x23bbaf0, 0x1, ...}, ...)
<https://ci-beam.apache.org/job/beam_LoadTests_Go_GBK_Flink_Batch/ws/src/sdks/go/pkg/beam/core/runtime/exec/pardo.go>:508 +0x2b5
github.com/apache/beam/sdks/v2/go/pkg/beam/core/runtime/exec.(*ParDo).processSingleWindow(0xc0002f2000, 0xc00060c990)
<https://ci-beam.apache.org/job/beam_LoadTests_Go_GBK_Flink_Batch/ws/src/sdks/go/pkg/beam/core/runtime/exec/pardo.go>:194 +0x9b
github.com/apache/beam/sdks/v2/go/pkg/beam/core/runtime/exec.(*ProcessSizedElementsAndRestrictions).ProcessElement(0xc00015bf40, {0x18cd550, 0xc0001236c0}, 0xc00018fe30, {0x0, 0x0, 0x0})
<https://ci-beam.apache.org/job/beam_LoadTests_Go_GBK_Flink_Batch/ws/src/sdks/go/pkg/beam/core/runtime/exec/sdf.go>:556 +0x63d
github.com/apache/beam/sdks/v2/go/pkg/beam/core/runtime/exec.(*DataSource).Process.func1(0xc00015c2e8, {0xc0000b7340?, 0xc0004ba8c0?})
<https://ci-beam.apache.org/job/beam_LoadTests_Go_GBK_Flink_Batch/ws/src/sdks/go/pkg/beam/core/runtime/exec/datasource.go>:241 +0x21e
github.com/apache/beam/sdks/v2/go/pkg/beam/core/runtime/exec.(*DataSource).process(0xc0004a1340, {0x18cd550, 0xc0001236c0}, 0xc0000b7630, 0xc0000b7610)
<https://ci-beam.apache.org/job/beam_LoadTests_Go_GBK_Flink_Batch/ws/src/sdks/go/pkg/beam/core/runtime/exec/datasource.go>:147 +0x4f6
github.com/apache/beam/sdks/v2/go/pkg/beam/core/runtime/exec.(*DataSource).Process(0xc0004a1340, {0x18cd550, 0xc0001236c0})
<https://ci-beam.apache.org/job/beam_LoadTests_Go_GBK_Flink_Batch/ws/src/sdks/go/pkg/beam/core/runtime/exec/datasource.go>:215 +0x226
github.com/apache/beam/sdks/v2/go/pkg/beam/core/runtime/exec.(*Plan).Execute.func2({0x18cd550?, 0xc0001236c0?})
<https://ci-beam.apache.org/job/beam_LoadTests_Go_GBK_Flink_Batch/ws/src/sdks/go/pkg/beam/core/runtime/exec/plan.go>:151 +0x42
github.com/apache/beam/sdks/v2/go/pkg/beam/core/runtime/exec.callNoPanic({0x18cd550?, 0xc0001236c0?}, 0x415d50?)
<https://ci-beam.apache.org/job/beam_LoadTests_Go_GBK_Flink_Batch/ws/src/sdks/go/pkg/beam/core/runtime/exec/util.go>:62 +0x6c
github.com/apache/beam/sdks/v2/go/pkg/beam/core/runtime/exec.(*Plan).Execute(0xc0001a35f0, {0x18cd550, 0xc0001236c0}, {0x2362c98, 0x1}, {{0x18bf410?, 0xc000289240?}, {0x18f9998?, 0xc0002c8c30?}})
<https://ci-beam.apache.org/job/beam_LoadTests_Go_GBK_Flink_Batch/ws/src/sdks/go/pkg/beam/core/runtime/exec/plan.go>:150 +0x3df
github.com/apache/beam/sdks/v2/go/pkg/beam/core/runtime/harness.(*control).handleInstruction(0xc000156000, {0x18cd438?, 0xc000609ce0?}, 0xc0000965a0)
<https://ci-beam.apache.org/job/beam_LoadTests_Go_GBK_Flink_Batch/ws/src/sdks/go/pkg/beam/core/runtime/harness/harness.go>:408 +0xa53
github.com/apache/beam/sdks/v2/go/pkg/beam/core/runtime/harness.MainWithOptions.func4({0x18cd438?, 0xc000609ce0?}, 0x0?)
<https://ci-beam.apache.org/job/beam_LoadTests_Go_GBK_Flink_Batch/ws/src/sdks/go/pkg/beam/core/runtime/harness/harness.go>:195 +0x7a
created by github.com/apache/beam/sdks/v2/go/pkg/beam/core/runtime/harness.MainWithOptions
<https://ci-beam.apache.org/job/beam_LoadTests_Go_GBK_Flink_Batch/ws/src/sdks/go/pkg/beam/core/runtime/harness/harness.go>:213 +0xf1d
at org.apache.beam.runners.fnexecution.control.FnApiControlClient$ResponseStreamObserver.onNext(FnApiControlClient.java:180)
at org.apache.beam.runners.fnexecution.control.FnApiControlClient$ResponseStreamObserver.onNext(FnApiControlClient.java:160)
at org.apache.beam.vendor.grpc.v1p54p0.io.grpc.stub.ServerCalls$StreamingServerCallHandler$StreamingServerCallListener.onMessage(ServerCalls.java:262)
at org.apache.beam.vendor.grpc.v1p54p0.io.grpc.ForwardingServerCallListener.onMessage(ForwardingServerCallListener.java:33)
at org.apache.beam.vendor.grpc.v1p54p0.io.grpc.Contexts$ContextualizedServerCallListener.onMessage(Contexts.java:76)
at org.apache.beam.vendor.grpc.v1p54p0.io.grpc.internal.ServerCallImpl$ServerStreamListenerImpl.messagesAvailableInternal(ServerCallImpl.java:333)
at org.apache.beam.vendor.grpc.v1p54p0.io.grpc.internal.ServerCallImpl$ServerStreamListenerImpl.messagesAvailable(ServerCallImpl.java:316)
at org.apache.beam.vendor.grpc.v1p54p0.io.grpc.internal.ServerImpl$JumpToApplicationThreadServerStreamListener$1MessagesAvailable.runInContext(ServerImpl.java:835)
at org.apache.beam.vendor.grpc.v1p54p0.io.grpc.internal.ContextRunnable.run(ContextRunnable.java:37)
at org.apache.beam.vendor.grpc.v1p54p0.io.grpc.internal.SerializingExecutor.run(SerializingExecutor.java:133)
at java.util.concurrent.ThreadPoolExecutor.runWorker(ThreadPoolExecutor.java:1128)
at java.util.concurrent.ThreadPoolExecutor$Worker.run(ThreadPoolExecutor.java:628)
... 1 more
2023/06/10 08:07:53 (): java.lang.RuntimeException: Error received from SDK harness for instruction 3: process bundle failed for instruction 3 using plan 1-4 : panic: datamgr.go [{3 fn/write/n4:0}]: error flushing buffer of length 4000000
caused by:
rpc error: code = Unknown desc =
Full error:
while executing Process for Plan[1-4]:
2: DataSink[S[fn/write/n4:0@localhost:33879]] Coder:W;fn/wire/n4:0<KV;c1<bytes;c0,bytes;c0>>!GWC
3: PCollection[n4] Out:[2]
4: ParDo[load.RuntimeMonitor] Out:[2] Sig: func([]uint8, []uint8, func([]uint8, []uint8))
5: PCollection[n3] Out:[4]
6: SDF.ProcessSizedElementsAndRestrictions[synthetic.sourceFn] UID:6 Out:[5]
1: DataSource[S[fn/read/n2/SplitAndSize0:0@localhost:33879], local_output] Out:6 Coder:W;fn/wire/n2/SplitAndSize0:0<KV;c5/SplitAndSize0<KV;c5/PairWithRestriction0<R;c5[synthetic.SourceConfig],KV;c9<offsetrange.Restriction[offsetrange.Restriction;c6];c7,bool;c8>>,double;DoubleCoder0>>!GWC
caused by:
panic: datamgr.go [{3 fn/write/n4:0}]: error flushing buffer of length 4000000
caused by:
rpc error: code = Unknown desc = goroutine 30 [running]:
runtime/debug.Stack()
/home/jenkins/sdk/go1.20.4/src/runtime/debug/stack.go:24 +0x65
github.com/apache/beam/sdks/v2/go/pkg/beam/core/runtime/exec.callNoPanic.func1()
<https://ci-beam.apache.org/job/beam_LoadTests_Go_GBK_Flink_Batch/ws/src/sdks/go/pkg/beam/core/runtime/exec/util.go>:58 +0xa5
panic({0x14a3060, 0xc0005f5780})
/home/jenkins/sdk/go1.20.4/src/runtime/panic.go:884 +0x213
github.com/apache/beam/sdks/v2/go/pkg/beam/register.(*emit2[...]).invoke(0x18cec60, {0xc000a783f8, 0x40a90d?, 0x1?}, {0xc000a78400?, 0x9, 0x9})
<https://ci-beam.apache.org/job/beam_LoadTests_Go_GBK_Flink_Batch/ws/src/sdks/go/pkg/beam/register/emitter.go>:81 +0x22f
github.com/apache/beam/sdks/v2/go/test/load.(*RuntimeMonitor).ProcessElement(0x240e3b0?, {0xc000a783f8?, 0x1?, 0x1?}, {0xc000a78400?, 0x9?, 0x9?}, 0xc00015c2d0?)
<https://ci-beam.apache.org/job/beam_LoadTests_Go_GBK_Flink_Batch/ws/src/sdks/go/test/load/util.go>:87 +0x39
github.com/apache/beam/sdks/v2/go/pkg/beam/register.registerDoFn3x0StructWrappersAndFuncs[...].func2.1({0xc000a78400, 0x9, 0x9}, 0x46eb0a)
<https://ci-beam.apache.org/job/beam_LoadTests_Go_GBK_Flink_Batch/ws/src/sdks/go/pkg/beam/register/register.go>:2469 +0x9c
github.com/apache/beam/sdks/v2/go/pkg/beam/register.(*caller3x0[...]).Call3x0(0x46c383?, {0x12cfee0?, 0xc000a73b30?}, {0x12cfee0?, 0xc000a73b48?}, {0x1302160?, 0xc00015c2d0?})
<https://ci-beam.apache.org/job/beam_LoadTests_Go_GBK_Flink_Batch/ws/src/sdks/go/pkg/beam/register/register.go>:2458 +0x7f
github.com/apache/beam/sdks/v2/go/pkg/beam/core/runtime/exec.(*invoker).initCall.func4({0x0, 0x0, 0x0, 0x0, 0x0}, {0x23bbaf0?, 0x1?, 0x1?}, 0xffdf3b645a1cac09?)
<https://ci-beam.apache.org/job/beam_LoadTests_Go_GBK_Flink_Batch/ws/src/sdks/go/pkg/beam/core/runtime/exec/fn_arity.go>:55 +0x75
github.com/apache/beam/sdks/v2/go/pkg/beam/core/runtime/exec.(*invoker).invokeWithOpts(0xc0002da280, {0x18cd550?, 0xc000289340}, {0x0, 0x0, 0x0, 0x0, 0x0}, {0x23bbaf0, 0x1, ...}, ...)
<https://ci-beam.apache.org/job/beam_LoadTests_Go_GBK_Flink_Batch/ws/src/sdks/go/pkg/beam/core/runtime/exec/fn.go>:297 +0xfec
github.com/apache/beam/sdks/v2/go/pkg/beam/core/runtime/exec.(*ParDo).invokeProcessFn(0xc00014dd40, {0x18cd550, 0xc000289340}, {0x0, 0x0, 0x0, 0x0, 0x0}, {0x23bbaf0, 0x1, ...}, ...)
<https://ci-beam.apache.org/job/beam_LoadTests_Go_GBK_Flink_Batch/ws/src/sdks/go/pkg/beam/core/runtime/exec/pardo.go>:508 +0x2b5
github.com/apache/beam/sdks/v2/go/pkg/beam/core/runtime/exec.(*ParDo).processSingleWindow(0xc00014dd40, 0xc000a7a090)
<https://ci-beam.apache.org/job/beam_LoadTests_Go_GBK_Flink_Batch/ws/src/sdks/go/pkg/beam/core/runtime/exec/pardo.go>:194 +0x9b
github.com/apache/beam/sdks/v2/go/pkg/beam/core/runtime/exec.(*ParDo).processMainInput(0x4273c0?, 0x18cd550?)
<https://ci-beam.apache.org/job/beam_LoadTests_Go_GBK_Flink_Batch/ws/src/sdks/go/pkg/beam/core/runtime/exec/pardo.go>:172 +0x91
github.com/apache/beam/sdks/v2/go/pkg/beam/core/runtime/exec.(*ParDo).ProcessElement(0xc00014dd40, {0x18?, 0xc000062c00?}, 0xc0002bcbe8, {0x0, 0x0, 0x0})
<https://ci-beam.apache.org/job/beam_LoadTests_Go_GBK_Flink_Batch/ws/src/sdks/go/pkg/beam/core/runtime/exec/pardo.go>:156 +0x125
github.com/apache/beam/sdks/v2/go/pkg/beam/core/runtime/exec.(*PCollection).ProcessElement(0xc000a78400?, {0x18cd550?, 0xc000289300?}, 0x4214c7?, {0x0?, 0x200?, 0x40?})
<https://ci-beam.apache.org/job/beam_LoadTests_Go_GBK_Flink_Batch/ws/src/sdks/go/pkg/beam/core/runtime/exec/pcollection.go>:100 +0x151
github.com/apache/beam/sdks/v2/go/pkg/beam/register.(*emit2[...]).invoke(0x18cec60, {0xc000a783f8, 0xc0000b66e8?, 0x18bb7f8?}, {0xc000a78400?, 0x9, 0x9})
<https://ci-beam.apache.org/job/beam_LoadTests_Go_GBK_Flink_Batch/ws/src/sdks/go/pkg/beam/register/emitter.go>:80 +0x20f
github.com/apache/beam/sdks/v2/go/pkg/beam/io/synthetic.(*sourceFn).ProcessElement(0xc00023bfa0, 0x7f0a8dbd5108?, {0xbebc200, 0x1, 0x1, 0x9, 0x0, 0x0}, 0xc00015c618)
<https://ci-beam.apache.org/job/beam_LoadTests_Go_GBK_Flink_Batch/ws/src/sdks/go/pkg/beam/io/synthetic/source.go>:151 +0x123
github.com/apache/beam/sdks/v2/go/pkg/beam/register.registerDoFn3x1StructWrappersAndFuncs[...].func2.1({0xbebc200?, 0x1, 0x1, 0x9, 0x0, 0x0}, 0x0)
<https://ci-beam.apache.org/job/beam_LoadTests_Go_GBK_Flink_Batch/ws/src/sdks/go/pkg/beam/register/register.go>:3382 +0xb0
github.com/apache/beam/sdks/v2/go/pkg/beam/register.(*caller3x1[...]).Call3x1(0x0?, {0x157e0a0?, 0xc00015c5e8?}, {0x15d4a80?, 0xc0000a4240?}, {0x1302160?, 0xc00015c618?})
<https://ci-beam.apache.org/job/beam_LoadTests_Go_GBK_Flink_Batch/ws/src/sdks/go/pkg/beam/register/register.go>:3371 +0xb6
github.com/apache/beam/sdks/v2/go/pkg/beam/core/runtime/exec.(*invoker).initCall.func13({0x0, 0x0, 0x0, 0x0, 0x0}, {0x23bbaf0, 0x1, 0x1}, 0x7f0a8dbd5108?)
<https://ci-beam.apache.org/job/beam_LoadTests_Go_GBK_Flink_Batch/ws/src/sdks/go/pkg/beam/core/runtime/exec/fn_arity.go>:109 +0xad
github.com/apache/beam/sdks/v2/go/pkg/beam/core/runtime/exec.(*invoker).invokeWithOpts(0xc0002da3c0, {0x18cd550?, 0xc000289300}, {0x0, 0x0, 0x0, 0x0, 0x0}, {0x23bbaf0, 0x1, ...}, ...)
<https://ci-beam.apache.org/job/beam_LoadTests_Go_GBK_Flink_Batch/ws/src/sdks/go/pkg/beam/core/runtime/exec/fn.go>:297 +0xfec
github.com/apache/beam/sdks/v2/go/pkg/beam/core/runtime/exec.(*ParDo).invokeProcessFn(0xc0002f2000, {0x18cd550, 0xc000289300}, {0x0, 0x0, 0x0, 0x0, 0x0}, {0x23bbaf0, 0x1, ...}, ...)
<https://ci-beam.apache.org/job/beam_LoadTests_Go_GBK_Flink_Batch/ws/src/sdks/go/pkg/beam/core/runtime/exec/pardo.go>:508 +0x2b5
github.com/apache/beam/sdks/v2/go/pkg/beam/core/runtime/exec.(*ParDo).processSingleWindow(0xc0002f2000, 0xc00060c990)
<https://ci-beam.apache.org/job/beam_LoadTests_Go_GBK_Flink_Batch/ws/src/sdks/go/pkg/beam/core/runtime/exec/pardo.go>:194 +0x9b
github.com/apache/beam/sdks/v2/go/pkg/beam/core/runtime/exec.(*ProcessSizedElementsAndRestrictions).ProcessElement(0xc00015bf40, {0x18cd550, 0xc0001236c0}, 0xc00018fe30, {0x0, 0x0, 0x0})
<https://ci-beam.apache.org/job/beam_LoadTests_Go_GBK_Flink_Batch/ws/src/sdks/go/pkg/beam/core/runtime/exec/sdf.go>:556 +0x63d
github.com/apache/beam/sdks/v2/go/pkg/beam/core/runtime/exec.(*DataSource).Process.func1(0xc00015c2e8, {0xc0000b7340?, 0xc0004ba8c0?})
<https://ci-beam.apache.org/job/beam_LoadTests_Go_GBK_Flink_Batch/ws/src/sdks/go/pkg/beam/core/runtime/exec/datasource.go>:241 +0x21e
github.com/apache/beam/sdks/v2/go/pkg/beam/core/runtime/exec.(*DataSource).process(0xc0004a1340, {0x18cd550, 0xc0001236c0}, 0xc0000b7630, 0xc0000b7610)
<https://ci-beam.apache.org/job/beam_LoadTests_Go_GBK_Flink_Batch/ws/src/sdks/go/pkg/beam/core/runtime/exec/datasource.go>:147 +0x4f6
github.com/apache/beam/sdks/v2/go/pkg/beam/core/runtime/exec.(*DataSource).Process(0xc0004a1340, {0x18cd550, 0xc0001236c0})
<https://ci-beam.apache.org/job/beam_LoadTests_Go_GBK_Flink_Batch/ws/src/sdks/go/pkg/beam/core/runtime/exec/datasource.go>:215 +0x226
github.com/apache/beam/sdks/v2/go/pkg/beam/core/runtime/exec.(*Plan).Execute.func2({0x18cd550?, 0xc0001236c0?})
<https://ci-beam.apache.org/job/beam_LoadTests_Go_GBK_Flink_Batch/ws/src/sdks/go/pkg/beam/core/runtime/exec/plan.go>:151 +0x42
github.com/apache/beam/sdks/v2/go/pkg/beam/core/runtime/exec.callNoPanic({0x18cd550?, 0xc0001236c0?}, 0x415d50?)
<https://ci-beam.apache.org/job/beam_LoadTests_Go_GBK_Flink_Batch/ws/src/sdks/go/pkg/beam/core/runtime/exec/util.go>:62 +0x6c
github.com/apache/beam/sdks/v2/go/pkg/beam/core/runtime/exec.(*Plan).Execute(0xc0001a35f0, {0x18cd550, 0xc0001236c0}, {0x2362c98, 0x1}, {{0x18bf410?, 0xc000289240?}, {0x18f9998?, 0xc0002c8c30?}})
<https://ci-beam.apache.org/job/beam_LoadTests_Go_GBK_Flink_Batch/ws/src/sdks/go/pkg/beam/core/runtime/exec/plan.go>:150 +0x3df
github.com/apache/beam/sdks/v2/go/pkg/beam/core/runtime/harness.(*control).handleInstruction(0xc000156000, {0x18cd438?, 0xc000609ce0?}, 0xc0000965a0)
<https://ci-beam.apache.org/job/beam_LoadTests_Go_GBK_Flink_Batch/ws/src/sdks/go/pkg/beam/core/runtime/harness/harness.go>:408 +0xa53
github.com/apache/beam/sdks/v2/go/pkg/beam/core/runtime/harness.MainWithOptions.func4({0x18cd438?, 0xc000609ce0?}, 0x0?)
<https://ci-beam.apache.org/job/beam_LoadTests_Go_GBK_Flink_Batch/ws/src/sdks/go/pkg/beam/core/runtime/harness/harness.go>:195 +0x7a
created by github.com/apache/beam/sdks/v2/go/pkg/beam/core/runtime/harness.MainWithOptions
<https://ci-beam.apache.org/job/beam_LoadTests_Go_GBK_Flink_Batch/ws/src/sdks/go/pkg/beam/core/runtime/harness/harness.go>:213 +0xf1d
2023/06/10 08:07:53 Job state: FAILED
2023/06/10 08:07:53 Failed to execute job: job load0tests0go0flink0batch0gbk0100610065412-root-0610080532-f5d3412c_d4922b33-d529-46f2-a76c-9b988e942da7 failed
panic: Failed to execute job: job load0tests0go0flink0batch0gbk0100610065412-root-0610080532-f5d3412c_d4922b33-d529-46f2-a76c-9b988e942da7 failed
goroutine 1 [running]:
github.com/apache/beam/sdks/v2/go/pkg/beam/log.Fatalf({0x18cd3c8, 0xc00004c0c0}, {0x1747d67?, 0x240e3b0?}, {0xc000637e70?, 0x0?, 0x0?})
<https://ci-beam.apache.org/job/beam_LoadTests_Go_GBK_Flink_Batch/ws/src/sdks/go/pkg/beam/log/log.go>:162 +0x8c
main.main()
<https://ci-beam.apache.org/job/beam_LoadTests_Go_GBK_Flink_Batch/ws/src/sdks/go/test/load/group_by_key/group_by_key.go>:98 +0x3eb
> Task :sdks:go:test:load:run FAILED
FAILURE: Build failed with an exception.
* Where:
Build file '<https://ci-beam.apache.org/job/beam_LoadTests_Go_GBK_Flink_Batch/ws/src/sdks/go/test/load/build.gradle'> line: 31
* What went wrong:
Execution failed for task ':sdks:go:test:load:run'.
> Process 'command 'sh'' finished with non-zero exit value 2
* Try:
> Run with --stacktrace option to get the stack trace.
> Run with --info or --debug option to get more log output.
* Get more help at https://help.gradle.org
BUILD FAILED in 2m 58s
12 actionable tasks: 6 executed, 4 from cache, 2 up-to-date
Publishing build scan...
https://ge.apache.org/s/6ybidgwqldcnw
Build step 'Invoke Gradle script' changed build result to FAILURE
Build step 'Invoke Gradle script' marked build as failure
---------------------------------------------------------------------
To unsubscribe, e-mail: builds-unsubscribe@beam.apache.org
For additional commands, e-mail: builds-help@beam.apache.org
Jenkins build is back to normal : beam_LoadTests_Go_GBK_Flink_Batch #925
Posted by Apache Jenkins Server <je...@builds.apache.org>.
See <https://ci-beam.apache.org/job/beam_LoadTests_Go_GBK_Flink_Batch/925/display/redirect>
---------------------------------------------------------------------
To unsubscribe, e-mail: builds-unsubscribe@beam.apache.org
For additional commands, e-mail: builds-help@beam.apache.org
Build failed in Jenkins: beam_LoadTests_Go_GBK_Flink_Batch #924
Posted by Apache Jenkins Server <je...@builds.apache.org>.
See <https://ci-beam.apache.org/job/beam_LoadTests_Go_GBK_Flink_Batch/924/display/redirect>
Changes:
------------------------------------------
[...truncated 48.23 KB...]
github.com/apache/beam/sdks/v2/go/pkg/beam/core/runtime/exec.(*invoker).invokeWithOpts(0xc0000e9040, {0x18cd570?, 0xc00037cb80}, {0x0, 0x0, 0x0, 0x0, 0x0}, {0x23bbaf0, 0x1, ...}, ...)
<https://ci-beam.apache.org/job/beam_LoadTests_Go_GBK_Flink_Batch/ws/src/sdks/go/pkg/beam/core/runtime/exec/fn.go>:297 +0xfec
github.com/apache/beam/sdks/v2/go/pkg/beam/core/runtime/exec.(*ParDo).invokeProcessFn(0xc0003a6120, {0x18cd570, 0xc00037cb80}, {0x0, 0x0, 0x0, 0x0, 0x0}, {0x23bbaf0, 0x1, ...}, ...)
<https://ci-beam.apache.org/job/beam_LoadTests_Go_GBK_Flink_Batch/ws/src/sdks/go/pkg/beam/core/runtime/exec/pardo.go>:508 +0x2b5
github.com/apache/beam/sdks/v2/go/pkg/beam/core/runtime/exec.(*ParDo).processSingleWindow(0xc0003a6120, 0xc000468480)
<https://ci-beam.apache.org/job/beam_LoadTests_Go_GBK_Flink_Batch/ws/src/sdks/go/pkg/beam/core/runtime/exec/pardo.go>:194 +0x9b
github.com/apache/beam/sdks/v2/go/pkg/beam/core/runtime/exec.(*ProcessSizedElementsAndRestrictions).ProcessElement(0xc0003a4140, {0x18cd570, 0xc0000fe400}, 0xc00003e310, {0x0, 0x0, 0x0})
<https://ci-beam.apache.org/job/beam_LoadTests_Go_GBK_Flink_Batch/ws/src/sdks/go/pkg/beam/core/runtime/exec/sdf.go>:556 +0x63d
github.com/apache/beam/sdks/v2/go/pkg/beam/core/runtime/exec.(*DataSource).Process.func1(0xc000033e78, {0xc000223340?, 0xc0004ba760?})
<https://ci-beam.apache.org/job/beam_LoadTests_Go_GBK_Flink_Batch/ws/src/sdks/go/pkg/beam/core/runtime/exec/datasource.go>:241 +0x21e
github.com/apache/beam/sdks/v2/go/pkg/beam/core/runtime/exec.(*DataSource).process(0xc0003a0000, {0x18cd570, 0xc0000fe400}, 0xc000223630, 0xc000223610)
<https://ci-beam.apache.org/job/beam_LoadTests_Go_GBK_Flink_Batch/ws/src/sdks/go/pkg/beam/core/runtime/exec/datasource.go>:147 +0x4f6
github.com/apache/beam/sdks/v2/go/pkg/beam/core/runtime/exec.(*DataSource).Process(0xc0003a0000, {0x18cd570, 0xc0000fe400})
<https://ci-beam.apache.org/job/beam_LoadTests_Go_GBK_Flink_Batch/ws/src/sdks/go/pkg/beam/core/runtime/exec/datasource.go>:215 +0x226
github.com/apache/beam/sdks/v2/go/pkg/beam/core/runtime/exec.(*Plan).Execute.func2({0x18cd570?, 0xc0000fe400?})
<https://ci-beam.apache.org/job/beam_LoadTests_Go_GBK_Flink_Batch/ws/src/sdks/go/pkg/beam/core/runtime/exec/plan.go>:151 +0x42
github.com/apache/beam/sdks/v2/go/pkg/beam/core/runtime/exec.callNoPanic({0x18cd570?, 0xc0000fe400?}, 0x415d50?)
<https://ci-beam.apache.org/job/beam_LoadTests_Go_GBK_Flink_Batch/ws/src/sdks/go/pkg/beam/core/runtime/exec/util.go>:62 +0x6c
github.com/apache/beam/sdks/v2/go/pkg/beam/core/runtime/exec.(*Plan).Execute(0xc000301560, {0x18cd570, 0xc0000fe400}, {0x2362c98, 0x1}, {{0x18bf430?, 0xc00037cac0?}, {0x18f99b8?, 0xc000361bc0?}})
<https://ci-beam.apache.org/job/beam_LoadTests_Go_GBK_Flink_Batch/ws/src/sdks/go/pkg/beam/core/runtime/exec/plan.go>:150 +0x3df
github.com/apache/beam/sdks/v2/go/pkg/beam/core/runtime/harness.(*control).handleInstruction(0xc0002ba000, {0x18cd458?, 0xc000090cf0?}, 0xc000314f00)
<https://ci-beam.apache.org/job/beam_LoadTests_Go_GBK_Flink_Batch/ws/src/sdks/go/pkg/beam/core/runtime/harness/harness.go>:408 +0xa53
github.com/apache/beam/sdks/v2/go/pkg/beam/core/runtime/harness.MainWithOptions.func4({0x18cd458?, 0xc000090cf0?}, 0xc00011c348?)
<https://ci-beam.apache.org/job/beam_LoadTests_Go_GBK_Flink_Batch/ws/src/sdks/go/pkg/beam/core/runtime/harness/harness.go>:195 +0x7a
created by github.com/apache/beam/sdks/v2/go/pkg/beam/core/runtime/harness.MainWithOptions
<https://ci-beam.apache.org/job/beam_LoadTests_Go_GBK_Flink_Batch/ws/src/sdks/go/pkg/beam/core/runtime/harness/harness.go>:213 +0xf1d
at java.util.concurrent.CompletableFuture.reportGet(CompletableFuture.java:395)
at java.util.concurrent.CompletableFuture.get(CompletableFuture.java:1999)
at org.apache.beam.sdk.util.MoreFutures.get(MoreFutures.java:61)
at org.apache.beam.runners.fnexecution.control.SdkHarnessClient$BundleProcessor$ActiveBundle.close(SdkHarnessClient.java:522)
at org.apache.beam.runners.fnexecution.control.DefaultJobBundleFactory$SimpleStageBundleFactory$1.close(DefaultJobBundleFactory.java:556)
at org.apache.beam.runners.flink.translation.functions.FlinkExecutableStageFunction.$closeResource(FlinkExecutableStageFunction.java:269)
at org.apache.beam.runners.flink.translation.functions.FlinkExecutableStageFunction.mapPartition(FlinkExecutableStageFunction.java:269)
at org.apache.flink.runtime.operators.MapPartitionDriver.run(MapPartitionDriver.java:113)
at org.apache.flink.runtime.operators.BatchTask.run(BatchTask.java:514)
at org.apache.flink.runtime.operators.BatchTask.invoke(BatchTask.java:357)
at org.apache.flink.runtime.taskmanager.Task.runWithSystemExitMonitoring(Task.java:948)
at org.apache.flink.runtime.taskmanager.Task.restoreAndInvoke(Task.java:927)
at org.apache.flink.runtime.taskmanager.Task.doRun(Task.java:741)
at org.apache.flink.runtime.taskmanager.Task.run(Task.java:563)
at java.lang.Thread.run(Thread.java:829)
Caused by: java.lang.RuntimeException: Error received from SDK harness for instruction 3: process bundle failed for instruction 3 using plan 1-3 : panic: datamgr.go [{3 fn/write/n4:0}]: error flushing buffer of length 4000000
caused by:
rpc error: code = Unknown desc =
Full error:
while executing Process for Plan[1-3]:
2: DataSink[S[fn/write/n4:0@localhost:36107]] Coder:W;fn/wire/n4:0<KV;c1<bytes;c0,bytes;c0>>!GWC
3: PCollection[n4] Out:[2]
4: ParDo[load.RuntimeMonitor] Out:[2] Sig: func([]uint8, []uint8, func([]uint8, []uint8))
5: PCollection[n3] Out:[4]
6: SDF.ProcessSizedElementsAndRestrictions[synthetic.sourceFn] UID:6 Out:[5]
1: DataSource[S[fn/read/n2/SplitAndSize0:0@localhost:36107], local_output] Out:6 Coder:W;fn/wire/n2/SplitAndSize0:0<KV;c5/SplitAndSize0<KV;c5/PairWithRestriction0<R;c5[synthetic.SourceConfig],KV;c9<offsetrange.Restriction[offsetrange.Restriction;c6];c7,bool;c8>>,double;DoubleCoder0>>!GWC
caused by:
panic: datamgr.go [{3 fn/write/n4:0}]: error flushing buffer of length 4000000
caused by:
rpc error: code = Unknown desc = goroutine 30 [running]:
runtime/debug.Stack()
/home/jenkins/sdk/go1.20.4/src/runtime/debug/stack.go:24 +0x65
github.com/apache/beam/sdks/v2/go/pkg/beam/core/runtime/exec.callNoPanic.func1()
<https://ci-beam.apache.org/job/beam_LoadTests_Go_GBK_Flink_Batch/ws/src/sdks/go/pkg/beam/core/runtime/exec/util.go>:58 +0xa5
panic({0x14a3060, 0xc0000fe280})
/home/jenkins/sdk/go1.20.4/src/runtime/panic.go:884 +0x213
github.com/apache/beam/sdks/v2/go/pkg/beam/register.(*emit2[...]).invoke(0x18cec80, {0xc000a857b8, 0x40a90d?, 0x1?}, {0xc000a857c0?, 0x9, 0x9})
<https://ci-beam.apache.org/job/beam_LoadTests_Go_GBK_Flink_Batch/ws/src/sdks/go/pkg/beam/register/emitter.go>:81 +0x22f
github.com/apache/beam/sdks/v2/go/test/load.(*RuntimeMonitor).ProcessElement(0x240e3b0?, {0xc000a857b8?, 0x1?, 0x1?}, {0xc000a857c0?, 0x9?, 0x9?}, 0xc000033e60?)
<https://ci-beam.apache.org/job/beam_LoadTests_Go_GBK_Flink_Batch/ws/src/sdks/go/test/load/util.go>:87 +0x39
github.com/apache/beam/sdks/v2/go/pkg/beam/register.registerDoFn3x0StructWrappersAndFuncs[...].func2.1({0xc000a857c0, 0x9, 0x9}, 0x46eb0a)
<https://ci-beam.apache.org/job/beam_LoadTests_Go_GBK_Flink_Batch/ws/src/sdks/go/pkg/beam/register/register.go>:2469 +0x9c
github.com/apache/beam/sdks/v2/go/pkg/beam/register.(*caller3x0[...]).Call3x0(0x46c383?, {0x12cfee0?, 0xc000a8f6c8?}, {0x12cfee0?, 0xc000a8f6e0?}, {0x1302160?, 0xc000033e60?})
<https://ci-beam.apache.org/job/beam_LoadTests_Go_GBK_Flink_Batch/ws/src/sdks/go/pkg/beam/register/register.go>:2458 +0x7f
github.com/apache/beam/sdks/v2/go/pkg/beam/core/runtime/exec.(*invoker).initCall.func4({0x0, 0x0, 0x0, 0x0, 0x0}, {0x23bbaf0?, 0x1?, 0x1?}, 0xffdf3b645a1cac09?)
<https://ci-beam.apache.org/job/beam_LoadTests_Go_GBK_Flink_Batch/ws/src/sdks/go/pkg/beam/core/runtime/exec/fn_arity.go>:55 +0x75
github.com/apache/beam/sdks/v2/go/pkg/beam/core/runtime/exec.(*invoker).invokeWithOpts(0xc0000e8dc0, {0x18cd570?, 0xc00037cbc0}, {0x0, 0x0, 0x0, 0x0, 0x0}, {0x23bbaf0, 0x1, ...}, ...)
<https://ci-beam.apache.org/job/beam_LoadTests_Go_GBK_Flink_Batch/ws/src/sdks/go/pkg/beam/core/runtime/exec/fn.go>:297 +0xfec
github.com/apache/beam/sdks/v2/go/pkg/beam/core/runtime/exec.(*ParDo).invokeProcessFn(0xc0001fde60, {0x18cd570, 0xc00037cbc0}, {0x0, 0x0, 0x0, 0x0, 0x0}, {0x23bbaf0, 0x1, ...}, ...)
<https://ci-beam.apache.org/job/beam_LoadTests_Go_GBK_Flink_Batch/ws/src/sdks/go/pkg/beam/core/runtime/exec/pardo.go>:508 +0x2b5
github.com/apache/beam/sdks/v2/go/pkg/beam/core/runtime/exec.(*ParDo).processSingleWindow(0xc0001fde60, 0xc000a92cf0)
<https://ci-beam.apache.org/job/beam_LoadTests_Go_GBK_Flink_Batch/ws/src/sdks/go/pkg/beam/core/runtime/exec/pardo.go>:194 +0x9b
github.com/apache/beam/sdks/v2/go/pkg/beam/core/runtime/exec.(*ParDo).processMainInput(0x155?, 0x18cd570?)
<https://ci-beam.apache.org/job/beam_LoadTests_Go_GBK_Flink_Batch/ws/src/sdks/go/pkg/beam/core/runtime/exec/pardo.go>:172 +0x91
github.com/apache/beam/sdks/v2/go/pkg/beam/core/runtime/exec.(*ParDo).ProcessElement(0xc0001fde60, {0x18?, 0x23df880?}, 0xc0000e3dc8, {0x0, 0x0, 0x0})
<https://ci-beam.apache.org/job/beam_LoadTests_Go_GBK_Flink_Batch/ws/src/sdks/go/pkg/beam/core/runtime/exec/pardo.go>:156 +0x125
github.com/apache/beam/sdks/v2/go/pkg/beam/core/runtime/exec.(*PCollection).ProcessElement(0xc000a857c0?, {0x18cd570?, 0xc00037cb80?}, 0x4214c7?, {0x0?, 0x200?, 0x140?})
<https://ci-beam.apache.org/job/beam_LoadTests_Go_GBK_Flink_Batch/ws/src/sdks/go/pkg/beam/core/runtime/exec/pcollection.go>:100 +0x151
github.com/apache/beam/sdks/v2/go/pkg/beam/register.(*emit2[...]).invoke(0x18cec80, {0xc000a857b8, 0xc0002226e8?, 0x18bb818?}, {0xc000a857c0?, 0x9, 0x9})
<https://ci-beam.apache.org/job/beam_LoadTests_Go_GBK_Flink_Batch/ws/src/sdks/go/pkg/beam/register/emitter.go>:80 +0x20f
github.com/apache/beam/sdks/v2/go/pkg/beam/io/synthetic.(*sourceFn).ProcessElement(0xc000374ae0, 0x7fcc8d4aa5b8?, {0xbebc200, 0x1, 0x1, 0x9, 0x0, 0x0}, 0xc00011ab70)
<https://ci-beam.apache.org/job/beam_LoadTests_Go_GBK_Flink_Batch/ws/src/sdks/go/pkg/beam/io/synthetic/source.go>:151 +0x123
github.com/apache/beam/sdks/v2/go/pkg/beam/register.registerDoFn3x1StructWrappersAndFuncs[...].func2.1({0xbebc200?, 0x1, 0x1, 0x9, 0x0, 0x0}, 0x0)
<https://ci-beam.apache.org/job/beam_LoadTests_Go_GBK_Flink_Batch/ws/src/sdks/go/pkg/beam/register/register.go>:3382 +0xb0
github.com/apache/beam/sdks/v2/go/pkg/beam/register.(*caller3x1[...]).Call3x1(0x0?, {0x157e0a0?, 0xc00011ab28?}, {0x15d4a80?, 0xc0000fc180?}, {0x1302160?, 0xc00011ab70?})
<https://ci-beam.apache.org/job/beam_LoadTests_Go_GBK_Flink_Batch/ws/src/sdks/go/pkg/beam/register/register.go>:3371 +0xb6
github.com/apache/beam/sdks/v2/go/pkg/beam/core/runtime/exec.(*invoker).initCall.func13({0x0, 0x0, 0x0, 0x0, 0x0}, {0x23bbaf0, 0x1, 0x1}, 0x7fcc8d4aa108?)
<https://ci-beam.apache.org/job/beam_LoadTests_Go_GBK_Flink_Batch/ws/src/sdks/go/pkg/beam/core/runtime/exec/fn_arity.go>:109 +0xad
github.com/apache/beam/sdks/v2/go/pkg/beam/core/runtime/exec.(*invoker).invokeWithOpts(0xc0000e9040, {0x18cd570?, 0xc00037cb80}, {0x0, 0x0, 0x0, 0x0, 0x0}, {0x23bbaf0, 0x1, ...}, ...)
<https://ci-beam.apache.org/job/beam_LoadTests_Go_GBK_Flink_Batch/ws/src/sdks/go/pkg/beam/core/runtime/exec/fn.go>:297 +0xfec
github.com/apache/beam/sdks/v2/go/pkg/beam/core/runtime/exec.(*ParDo).invokeProcessFn(0xc0003a6120, {0x18cd570, 0xc00037cb80}, {0x0, 0x0, 0x0, 0x0, 0x0}, {0x23bbaf0, 0x1, ...}, ...)
<https://ci-beam.apache.org/job/beam_LoadTests_Go_GBK_Flink_Batch/ws/src/sdks/go/pkg/beam/core/runtime/exec/pardo.go>:508 +0x2b5
github.com/apache/beam/sdks/v2/go/pkg/beam/core/runtime/exec.(*ParDo).processSingleWindow(0xc0003a6120, 0xc000468480)
<https://ci-beam.apache.org/job/beam_LoadTests_Go_GBK_Flink_Batch/ws/src/sdks/go/pkg/beam/core/runtime/exec/pardo.go>:194 +0x9b
github.com/apache/beam/sdks/v2/go/pkg/beam/core/runtime/exec.(*ProcessSizedElementsAndRestrictions).ProcessElement(0xc0003a4140, {0x18cd570, 0xc0000fe400}, 0xc00003e310, {0x0, 0x0, 0x0})
<https://ci-beam.apache.org/job/beam_LoadTests_Go_GBK_Flink_Batch/ws/src/sdks/go/pkg/beam/core/runtime/exec/sdf.go>:556 +0x63d
github.com/apache/beam/sdks/v2/go/pkg/beam/core/runtime/exec.(*DataSource).Process.func1(0xc000033e78, {0xc000223340?, 0xc0004ba760?})
<https://ci-beam.apache.org/job/beam_LoadTests_Go_GBK_Flink_Batch/ws/src/sdks/go/pkg/beam/core/runtime/exec/datasource.go>:241 +0x21e
github.com/apache/beam/sdks/v2/go/pkg/beam/core/runtime/exec.(*DataSource).process(0xc0003a0000, {0x18cd570, 0xc0000fe400}, 0xc000223630, 0xc000223610)
<https://ci-beam.apache.org/job/beam_LoadTests_Go_GBK_Flink_Batch/ws/src/sdks/go/pkg/beam/core/runtime/exec/datasource.go>:147 +0x4f6
github.com/apache/beam/sdks/v2/go/pkg/beam/core/runtime/exec.(*DataSource).Process(0xc0003a0000, {0x18cd570, 0xc0000fe400})
<https://ci-beam.apache.org/job/beam_LoadTests_Go_GBK_Flink_Batch/ws/src/sdks/go/pkg/beam/core/runtime/exec/datasource.go>:215 +0x226
github.com/apache/beam/sdks/v2/go/pkg/beam/core/runtime/exec.(*Plan).Execute.func2({0x18cd570?, 0xc0000fe400?})
<https://ci-beam.apache.org/job/beam_LoadTests_Go_GBK_Flink_Batch/ws/src/sdks/go/pkg/beam/core/runtime/exec/plan.go>:151 +0x42
github.com/apache/beam/sdks/v2/go/pkg/beam/core/runtime/exec.callNoPanic({0x18cd570?, 0xc0000fe400?}, 0x415d50?)
<https://ci-beam.apache.org/job/beam_LoadTests_Go_GBK_Flink_Batch/ws/src/sdks/go/pkg/beam/core/runtime/exec/util.go>:62 +0x6c
github.com/apache/beam/sdks/v2/go/pkg/beam/core/runtime/exec.(*Plan).Execute(0xc000301560, {0x18cd570, 0xc0000fe400}, {0x2362c98, 0x1}, {{0x18bf430?, 0xc00037cac0?}, {0x18f99b8?, 0xc000361bc0?}})
<https://ci-beam.apache.org/job/beam_LoadTests_Go_GBK_Flink_Batch/ws/src/sdks/go/pkg/beam/core/runtime/exec/plan.go>:150 +0x3df
github.com/apache/beam/sdks/v2/go/pkg/beam/core/runtime/harness.(*control).handleInstruction(0xc0002ba000, {0x18cd458?, 0xc000090cf0?}, 0xc000314f00)
<https://ci-beam.apache.org/job/beam_LoadTests_Go_GBK_Flink_Batch/ws/src/sdks/go/pkg/beam/core/runtime/harness/harness.go>:408 +0xa53
github.com/apache/beam/sdks/v2/go/pkg/beam/core/runtime/harness.MainWithOptions.func4({0x18cd458?, 0xc000090cf0?}, 0xc00011c348?)
<https://ci-beam.apache.org/job/beam_LoadTests_Go_GBK_Flink_Batch/ws/src/sdks/go/pkg/beam/core/runtime/harness/harness.go>:195 +0x7a
created by github.com/apache/beam/sdks/v2/go/pkg/beam/core/runtime/harness.MainWithOptions
<https://ci-beam.apache.org/job/beam_LoadTests_Go_GBK_Flink_Batch/ws/src/sdks/go/pkg/beam/core/runtime/harness/harness.go>:213 +0xf1d
at org.apache.beam.runners.fnexecution.control.FnApiControlClient$ResponseStreamObserver.onNext(FnApiControlClient.java:180)
at org.apache.beam.runners.fnexecution.control.FnApiControlClient$ResponseStreamObserver.onNext(FnApiControlClient.java:160)
at org.apache.beam.vendor.grpc.v1p54p0.io.grpc.stub.ServerCalls$StreamingServerCallHandler$StreamingServerCallListener.onMessage(ServerCalls.java:262)
at org.apache.beam.vendor.grpc.v1p54p0.io.grpc.ForwardingServerCallListener.onMessage(ForwardingServerCallListener.java:33)
at org.apache.beam.vendor.grpc.v1p54p0.io.grpc.Contexts$ContextualizedServerCallListener.onMessage(Contexts.java:76)
at org.apache.beam.vendor.grpc.v1p54p0.io.grpc.internal.ServerCallImpl$ServerStreamListenerImpl.messagesAvailableInternal(ServerCallImpl.java:333)
at org.apache.beam.vendor.grpc.v1p54p0.io.grpc.internal.ServerCallImpl$ServerStreamListenerImpl.messagesAvailable(ServerCallImpl.java:316)
at org.apache.beam.vendor.grpc.v1p54p0.io.grpc.internal.ServerImpl$JumpToApplicationThreadServerStreamListener$1MessagesAvailable.runInContext(ServerImpl.java:835)
at org.apache.beam.vendor.grpc.v1p54p0.io.grpc.internal.ContextRunnable.run(ContextRunnable.java:37)
at org.apache.beam.vendor.grpc.v1p54p0.io.grpc.internal.SerializingExecutor.run(SerializingExecutor.java:133)
at java.util.concurrent.ThreadPoolExecutor.runWorker(ThreadPoolExecutor.java:1128)
at java.util.concurrent.ThreadPoolExecutor$Worker.run(ThreadPoolExecutor.java:628)
... 1 more
2023/06/15 08:07:56 (): java.lang.RuntimeException: Error received from SDK harness for instruction 3: process bundle failed for instruction 3 using plan 1-3 : panic: datamgr.go [{3 fn/write/n4:0}]: error flushing buffer of length 4000000
caused by:
rpc error: code = Unknown desc =
Full error:
while executing Process for Plan[1-3]:
2: DataSink[S[fn/write/n4:0@localhost:36107]] Coder:W;fn/wire/n4:0<KV;c1<bytes;c0,bytes;c0>>!GWC
3: PCollection[n4] Out:[2]
4: ParDo[load.RuntimeMonitor] Out:[2] Sig: func([]uint8, []uint8, func([]uint8, []uint8))
5: PCollection[n3] Out:[4]
6: SDF.ProcessSizedElementsAndRestrictions[synthetic.sourceFn] UID:6 Out:[5]
1: DataSource[S[fn/read/n2/SplitAndSize0:0@localhost:36107], local_output] Out:6 Coder:W;fn/wire/n2/SplitAndSize0:0<KV;c5/SplitAndSize0<KV;c5/PairWithRestriction0<R;c5[synthetic.SourceConfig],KV;c9<offsetrange.Restriction[offsetrange.Restriction;c6];c7,bool;c8>>,double;DoubleCoder0>>!GWC
caused by:
panic: datamgr.go [{3 fn/write/n4:0}]: error flushing buffer of length 4000000
caused by:
rpc error: code = Unknown desc = goroutine 30 [running]:
runtime/debug.Stack()
/home/jenkins/sdk/go1.20.4/src/runtime/debug/stack.go:24 +0x65
github.com/apache/beam/sdks/v2/go/pkg/beam/core/runtime/exec.callNoPanic.func1()
<https://ci-beam.apache.org/job/beam_LoadTests_Go_GBK_Flink_Batch/ws/src/sdks/go/pkg/beam/core/runtime/exec/util.go>:58 +0xa5
panic({0x14a3060, 0xc0000fe280})
/home/jenkins/sdk/go1.20.4/src/runtime/panic.go:884 +0x213
github.com/apache/beam/sdks/v2/go/pkg/beam/register.(*emit2[...]).invoke(0x18cec80, {0xc000a857b8, 0x40a90d?, 0x1?}, {0xc000a857c0?, 0x9, 0x9})
<https://ci-beam.apache.org/job/beam_LoadTests_Go_GBK_Flink_Batch/ws/src/sdks/go/pkg/beam/register/emitter.go>:81 +0x22f
github.com/apache/beam/sdks/v2/go/test/load.(*RuntimeMonitor).ProcessElement(0x240e3b0?, {0xc000a857b8?, 0x1?, 0x1?}, {0xc000a857c0?, 0x9?, 0x9?}, 0xc000033e60?)
<https://ci-beam.apache.org/job/beam_LoadTests_Go_GBK_Flink_Batch/ws/src/sdks/go/test/load/util.go>:87 +0x39
github.com/apache/beam/sdks/v2/go/pkg/beam/register.registerDoFn3x0StructWrappersAndFuncs[...].func2.1({0xc000a857c0, 0x9, 0x9}, 0x46eb0a)
<https://ci-beam.apache.org/job/beam_LoadTests_Go_GBK_Flink_Batch/ws/src/sdks/go/pkg/beam/register/register.go>:2469 +0x9c
github.com/apache/beam/sdks/v2/go/pkg/beam/register.(*caller3x0[...]).Call3x0(0x46c383?, {0x12cfee0?, 0xc000a8f6c8?}, {0x12cfee0?, 0xc000a8f6e0?}, {0x1302160?, 0xc000033e60?})
<https://ci-beam.apache.org/job/beam_LoadTests_Go_GBK_Flink_Batch/ws/src/sdks/go/pkg/beam/register/register.go>:2458 +0x7f
github.com/apache/beam/sdks/v2/go/pkg/beam/core/runtime/exec.(*invoker).initCall.func4({0x0, 0x0, 0x0, 0x0, 0x0}, {0x23bbaf0?, 0x1?, 0x1?}, 0xffdf3b645a1cac09?)
<https://ci-beam.apache.org/job/beam_LoadTests_Go_GBK_Flink_Batch/ws/src/sdks/go/pkg/beam/core/runtime/exec/fn_arity.go>:55 +0x75
github.com/apache/beam/sdks/v2/go/pkg/beam/core/runtime/exec.(*invoker).invokeWithOpts(0xc0000e8dc0, {0x18cd570?, 0xc00037cbc0}, {0x0, 0x0, 0x0, 0x0, 0x0}, {0x23bbaf0, 0x1, ...}, ...)
<https://ci-beam.apache.org/job/beam_LoadTests_Go_GBK_Flink_Batch/ws/src/sdks/go/pkg/beam/core/runtime/exec/fn.go>:297 +0xfec
github.com/apache/beam/sdks/v2/go/pkg/beam/core/runtime/exec.(*ParDo).invokeProcessFn(0xc0001fde60, {0x18cd570, 0xc00037cbc0}, {0x0, 0x0, 0x0, 0x0, 0x0}, {0x23bbaf0, 0x1, ...}, ...)
<https://ci-beam.apache.org/job/beam_LoadTests_Go_GBK_Flink_Batch/ws/src/sdks/go/pkg/beam/core/runtime/exec/pardo.go>:508 +0x2b5
github.com/apache/beam/sdks/v2/go/pkg/beam/core/runtime/exec.(*ParDo).processSingleWindow(0xc0001fde60, 0xc000a92cf0)
<https://ci-beam.apache.org/job/beam_LoadTests_Go_GBK_Flink_Batch/ws/src/sdks/go/pkg/beam/core/runtime/exec/pardo.go>:194 +0x9b
github.com/apache/beam/sdks/v2/go/pkg/beam/core/runtime/exec.(*ParDo).processMainInput(0x155?, 0x18cd570?)
<https://ci-beam.apache.org/job/beam_LoadTests_Go_GBK_Flink_Batch/ws/src/sdks/go/pkg/beam/core/runtime/exec/pardo.go>:172 +0x91
github.com/apache/beam/sdks/v2/go/pkg/beam/core/runtime/exec.(*ParDo).ProcessElement(0xc0001fde60, {0x18?, 0x23df880?}, 0xc0000e3dc8, {0x0, 0x0, 0x0})
<https://ci-beam.apache.org/job/beam_LoadTests_Go_GBK_Flink_Batch/ws/src/sdks/go/pkg/beam/core/runtime/exec/pardo.go>:156 +0x125
github.com/apache/beam/sdks/v2/go/pkg/beam/core/runtime/exec.(*PCollection).ProcessElement(0xc000a857c0?, {0x18cd570?, 0xc00037cb80?}, 0x4214c7?, {0x0?, 0x200?, 0x140?})
<https://ci-beam.apache.org/job/beam_LoadTests_Go_GBK_Flink_Batch/ws/src/sdks/go/pkg/beam/core/runtime/exec/pcollection.go>:100 +0x151
github.com/apache/beam/sdks/v2/go/pkg/beam/register.(*emit2[...]).invoke(0x18cec80, {0xc000a857b8, 0xc0002226e8?, 0x18bb818?}, {0xc000a857c0?, 0x9, 0x9})
<https://ci-beam.apache.org/job/beam_LoadTests_Go_GBK_Flink_Batch/ws/src/sdks/go/pkg/beam/register/emitter.go>:80 +0x20f
github.com/apache/beam/sdks/v2/go/pkg/beam/io/synthetic.(*sourceFn).ProcessElement(0xc000374ae0, 0x7fcc8d4aa5b8?, {0xbebc200, 0x1, 0x1, 0x9, 0x0, 0x0}, 0xc00011ab70)
<https://ci-beam.apache.org/job/beam_LoadTests_Go_GBK_Flink_Batch/ws/src/sdks/go/pkg/beam/io/synthetic/source.go>:151 +0x123
github.com/apache/beam/sdks/v2/go/pkg/beam/register.registerDoFn3x1StructWrappersAndFuncs[...].func2.1({0xbebc200?, 0x1, 0x1, 0x9, 0x0, 0x0}, 0x0)
<https://ci-beam.apache.org/job/beam_LoadTests_Go_GBK_Flink_Batch/ws/src/sdks/go/pkg/beam/register/register.go>:3382 +0xb0
github.com/apache/beam/sdks/v2/go/pkg/beam/register.(*caller3x1[...]).Call3x1(0x0?, {0x157e0a0?, 0xc00011ab28?}, {0x15d4a80?, 0xc0000fc180?}, {0x1302160?, 0xc00011ab70?})
<https://ci-beam.apache.org/job/beam_LoadTests_Go_GBK_Flink_Batch/ws/src/sdks/go/pkg/beam/register/register.go>:3371 +0xb6
github.com/apache/beam/sdks/v2/go/pkg/beam/core/runtime/exec.(*invoker).initCall.func13({0x0, 0x0, 0x0, 0x0, 0x0}, {0x23bbaf0, 0x1, 0x1}, 0x7fcc8d4aa108?)
<https://ci-beam.apache.org/job/beam_LoadTests_Go_GBK_Flink_Batch/ws/src/sdks/go/pkg/beam/core/runtime/exec/fn_arity.go>:109 +0xad
github.com/apache/beam/sdks/v2/go/pkg/beam/core/runtime/exec.(*invoker).invokeWithOpts(0xc0000e9040, {0x18cd570?, 0xc00037cb80}, {0x0, 0x0, 0x0, 0x0, 0x0}, {0x23bbaf0, 0x1, ...}, ...)
<https://ci-beam.apache.org/job/beam_LoadTests_Go_GBK_Flink_Batch/ws/src/sdks/go/pkg/beam/core/runtime/exec/fn.go>:297 +0xfec
github.com/apache/beam/sdks/v2/go/pkg/beam/core/runtime/exec.(*ParDo).invokeProcessFn(0xc0003a6120, {0x18cd570, 0xc00037cb80}, {0x0, 0x0, 0x0, 0x0, 0x0}, {0x23bbaf0, 0x1, ...}, ...)
<https://ci-beam.apache.org/job/beam_LoadTests_Go_GBK_Flink_Batch/ws/src/sdks/go/pkg/beam/core/runtime/exec/pardo.go>:508 +0x2b5
github.com/apache/beam/sdks/v2/go/pkg/beam/core/runtime/exec.(*ParDo).processSingleWindow(0xc0003a6120, 0xc000468480)
<https://ci-beam.apache.org/job/beam_LoadTests_Go_GBK_Flink_Batch/ws/src/sdks/go/pkg/beam/core/runtime/exec/pardo.go>:194 +0x9b
github.com/apache/beam/sdks/v2/go/pkg/beam/core/runtime/exec.(*ProcessSizedElementsAndRestrictions).ProcessElement(0xc0003a4140, {0x18cd570, 0xc0000fe400}, 0xc00003e310, {0x0, 0x0, 0x0})
<https://ci-beam.apache.org/job/beam_LoadTests_Go_GBK_Flink_Batch/ws/src/sdks/go/pkg/beam/core/runtime/exec/sdf.go>:556 +0x63d
github.com/apache/beam/sdks/v2/go/pkg/beam/core/runtime/exec.(*DataSource).Process.func1(0xc000033e78, {0xc000223340?, 0xc0004ba760?})
<https://ci-beam.apache.org/job/beam_LoadTests_Go_GBK_Flink_Batch/ws/src/sdks/go/pkg/beam/core/runtime/exec/datasource.go>:241 +0x21e
github.com/apache/beam/sdks/v2/go/pkg/beam/core/runtime/exec.(*DataSource).process(0xc0003a0000, {0x18cd570, 0xc0000fe400}, 0xc000223630, 0xc000223610)
<https://ci-beam.apache.org/job/beam_LoadTests_Go_GBK_Flink_Batch/ws/src/sdks/go/pkg/beam/core/runtime/exec/datasource.go>:147 +0x4f6
github.com/apache/beam/sdks/v2/go/pkg/beam/core/runtime/exec.(*DataSource).Process(0xc0003a0000, {0x18cd570, 0xc0000fe400})
<https://ci-beam.apache.org/job/beam_LoadTests_Go_GBK_Flink_Batch/ws/src/sdks/go/pkg/beam/core/runtime/exec/datasource.go>:215 +0x226
github.com/apache/beam/sdks/v2/go/pkg/beam/core/runtime/exec.(*Plan).Execute.func2({0x18cd570?, 0xc0000fe400?})
<https://ci-beam.apache.org/job/beam_LoadTests_Go_GBK_Flink_Batch/ws/src/sdks/go/pkg/beam/core/runtime/exec/plan.go>:151 +0x42
github.com/apache/beam/sdks/v2/go/pkg/beam/core/runtime/exec.callNoPanic({0x18cd570?, 0xc0000fe400?}, 0x415d50?)
<https://ci-beam.apache.org/job/beam_LoadTests_Go_GBK_Flink_Batch/ws/src/sdks/go/pkg/beam/core/runtime/exec/util.go>:62 +0x6c
github.com/apache/beam/sdks/v2/go/pkg/beam/core/runtime/exec.(*Plan).Execute(0xc000301560, {0x18cd570, 0xc0000fe400}, {0x2362c98, 0x1}, {{0x18bf430?, 0xc00037cac0?}, {0x18f99b8?, 0xc000361bc0?}})
<https://ci-beam.apache.org/job/beam_LoadTests_Go_GBK_Flink_Batch/ws/src/sdks/go/pkg/beam/core/runtime/exec/plan.go>:150 +0x3df
github.com/apache/beam/sdks/v2/go/pkg/beam/core/runtime/harness.(*control).handleInstruction(0xc0002ba000, {0x18cd458?, 0xc000090cf0?}, 0xc000314f00)
<https://ci-beam.apache.org/job/beam_LoadTests_Go_GBK_Flink_Batch/ws/src/sdks/go/pkg/beam/core/runtime/harness/harness.go>:408 +0xa53
github.com/apache/beam/sdks/v2/go/pkg/beam/core/runtime/harness.MainWithOptions.func4({0x18cd458?, 0xc000090cf0?}, 0xc00011c348?)
<https://ci-beam.apache.org/job/beam_LoadTests_Go_GBK_Flink_Batch/ws/src/sdks/go/pkg/beam/core/runtime/harness/harness.go>:195 +0x7a
created by github.com/apache/beam/sdks/v2/go/pkg/beam/core/runtime/harness.MainWithOptions
<https://ci-beam.apache.org/job/beam_LoadTests_Go_GBK_Flink_Batch/ws/src/sdks/go/pkg/beam/core/runtime/harness/harness.go>:213 +0xf1d
2023/06/15 08:07:56 Job state: FAILED
2023/06/15 08:07:56 Failed to execute job: job load0tests0go0flink0batch0gbk0100615065412-root-0615080536-1e6a320_1da955c6-93ed-4080-b12b-043fa0f5317a failed
panic: Failed to execute job: job load0tests0go0flink0batch0gbk0100615065412-root-0615080536-1e6a320_1da955c6-93ed-4080-b12b-043fa0f5317a failed
goroutine 1 [running]:
github.com/apache/beam/sdks/v2/go/pkg/beam/log.Fatalf({0x18cd3e8, 0xc000126000}, {0x1747d67?, 0x240e3b0?}, {0xc000531e70?, 0x0?, 0x0?})
<https://ci-beam.apache.org/job/beam_LoadTests_Go_GBK_Flink_Batch/ws/src/sdks/go/pkg/beam/log/log.go>:162 +0x8c
main.main()
<https://ci-beam.apache.org/job/beam_LoadTests_Go_GBK_Flink_Batch/ws/src/sdks/go/test/load/group_by_key/group_by_key.go>:98 +0x3eb
> Task :sdks:go:test:load:run FAILED
FAILURE: Build failed with an exception.
* Where:
Build file '<https://ci-beam.apache.org/job/beam_LoadTests_Go_GBK_Flink_Batch/ws/src/sdks/go/test/load/build.gradle'> line: 31
* What went wrong:
Execution failed for task ':sdks:go:test:load:run'.
> Process 'command 'sh'' finished with non-zero exit value 2
* Try:
> Run with --stacktrace option to get the stack trace.
> Run with --info or --debug option to get more log output.
* Get more help at https://help.gradle.org
BUILD FAILED in 3m 5s
12 actionable tasks: 6 executed, 4 from cache, 2 up-to-date
Publishing build scan...
https://ge.apache.org/s/elmk7nhe2t5z6
Build step 'Invoke Gradle script' changed build result to FAILURE
Build step 'Invoke Gradle script' marked build as failure
---------------------------------------------------------------------
To unsubscribe, e-mail: builds-unsubscribe@beam.apache.org
For additional commands, e-mail: builds-help@beam.apache.org
Build failed in Jenkins: beam_LoadTests_Go_GBK_Flink_Batch #923
Posted by Apache Jenkins Server <je...@builds.apache.org>.
See <https://ci-beam.apache.org/job/beam_LoadTests_Go_GBK_Flink_Batch/923/display/redirect>
Changes:
------------------------------------------
[...truncated 48.38 KB...]
github.com/apache/beam/sdks/v2/go/pkg/beam/core/runtime/exec.(*invoker).invokeWithOpts(0xc0000a6500, {0x18cd550?, 0xc0002d4540}, {0x0, 0x0, 0x0, 0x0, 0x0}, {0x23bbaf0, 0x1, ...}, ...)
<https://ci-beam.apache.org/job/beam_LoadTests_Go_GBK_Flink_Batch/ws/src/sdks/go/pkg/beam/core/runtime/exec/fn.go>:297 +0xfec
github.com/apache/beam/sdks/v2/go/pkg/beam/core/runtime/exec.(*ParDo).invokeProcessFn(0xc00021ed80, {0x18cd550, 0xc0002d4540}, {0x0, 0x0, 0x0, 0x0, 0x0}, {0x23bbaf0, 0x1, ...}, ...)
<https://ci-beam.apache.org/job/beam_LoadTests_Go_GBK_Flink_Batch/ws/src/sdks/go/pkg/beam/core/runtime/exec/pardo.go>:508 +0x2b5
github.com/apache/beam/sdks/v2/go/pkg/beam/core/runtime/exec.(*ParDo).processSingleWindow(0xc00021ed80, 0xc0004281b0)
<https://ci-beam.apache.org/job/beam_LoadTests_Go_GBK_Flink_Batch/ws/src/sdks/go/pkg/beam/core/runtime/exec/pardo.go>:194 +0x9b
github.com/apache/beam/sdks/v2/go/pkg/beam/core/runtime/exec.(*ProcessSizedElementsAndRestrictions).ProcessElement(0xc0002b6e60, {0x18cd550, 0xc0000175c0}, 0xc0004eb2d0, {0x0, 0x0, 0x0})
<https://ci-beam.apache.org/job/beam_LoadTests_Go_GBK_Flink_Batch/ws/src/sdks/go/pkg/beam/core/runtime/exec/sdf.go>:556 +0x63d
github.com/apache/beam/sdks/v2/go/pkg/beam/core/runtime/exec.(*DataSource).Process.func1(0xc00011abb8, {0xc000223340?, 0xc000046080?})
<https://ci-beam.apache.org/job/beam_LoadTests_Go_GBK_Flink_Batch/ws/src/sdks/go/pkg/beam/core/runtime/exec/datasource.go>:241 +0x21e
github.com/apache/beam/sdks/v2/go/pkg/beam/core/runtime/exec.(*DataSource).process(0xc0000acf20, {0x18cd550, 0xc0000175c0}, 0xc000223630, 0xc000223610)
<https://ci-beam.apache.org/job/beam_LoadTests_Go_GBK_Flink_Batch/ws/src/sdks/go/pkg/beam/core/runtime/exec/datasource.go>:147 +0x4f6
github.com/apache/beam/sdks/v2/go/pkg/beam/core/runtime/exec.(*DataSource).Process(0xc0000acf20, {0x18cd550, 0xc0000175c0})
<https://ci-beam.apache.org/job/beam_LoadTests_Go_GBK_Flink_Batch/ws/src/sdks/go/pkg/beam/core/runtime/exec/datasource.go>:215 +0x226
github.com/apache/beam/sdks/v2/go/pkg/beam/core/runtime/exec.(*Plan).Execute.func2({0x18cd550?, 0xc0000175c0?})
<https://ci-beam.apache.org/job/beam_LoadTests_Go_GBK_Flink_Batch/ws/src/sdks/go/pkg/beam/core/runtime/exec/plan.go>:151 +0x42
github.com/apache/beam/sdks/v2/go/pkg/beam/core/runtime/exec.callNoPanic({0x18cd550?, 0xc0000175c0?}, 0x415d50?)
<https://ci-beam.apache.org/job/beam_LoadTests_Go_GBK_Flink_Batch/ws/src/sdks/go/pkg/beam/core/runtime/exec/util.go>:62 +0x6c
github.com/apache/beam/sdks/v2/go/pkg/beam/core/runtime/exec.(*Plan).Execute(0xc0002b8750, {0x18cd550, 0xc0000175c0}, {0x2362cb0, 0x1}, {{0x18bf410?, 0xc0002d4480?}, {0x18f9998?, 0xc0002d6570?}})
<https://ci-beam.apache.org/job/beam_LoadTests_Go_GBK_Flink_Batch/ws/src/sdks/go/pkg/beam/core/runtime/exec/plan.go>:150 +0x3df
github.com/apache/beam/sdks/v2/go/pkg/beam/core/runtime/harness.(*control).handleInstruction(0xc000480000, {0x18cd438?, 0xc0000019e0?}, 0xc000192ff0)
<https://ci-beam.apache.org/job/beam_LoadTests_Go_GBK_Flink_Batch/ws/src/sdks/go/pkg/beam/core/runtime/harness/harness.go>:408 +0xa53
github.com/apache/beam/sdks/v2/go/pkg/beam/core/runtime/harness.MainWithOptions.func4({0x18cd438?, 0xc0000019e0?}, 0xc0004c1680?)
<https://ci-beam.apache.org/job/beam_LoadTests_Go_GBK_Flink_Batch/ws/src/sdks/go/pkg/beam/core/runtime/harness/harness.go>:195 +0x7a
created by github.com/apache/beam/sdks/v2/go/pkg/beam/core/runtime/harness.MainWithOptions
<https://ci-beam.apache.org/job/beam_LoadTests_Go_GBK_Flink_Batch/ws/src/sdks/go/pkg/beam/core/runtime/harness/harness.go>:213 +0xf1d
at java.util.concurrent.CompletableFuture.reportGet(CompletableFuture.java:395)
at java.util.concurrent.CompletableFuture.get(CompletableFuture.java:1999)
at org.apache.beam.sdk.util.MoreFutures.get(MoreFutures.java:61)
at org.apache.beam.runners.fnexecution.control.SdkHarnessClient$BundleProcessor$ActiveBundle.close(SdkHarnessClient.java:522)
at org.apache.beam.runners.fnexecution.control.DefaultJobBundleFactory$SimpleStageBundleFactory$1.close(DefaultJobBundleFactory.java:556)
at org.apache.beam.runners.flink.translation.functions.FlinkExecutableStageFunction.$closeResource(FlinkExecutableStageFunction.java:269)
at org.apache.beam.runners.flink.translation.functions.FlinkExecutableStageFunction.mapPartition(FlinkExecutableStageFunction.java:269)
at org.apache.flink.runtime.operators.MapPartitionDriver.run(MapPartitionDriver.java:113)
at org.apache.flink.runtime.operators.BatchTask.run(BatchTask.java:514)
at org.apache.flink.runtime.operators.BatchTask.invoke(BatchTask.java:357)
at org.apache.flink.runtime.taskmanager.Task.runWithSystemExitMonitoring(Task.java:948)
at org.apache.flink.runtime.taskmanager.Task.restoreAndInvoke(Task.java:927)
at org.apache.flink.runtime.taskmanager.Task.doRun(Task.java:741)
at org.apache.flink.runtime.taskmanager.Task.run(Task.java:563)
at java.lang.Thread.run(Thread.java:829)
Caused by: java.lang.RuntimeException: Error received from SDK harness for instruction 6: process bundle failed for instruction 6 using plan 1-6 : panic: datamgr.go [{6 fn/write/n4:0}]: error flushing buffer of length 4000000
caused by:
rpc error: code = Unknown desc =
Full error:
while executing Process for Plan[1-6]:
2: DataSink[S[fn/write/n4:0@localhost:39755]] Coder:W;fn/wire/n4:0<KV;c1<bytes;c0,bytes;c0>>!GWC
3: PCollection[n4] Out:[2]
4: ParDo[load.RuntimeMonitor] Out:[2] Sig: func([]uint8, []uint8, func([]uint8, []uint8))
5: PCollection[n3] Out:[4]
6: SDF.ProcessSizedElementsAndRestrictions[synthetic.sourceFn] UID:6 Out:[5]
1: DataSource[S[fn/read/n2/SplitAndSize0:0@localhost:39755], local_output] Out:6 Coder:W;fn/wire/n2/SplitAndSize0:0<KV;c5/SplitAndSize0<KV;c5/PairWithRestriction0<R;c5[synthetic.SourceConfig],KV;c9<offsetrange.Restriction[offsetrange.Restriction;c6];c7,bool;c8>>,double;DoubleCoder0>>!GWC
caused by:
panic: datamgr.go [{6 fn/write/n4:0}]: error flushing buffer of length 4000000
caused by:
rpc error: code = Unknown desc = goroutine 35 [running]:
runtime/debug.Stack()
/home/jenkins/sdk/go1.20.4/src/runtime/debug/stack.go:24 +0x65
github.com/apache/beam/sdks/v2/go/pkg/beam/core/runtime/exec.callNoPanic.func1()
<https://ci-beam.apache.org/job/beam_LoadTests_Go_GBK_Flink_Batch/ws/src/sdks/go/pkg/beam/core/runtime/exec/util.go>:58 +0xa5
panic({0x14a3060, 0xc0003eb080})
/home/jenkins/sdk/go1.20.4/src/runtime/panic.go:884 +0x213
github.com/apache/beam/sdks/v2/go/pkg/beam/register.(*emit2[...]).invoke(0x18cec60, {0xc0009f21a8, 0x40a90d?, 0x0?}, {0xc0009f21b0?, 0x9, 0x9})
<https://ci-beam.apache.org/job/beam_LoadTests_Go_GBK_Flink_Batch/ws/src/sdks/go/pkg/beam/register/emitter.go>:81 +0x22f
github.com/apache/beam/sdks/v2/go/test/load.(*RuntimeMonitor).ProcessElement(0x240e3b0?, {0xc0009f21a8?, 0x1?, 0x1?}, {0xc0009f21b0?, 0x9?, 0x9?}, 0xc00011ab58?)
<https://ci-beam.apache.org/job/beam_LoadTests_Go_GBK_Flink_Batch/ws/src/sdks/go/test/load/util.go>:87 +0x39
github.com/apache/beam/sdks/v2/go/pkg/beam/register.registerDoFn3x0StructWrappersAndFuncs[...].func2.1({0xc0009f21b0, 0x9, 0x9}, 0x46eb0a)
<https://ci-beam.apache.org/job/beam_LoadTests_Go_GBK_Flink_Batch/ws/src/sdks/go/pkg/beam/register/register.go>:2469 +0x9c
github.com/apache/beam/sdks/v2/go/pkg/beam/register.(*caller3x0[...]).Call3x0(0x46c383?, {0x12cfee0?, 0xc0009f4228?}, {0x12cfee0?, 0xc0009f4240?}, {0x1302160?, 0xc00011ab58?})
<https://ci-beam.apache.org/job/beam_LoadTests_Go_GBK_Flink_Batch/ws/src/sdks/go/pkg/beam/register/register.go>:2458 +0x7f
github.com/apache/beam/sdks/v2/go/pkg/beam/core/runtime/exec.(*invoker).initCall.func4({0x0, 0x0, 0x0, 0x0, 0x0}, {0x23bbaf0?, 0x1?, 0x1?}, 0xffdf3b645a1cac09?)
<https://ci-beam.apache.org/job/beam_LoadTests_Go_GBK_Flink_Batch/ws/src/sdks/go/pkg/beam/core/runtime/exec/fn_arity.go>:55 +0x75
github.com/apache/beam/sdks/v2/go/pkg/beam/core/runtime/exec.(*invoker).invokeWithOpts(0xc0000a63c0, {0x18cd550?, 0xc0002d4580}, {0x0, 0x0, 0x0, 0x0, 0x0}, {0x23bbaf0, 0x1, ...}, ...)
<https://ci-beam.apache.org/job/beam_LoadTests_Go_GBK_Flink_Batch/ws/src/sdks/go/pkg/beam/core/runtime/exec/fn.go>:297 +0xfec
github.com/apache/beam/sdks/v2/go/pkg/beam/core/runtime/exec.(*ParDo).invokeProcessFn(0xc00021eb40, {0x18cd550, 0xc0002d4580}, {0x0, 0x0, 0x0, 0x0, 0x0}, {0x23bbaf0, 0x1, ...}, ...)
<https://ci-beam.apache.org/job/beam_LoadTests_Go_GBK_Flink_Batch/ws/src/sdks/go/pkg/beam/core/runtime/exec/pardo.go>:508 +0x2b5
github.com/apache/beam/sdks/v2/go/pkg/beam/core/runtime/exec.(*ParDo).processSingleWindow(0xc00021eb40, 0xc0009f14d0)
<https://ci-beam.apache.org/job/beam_LoadTests_Go_GBK_Flink_Batch/ws/src/sdks/go/pkg/beam/core/runtime/exec/pardo.go>:194 +0x9b
github.com/apache/beam/sdks/v2/go/pkg/beam/core/runtime/exec.(*ParDo).processMainInput(0x155?, 0x18cd550?)
<https://ci-beam.apache.org/job/beam_LoadTests_Go_GBK_Flink_Batch/ws/src/sdks/go/pkg/beam/core/runtime/exec/pardo.go>:172 +0x91
github.com/apache/beam/sdks/v2/go/pkg/beam/core/runtime/exec.(*ParDo).ProcessElement(0xc00021eb40, {0x18?, 0xc0003e4800?}, 0xc0001a1c68, {0x0, 0x0, 0x0})
<https://ci-beam.apache.org/job/beam_LoadTests_Go_GBK_Flink_Batch/ws/src/sdks/go/pkg/beam/core/runtime/exec/pardo.go>:156 +0x125
github.com/apache/beam/sdks/v2/go/pkg/beam/core/runtime/exec.(*PCollection).ProcessElement(0xc0009f21b0?, {0x18cd550?, 0xc0002d4540?}, 0x4214c7?, {0x0?, 0xeacc18?, 0xc000222640?})
<https://ci-beam.apache.org/job/beam_LoadTests_Go_GBK_Flink_Batch/ws/src/sdks/go/pkg/beam/core/runtime/exec/pcollection.go>:100 +0x151
github.com/apache/beam/sdks/v2/go/pkg/beam/register.(*emit2[...]).invoke(0x18cec60, {0xc0009f21a8, 0xc0002226e8?, 0x18bb7f8?}, {0xc0009f21b0?, 0x9, 0x9})
<https://ci-beam.apache.org/job/beam_LoadTests_Go_GBK_Flink_Batch/ws/src/sdks/go/pkg/beam/register/emitter.go>:80 +0x20f
github.com/apache/beam/sdks/v2/go/pkg/beam/io/synthetic.(*sourceFn).ProcessElement(0xc00004bc40, 0x7f9d62dd75b8?, {0xbebc200, 0x1, 0x1, 0x9, 0x0, 0x0}, 0xc00011b788)
<https://ci-beam.apache.org/job/beam_LoadTests_Go_GBK_Flink_Batch/ws/src/sdks/go/pkg/beam/io/synthetic/source.go>:151 +0x123
github.com/apache/beam/sdks/v2/go/pkg/beam/register.registerDoFn3x1StructWrappersAndFuncs[...].func2.1({0xbebc200?, 0x1, 0x1, 0x9, 0x0, 0x0}, 0x0)
<https://ci-beam.apache.org/job/beam_LoadTests_Go_GBK_Flink_Batch/ws/src/sdks/go/pkg/beam/register/register.go>:3382 +0xb0
github.com/apache/beam/sdks/v2/go/pkg/beam/register.(*caller3x1[...]).Call3x1(0x0?, {0x157e0a0?, 0xc00011b728?}, {0x15d4a80?, 0xc000158240?}, {0x1302160?, 0xc00011b788?})
<https://ci-beam.apache.org/job/beam_LoadTests_Go_GBK_Flink_Batch/ws/src/sdks/go/pkg/beam/register/register.go>:3371 +0xb6
github.com/apache/beam/sdks/v2/go/pkg/beam/core/runtime/exec.(*invoker).initCall.func13({0x0, 0x0, 0x0, 0x0, 0x0}, {0x23bbaf0, 0x1, 0x1}, 0x7f9d62dd75b8?)
<https://ci-beam.apache.org/job/beam_LoadTests_Go_GBK_Flink_Batch/ws/src/sdks/go/pkg/beam/core/runtime/exec/fn_arity.go>:109 +0xad
github.com/apache/beam/sdks/v2/go/pkg/beam/core/runtime/exec.(*invoker).invokeWithOpts(0xc0000a6500, {0x18cd550?, 0xc0002d4540}, {0x0, 0x0, 0x0, 0x0, 0x0}, {0x23bbaf0, 0x1, ...}, ...)
<https://ci-beam.apache.org/job/beam_LoadTests_Go_GBK_Flink_Batch/ws/src/sdks/go/pkg/beam/core/runtime/exec/fn.go>:297 +0xfec
github.com/apache/beam/sdks/v2/go/pkg/beam/core/runtime/exec.(*ParDo).invokeProcessFn(0xc00021ed80, {0x18cd550, 0xc0002d4540}, {0x0, 0x0, 0x0, 0x0, 0x0}, {0x23bbaf0, 0x1, ...}, ...)
<https://ci-beam.apache.org/job/beam_LoadTests_Go_GBK_Flink_Batch/ws/src/sdks/go/pkg/beam/core/runtime/exec/pardo.go>:508 +0x2b5
github.com/apache/beam/sdks/v2/go/pkg/beam/core/runtime/exec.(*ParDo).processSingleWindow(0xc00021ed80, 0xc0004281b0)
<https://ci-beam.apache.org/job/beam_LoadTests_Go_GBK_Flink_Batch/ws/src/sdks/go/pkg/beam/core/runtime/exec/pardo.go>:194 +0x9b
github.com/apache/beam/sdks/v2/go/pkg/beam/core/runtime/exec.(*ProcessSizedElementsAndRestrictions).ProcessElement(0xc0002b6e60, {0x18cd550, 0xc0000175c0}, 0xc0004eb2d0, {0x0, 0x0, 0x0})
<https://ci-beam.apache.org/job/beam_LoadTests_Go_GBK_Flink_Batch/ws/src/sdks/go/pkg/beam/core/runtime/exec/sdf.go>:556 +0x63d
github.com/apache/beam/sdks/v2/go/pkg/beam/core/runtime/exec.(*DataSource).Process.func1(0xc00011abb8, {0xc000223340?, 0xc000046080?})
<https://ci-beam.apache.org/job/beam_LoadTests_Go_GBK_Flink_Batch/ws/src/sdks/go/pkg/beam/core/runtime/exec/datasource.go>:241 +0x21e
github.com/apache/beam/sdks/v2/go/pkg/beam/core/runtime/exec.(*DataSource).process(0xc0000acf20, {0x18cd550, 0xc0000175c0}, 0xc000223630, 0xc000223610)
<https://ci-beam.apache.org/job/beam_LoadTests_Go_GBK_Flink_Batch/ws/src/sdks/go/pkg/beam/core/runtime/exec/datasource.go>:147 +0x4f6
github.com/apache/beam/sdks/v2/go/pkg/beam/core/runtime/exec.(*DataSource).Process(0xc0000acf20, {0x18cd550, 0xc0000175c0})
<https://ci-beam.apache.org/job/beam_LoadTests_Go_GBK_Flink_Batch/ws/src/sdks/go/pkg/beam/core/runtime/exec/datasource.go>:215 +0x226
github.com/apache/beam/sdks/v2/go/pkg/beam/core/runtime/exec.(*Plan).Execute.func2({0x18cd550?, 0xc0000175c0?})
<https://ci-beam.apache.org/job/beam_LoadTests_Go_GBK_Flink_Batch/ws/src/sdks/go/pkg/beam/core/runtime/exec/plan.go>:151 +0x42
github.com/apache/beam/sdks/v2/go/pkg/beam/core/runtime/exec.callNoPanic({0x18cd550?, 0xc0000175c0?}, 0x415d50?)
<https://ci-beam.apache.org/job/beam_LoadTests_Go_GBK_Flink_Batch/ws/src/sdks/go/pkg/beam/core/runtime/exec/util.go>:62 +0x6c
github.com/apache/beam/sdks/v2/go/pkg/beam/core/runtime/exec.(*Plan).Execute(0xc0002b8750, {0x18cd550, 0xc0000175c0}, {0x2362cb0, 0x1}, {{0x18bf410?, 0xc0002d4480?}, {0x18f9998?, 0xc0002d6570?}})
<https://ci-beam.apache.org/job/beam_LoadTests_Go_GBK_Flink_Batch/ws/src/sdks/go/pkg/beam/core/runtime/exec/plan.go>:150 +0x3df
github.com/apache/beam/sdks/v2/go/pkg/beam/core/runtime/harness.(*control).handleInstruction(0xc000480000, {0x18cd438?, 0xc0000019e0?}, 0xc000192ff0)
<https://ci-beam.apache.org/job/beam_LoadTests_Go_GBK_Flink_Batch/ws/src/sdks/go/pkg/beam/core/runtime/harness/harness.go>:408 +0xa53
github.com/apache/beam/sdks/v2/go/pkg/beam/core/runtime/harness.MainWithOptions.func4({0x18cd438?, 0xc0000019e0?}, 0xc0004c1680?)
<https://ci-beam.apache.org/job/beam_LoadTests_Go_GBK_Flink_Batch/ws/src/sdks/go/pkg/beam/core/runtime/harness/harness.go>:195 +0x7a
created by github.com/apache/beam/sdks/v2/go/pkg/beam/core/runtime/harness.MainWithOptions
<https://ci-beam.apache.org/job/beam_LoadTests_Go_GBK_Flink_Batch/ws/src/sdks/go/pkg/beam/core/runtime/harness/harness.go>:213 +0xf1d
at org.apache.beam.runners.fnexecution.control.FnApiControlClient$ResponseStreamObserver.onNext(FnApiControlClient.java:180)
at org.apache.beam.runners.fnexecution.control.FnApiControlClient$ResponseStreamObserver.onNext(FnApiControlClient.java:160)
at org.apache.beam.vendor.grpc.v1p54p0.io.grpc.stub.ServerCalls$StreamingServerCallHandler$StreamingServerCallListener.onMessage(ServerCalls.java:262)
at org.apache.beam.vendor.grpc.v1p54p0.io.grpc.ForwardingServerCallListener.onMessage(ForwardingServerCallListener.java:33)
at org.apache.beam.vendor.grpc.v1p54p0.io.grpc.Contexts$ContextualizedServerCallListener.onMessage(Contexts.java:76)
at org.apache.beam.vendor.grpc.v1p54p0.io.grpc.internal.ServerCallImpl$ServerStreamListenerImpl.messagesAvailableInternal(ServerCallImpl.java:333)
at org.apache.beam.vendor.grpc.v1p54p0.io.grpc.internal.ServerCallImpl$ServerStreamListenerImpl.messagesAvailable(ServerCallImpl.java:316)
at org.apache.beam.vendor.grpc.v1p54p0.io.grpc.internal.ServerImpl$JumpToApplicationThreadServerStreamListener$1MessagesAvailable.runInContext(ServerImpl.java:835)
at org.apache.beam.vendor.grpc.v1p54p0.io.grpc.internal.ContextRunnable.run(ContextRunnable.java:37)
at org.apache.beam.vendor.grpc.v1p54p0.io.grpc.internal.SerializingExecutor.run(SerializingExecutor.java:133)
at java.util.concurrent.ThreadPoolExecutor.runWorker(ThreadPoolExecutor.java:1128)
at java.util.concurrent.ThreadPoolExecutor$Worker.run(ThreadPoolExecutor.java:628)
... 1 more
2023/06/14 08:08:20 (): java.lang.RuntimeException: Error received from SDK harness for instruction 6: process bundle failed for instruction 6 using plan 1-6 : panic: datamgr.go [{6 fn/write/n4:0}]: error flushing buffer of length 4000000
caused by:
rpc error: code = Unknown desc =
Full error:
while executing Process for Plan[1-6]:
2: DataSink[S[fn/write/n4:0@localhost:39755]] Coder:W;fn/wire/n4:0<KV;c1<bytes;c0,bytes;c0>>!GWC
3: PCollection[n4] Out:[2]
4: ParDo[load.RuntimeMonitor] Out:[2] Sig: func([]uint8, []uint8, func([]uint8, []uint8))
5: PCollection[n3] Out:[4]
6: SDF.ProcessSizedElementsAndRestrictions[synthetic.sourceFn] UID:6 Out:[5]
1: DataSource[S[fn/read/n2/SplitAndSize0:0@localhost:39755], local_output] Out:6 Coder:W;fn/wire/n2/SplitAndSize0:0<KV;c5/SplitAndSize0<KV;c5/PairWithRestriction0<R;c5[synthetic.SourceConfig],KV;c9<offsetrange.Restriction[offsetrange.Restriction;c6];c7,bool;c8>>,double;DoubleCoder0>>!GWC
caused by:
panic: datamgr.go [{6 fn/write/n4:0}]: error flushing buffer of length 4000000
caused by:
rpc error: code = Unknown desc = goroutine 35 [running]:
runtime/debug.Stack()
/home/jenkins/sdk/go1.20.4/src/runtime/debug/stack.go:24 +0x65
github.com/apache/beam/sdks/v2/go/pkg/beam/core/runtime/exec.callNoPanic.func1()
<https://ci-beam.apache.org/job/beam_LoadTests_Go_GBK_Flink_Batch/ws/src/sdks/go/pkg/beam/core/runtime/exec/util.go>:58 +0xa5
panic({0x14a3060, 0xc0003eb080})
/home/jenkins/sdk/go1.20.4/src/runtime/panic.go:884 +0x213
github.com/apache/beam/sdks/v2/go/pkg/beam/register.(*emit2[...]).invoke(0x18cec60, {0xc0009f21a8, 0x40a90d?, 0x0?}, {0xc0009f21b0?, 0x9, 0x9})
<https://ci-beam.apache.org/job/beam_LoadTests_Go_GBK_Flink_Batch/ws/src/sdks/go/pkg/beam/register/emitter.go>:81 +0x22f
github.com/apache/beam/sdks/v2/go/test/load.(*RuntimeMonitor).ProcessElement(0x240e3b0?, {0xc0009f21a8?, 0x1?, 0x1?}, {0xc0009f21b0?, 0x9?, 0x9?}, 0xc00011ab58?)
<https://ci-beam.apache.org/job/beam_LoadTests_Go_GBK_Flink_Batch/ws/src/sdks/go/test/load/util.go>:87 +0x39
github.com/apache/beam/sdks/v2/go/pkg/beam/register.registerDoFn3x0StructWrappersAndFuncs[...].func2.1({0xc0009f21b0, 0x9, 0x9}, 0x46eb0a)
<https://ci-beam.apache.org/job/beam_LoadTests_Go_GBK_Flink_Batch/ws/src/sdks/go/pkg/beam/register/register.go>:2469 +0x9c
github.com/apache/beam/sdks/v2/go/pkg/beam/register.(*caller3x0[...]).Call3x0(0x46c383?, {0x12cfee0?, 0xc0009f4228?}, {0x12cfee0?, 0xc0009f4240?}, {0x1302160?, 0xc00011ab58?})
<https://ci-beam.apache.org/job/beam_LoadTests_Go_GBK_Flink_Batch/ws/src/sdks/go/pkg/beam/register/register.go>:2458 +0x7f
github.com/apache/beam/sdks/v2/go/pkg/beam/core/runtime/exec.(*invoker).initCall.func4({0x0, 0x0, 0x0, 0x0, 0x0}, {0x23bbaf0?, 0x1?, 0x1?}, 0xffdf3b645a1cac09?)
<https://ci-beam.apache.org/job/beam_LoadTests_Go_GBK_Flink_Batch/ws/src/sdks/go/pkg/beam/core/runtime/exec/fn_arity.go>:55 +0x75
github.com/apache/beam/sdks/v2/go/pkg/beam/core/runtime/exec.(*invoker).invokeWithOpts(0xc0000a63c0, {0x18cd550?, 0xc0002d4580}, {0x0, 0x0, 0x0, 0x0, 0x0}, {0x23bbaf0, 0x1, ...}, ...)
<https://ci-beam.apache.org/job/beam_LoadTests_Go_GBK_Flink_Batch/ws/src/sdks/go/pkg/beam/core/runtime/exec/fn.go>:297 +0xfec
github.com/apache/beam/sdks/v2/go/pkg/beam/core/runtime/exec.(*ParDo).invokeProcessFn(0xc00021eb40, {0x18cd550, 0xc0002d4580}, {0x0, 0x0, 0x0, 0x0, 0x0}, {0x23bbaf0, 0x1, ...}, ...)
<https://ci-beam.apache.org/job/beam_LoadTests_Go_GBK_Flink_Batch/ws/src/sdks/go/pkg/beam/core/runtime/exec/pardo.go>:508 +0x2b5
github.com/apache/beam/sdks/v2/go/pkg/beam/core/runtime/exec.(*ParDo).processSingleWindow(0xc00021eb40, 0xc0009f14d0)
<https://ci-beam.apache.org/job/beam_LoadTests_Go_GBK_Flink_Batch/ws/src/sdks/go/pkg/beam/core/runtime/exec/pardo.go>:194 +0x9b
github.com/apache/beam/sdks/v2/go/pkg/beam/core/runtime/exec.(*ParDo).processMainInput(0x155?, 0x18cd550?)
<https://ci-beam.apache.org/job/beam_LoadTests_Go_GBK_Flink_Batch/ws/src/sdks/go/pkg/beam/core/runtime/exec/pardo.go>:172 +0x91
github.com/apache/beam/sdks/v2/go/pkg/beam/core/runtime/exec.(*ParDo).ProcessElement(0xc00021eb40, {0x18?, 0xc0003e4800?}, 0xc0001a1c68, {0x0, 0x0, 0x0})
<https://ci-beam.apache.org/job/beam_LoadTests_Go_GBK_Flink_Batch/ws/src/sdks/go/pkg/beam/core/runtime/exec/pardo.go>:156 +0x125
github.com/apache/beam/sdks/v2/go/pkg/beam/core/runtime/exec.(*PCollection).ProcessElement(0xc0009f21b0?, {0x18cd550?, 0xc0002d4540?}, 0x4214c7?, {0x0?, 0xeacc18?, 0xc000222640?})
<https://ci-beam.apache.org/job/beam_LoadTests_Go_GBK_Flink_Batch/ws/src/sdks/go/pkg/beam/core/runtime/exec/pcollection.go>:100 +0x151
github.com/apache/beam/sdks/v2/go/pkg/beam/register.(*emit2[...]).invoke(0x18cec60, {0xc0009f21a8, 0xc0002226e8?, 0x18bb7f8?}, {0xc0009f21b0?, 0x9, 0x9})
<https://ci-beam.apache.org/job/beam_LoadTests_Go_GBK_Flink_Batch/ws/src/sdks/go/pkg/beam/register/emitter.go>:80 +0x20f
github.com/apache/beam/sdks/v2/go/pkg/beam/io/synthetic.(*sourceFn).ProcessElement(0xc00004bc40, 0x7f9d62dd75b8?, {0xbebc200, 0x1, 0x1, 0x9, 0x0, 0x0}, 0xc00011b788)
<https://ci-beam.apache.org/job/beam_LoadTests_Go_GBK_Flink_Batch/ws/src/sdks/go/pkg/beam/io/synthetic/source.go>:151 +0x123
github.com/apache/beam/sdks/v2/go/pkg/beam/register.registerDoFn3x1StructWrappersAndFuncs[...].func2.1({0xbebc200?, 0x1, 0x1, 0x9, 0x0, 0x0}, 0x0)
<https://ci-beam.apache.org/job/beam_LoadTests_Go_GBK_Flink_Batch/ws/src/sdks/go/pkg/beam/register/register.go>:3382 +0xb0
github.com/apache/beam/sdks/v2/go/pkg/beam/register.(*caller3x1[...]).Call3x1(0x0?, {0x157e0a0?, 0xc00011b728?}, {0x15d4a80?, 0xc000158240?}, {0x1302160?, 0xc00011b788?})
<https://ci-beam.apache.org/job/beam_LoadTests_Go_GBK_Flink_Batch/ws/src/sdks/go/pkg/beam/register/register.go>:3371 +0xb6
github.com/apache/beam/sdks/v2/go/pkg/beam/core/runtime/exec.(*invoker).initCall.func13({0x0, 0x0, 0x0, 0x0, 0x0}, {0x23bbaf0, 0x1, 0x1}, 0x7f9d62dd75b8?)
<https://ci-beam.apache.org/job/beam_LoadTests_Go_GBK_Flink_Batch/ws/src/sdks/go/pkg/beam/core/runtime/exec/fn_arity.go>:109 +0xad
github.com/apache/beam/sdks/v2/go/pkg/beam/core/runtime/exec.(*invoker).invokeWithOpts(0xc0000a6500, {0x18cd550?, 0xc0002d4540}, {0x0, 0x0, 0x0, 0x0, 0x0}, {0x23bbaf0, 0x1, ...}, ...)
<https://ci-beam.apache.org/job/beam_LoadTests_Go_GBK_Flink_Batch/ws/src/sdks/go/pkg/beam/core/runtime/exec/fn.go>:297 +0xfec
github.com/apache/beam/sdks/v2/go/pkg/beam/core/runtime/exec.(*ParDo).invokeProcessFn(0xc00021ed80, {0x18cd550, 0xc0002d4540}, {0x0, 0x0, 0x0, 0x0, 0x0}, {0x23bbaf0, 0x1, ...}, ...)
<https://ci-beam.apache.org/job/beam_LoadTests_Go_GBK_Flink_Batch/ws/src/sdks/go/pkg/beam/core/runtime/exec/pardo.go>:508 +0x2b5
github.com/apache/beam/sdks/v2/go/pkg/beam/core/runtime/exec.(*ParDo).processSingleWindow(0xc00021ed80, 0xc0004281b0)
<https://ci-beam.apache.org/job/beam_LoadTests_Go_GBK_Flink_Batch/ws/src/sdks/go/pkg/beam/core/runtime/exec/pardo.go>:194 +0x9b
github.com/apache/beam/sdks/v2/go/pkg/beam/core/runtime/exec.(*ProcessSizedElementsAndRestrictions).ProcessElement(0xc0002b6e60, {0x18cd550, 0xc0000175c0}, 0xc0004eb2d0, {0x0, 0x0, 0x0})
<https://ci-beam.apache.org/job/beam_LoadTests_Go_GBK_Flink_Batch/ws/src/sdks/go/pkg/beam/core/runtime/exec/sdf.go>:556 +0x63d
github.com/apache/beam/sdks/v2/go/pkg/beam/core/runtime/exec.(*DataSource).Process.func1(0xc00011abb8, {0xc000223340?, 0xc000046080?})
<https://ci-beam.apache.org/job/beam_LoadTests_Go_GBK_Flink_Batch/ws/src/sdks/go/pkg/beam/core/runtime/exec/datasource.go>:241 +0x21e
github.com/apache/beam/sdks/v2/go/pkg/beam/core/runtime/exec.(*DataSource).process(0xc0000acf20, {0x18cd550, 0xc0000175c0}, 0xc000223630, 0xc000223610)
<https://ci-beam.apache.org/job/beam_LoadTests_Go_GBK_Flink_Batch/ws/src/sdks/go/pkg/beam/core/runtime/exec/datasource.go>:147 +0x4f6
github.com/apache/beam/sdks/v2/go/pkg/beam/core/runtime/exec.(*DataSource).Process(0xc0000acf20, {0x18cd550, 0xc0000175c0})
<https://ci-beam.apache.org/job/beam_LoadTests_Go_GBK_Flink_Batch/ws/src/sdks/go/pkg/beam/core/runtime/exec/datasource.go>:215 +0x226
github.com/apache/beam/sdks/v2/go/pkg/beam/core/runtime/exec.(*Plan).Execute.func2({0x18cd550?, 0xc0000175c0?})
<https://ci-beam.apache.org/job/beam_LoadTests_Go_GBK_Flink_Batch/ws/src/sdks/go/pkg/beam/core/runtime/exec/plan.go>:151 +0x42
github.com/apache/beam/sdks/v2/go/pkg/beam/core/runtime/exec.callNoPanic({0x18cd550?, 0xc0000175c0?}, 0x415d50?)
<https://ci-beam.apache.org/job/beam_LoadTests_Go_GBK_Flink_Batch/ws/src/sdks/go/pkg/beam/core/runtime/exec/util.go>:62 +0x6c
github.com/apache/beam/sdks/v2/go/pkg/beam/core/runtime/exec.(*Plan).Execute(0xc0002b8750, {0x18cd550, 0xc0000175c0}, {0x2362cb0, 0x1}, {{0x18bf410?, 0xc0002d4480?}, {0x18f9998?, 0xc0002d6570?}})
<https://ci-beam.apache.org/job/beam_LoadTests_Go_GBK_Flink_Batch/ws/src/sdks/go/pkg/beam/core/runtime/exec/plan.go>:150 +0x3df
github.com/apache/beam/sdks/v2/go/pkg/beam/core/runtime/harness.(*control).handleInstruction(0xc000480000, {0x18cd438?, 0xc0000019e0?}, 0xc000192ff0)
<https://ci-beam.apache.org/job/beam_LoadTests_Go_GBK_Flink_Batch/ws/src/sdks/go/pkg/beam/core/runtime/harness/harness.go>:408 +0xa53
github.com/apache/beam/sdks/v2/go/pkg/beam/core/runtime/harness.MainWithOptions.func4({0x18cd438?, 0xc0000019e0?}, 0xc0004c1680?)
<https://ci-beam.apache.org/job/beam_LoadTests_Go_GBK_Flink_Batch/ws/src/sdks/go/pkg/beam/core/runtime/harness/harness.go>:195 +0x7a
created by github.com/apache/beam/sdks/v2/go/pkg/beam/core/runtime/harness.MainWithOptions
<https://ci-beam.apache.org/job/beam_LoadTests_Go_GBK_Flink_Batch/ws/src/sdks/go/pkg/beam/core/runtime/harness/harness.go>:213 +0xf1d
2023/06/14 08:08:20 Job state: FAILED
2023/06/14 08:08:20 Failed to execute job: job load0tests0go0flink0batch0gbk0100614065407-root-0614080557-ae5a969e_085d5955-7792-464b-8f96-e244faafedd9 failed
panic: Failed to execute job: job load0tests0go0flink0batch0gbk0100614065407-root-0614080557-ae5a969e_085d5955-7792-464b-8f96-e244faafedd9 failed
goroutine 1 [running]:
github.com/apache/beam/sdks/v2/go/pkg/beam/log.Fatalf({0x18cd3c8, 0xc00004c0c0}, {0x1747d67?, 0x240e3b0?}, {0xc000393e70?, 0x0?, 0x0?})
<https://ci-beam.apache.org/job/beam_LoadTests_Go_GBK_Flink_Batch/ws/src/sdks/go/pkg/beam/log/log.go>:162 +0x8c
main.main()
<https://ci-beam.apache.org/job/beam_LoadTests_Go_GBK_Flink_Batch/ws/src/sdks/go/test/load/group_by_key/group_by_key.go>:98 +0x3eb
> Task :sdks:go:test:load:run FAILED
FAILURE: Build failed with an exception.
* Where:
Build file '<https://ci-beam.apache.org/job/beam_LoadTests_Go_GBK_Flink_Batch/ws/src/sdks/go/test/load/build.gradle'> line: 31
* What went wrong:
Execution failed for task ':sdks:go:test:load:run'.
> Process 'command 'sh'' finished with non-zero exit value 2
* Try:
> Run with --stacktrace option to get the stack trace.
> Run with --info or --debug option to get more log output.
* Get more help at https://help.gradle.org
BUILD FAILED in 3m 4s
12 actionable tasks: 6 executed, 4 from cache, 2 up-to-date
Publishing build scan...
https://ge.apache.org/s/f4ueuasx3qgdu
Build step 'Invoke Gradle script' changed build result to FAILURE
Build step 'Invoke Gradle script' marked build as failure
---------------------------------------------------------------------
To unsubscribe, e-mail: builds-unsubscribe@beam.apache.org
For additional commands, e-mail: builds-help@beam.apache.org
Build failed in Jenkins: beam_LoadTests_Go_GBK_Flink_Batch #922
Posted by Apache Jenkins Server <je...@builds.apache.org>.
See <https://ci-beam.apache.org/job/beam_LoadTests_Go_GBK_Flink_Batch/922/display/redirect>
Changes:
------------------------------------------
[...truncated 48.25 KB...]
github.com/apache/beam/sdks/v2/go/pkg/beam/core/runtime/exec.(*invoker).invokeWithOpts(0xc000169040, {0x18cd550?, 0xc00053b8c0}, {0x0, 0x0, 0x0, 0x0, 0x0}, {0x23bbaf0, 0x1, ...}, ...)
<https://ci-beam.apache.org/job/beam_LoadTests_Go_GBK_Flink_Batch/ws/src/sdks/go/pkg/beam/core/runtime/exec/fn.go>:297 +0xfec
github.com/apache/beam/sdks/v2/go/pkg/beam/core/runtime/exec.(*ParDo).invokeProcessFn(0xc0001e4240, {0x18cd550, 0xc00053b8c0}, {0x0, 0x0, 0x0, 0x0, 0x0}, {0x23bbaf0, 0x1, ...}, ...)
<https://ci-beam.apache.org/job/beam_LoadTests_Go_GBK_Flink_Batch/ws/src/sdks/go/pkg/beam/core/runtime/exec/pardo.go>:508 +0x2b5
github.com/apache/beam/sdks/v2/go/pkg/beam/core/runtime/exec.(*ParDo).processSingleWindow(0xc0001e4240, 0xc0003bc990)
<https://ci-beam.apache.org/job/beam_LoadTests_Go_GBK_Flink_Batch/ws/src/sdks/go/pkg/beam/core/runtime/exec/pardo.go>:194 +0x9b
github.com/apache/beam/sdks/v2/go/pkg/beam/core/runtime/exec.(*ProcessSizedElementsAndRestrictions).ProcessElement(0xc0003937c0, {0x18cd550, 0xc000275f80}, 0xc00050c700, {0x0, 0x0, 0x0})
<https://ci-beam.apache.org/job/beam_LoadTests_Go_GBK_Flink_Batch/ws/src/sdks/go/pkg/beam/core/runtime/exec/sdf.go>:556 +0x63d
github.com/apache/beam/sdks/v2/go/pkg/beam/core/runtime/exec.(*DataSource).Process.func1(0xc000310df8, {0xc000379340?, 0xc00011d6a0?})
<https://ci-beam.apache.org/job/beam_LoadTests_Go_GBK_Flink_Batch/ws/src/sdks/go/pkg/beam/core/runtime/exec/datasource.go>:241 +0x21e
github.com/apache/beam/sdks/v2/go/pkg/beam/core/runtime/exec.(*DataSource).process(0xc00037a2c0, {0x18cd550, 0xc000275f80}, 0xc000379630, 0xc000379610)
<https://ci-beam.apache.org/job/beam_LoadTests_Go_GBK_Flink_Batch/ws/src/sdks/go/pkg/beam/core/runtime/exec/datasource.go>:147 +0x4f6
github.com/apache/beam/sdks/v2/go/pkg/beam/core/runtime/exec.(*DataSource).Process(0xc00037a2c0, {0x18cd550, 0xc000275f80})
<https://ci-beam.apache.org/job/beam_LoadTests_Go_GBK_Flink_Batch/ws/src/sdks/go/pkg/beam/core/runtime/exec/datasource.go>:215 +0x226
github.com/apache/beam/sdks/v2/go/pkg/beam/core/runtime/exec.(*Plan).Execute.func2({0x18cd550?, 0xc000275f80?})
<https://ci-beam.apache.org/job/beam_LoadTests_Go_GBK_Flink_Batch/ws/src/sdks/go/pkg/beam/core/runtime/exec/plan.go>:151 +0x42
github.com/apache/beam/sdks/v2/go/pkg/beam/core/runtime/exec.callNoPanic({0x18cd550?, 0xc000275f80?}, 0x415d50?)
<https://ci-beam.apache.org/job/beam_LoadTests_Go_GBK_Flink_Batch/ws/src/sdks/go/pkg/beam/core/runtime/exec/util.go>:62 +0x6c
github.com/apache/beam/sdks/v2/go/pkg/beam/core/runtime/exec.(*Plan).Execute(0xc000396480, {0x18cd550, 0xc000275f80}, {0x2362c98, 0x1}, {{0x18bf410?, 0xc00053b640?}, {0x18f9998?, 0xc000398ed0?}})
<https://ci-beam.apache.org/job/beam_LoadTests_Go_GBK_Flink_Batch/ws/src/sdks/go/pkg/beam/core/runtime/exec/plan.go>:150 +0x3df
github.com/apache/beam/sdks/v2/go/pkg/beam/core/runtime/harness.(*control).handleInstruction(0xc00008c000, {0x18cd438?, 0xc00053cc90?}, 0xc00018cd20)
<https://ci-beam.apache.org/job/beam_LoadTests_Go_GBK_Flink_Batch/ws/src/sdks/go/pkg/beam/core/runtime/harness/harness.go>:408 +0xa53
github.com/apache/beam/sdks/v2/go/pkg/beam/core/runtime/harness.MainWithOptions.func4({0x18cd438?, 0xc00053cc90?}, 0x0?)
<https://ci-beam.apache.org/job/beam_LoadTests_Go_GBK_Flink_Batch/ws/src/sdks/go/pkg/beam/core/runtime/harness/harness.go>:195 +0x7a
created by github.com/apache/beam/sdks/v2/go/pkg/beam/core/runtime/harness.MainWithOptions
<https://ci-beam.apache.org/job/beam_LoadTests_Go_GBK_Flink_Batch/ws/src/sdks/go/pkg/beam/core/runtime/harness/harness.go>:213 +0xf1d
at java.util.concurrent.CompletableFuture.reportGet(CompletableFuture.java:395)
at java.util.concurrent.CompletableFuture.get(CompletableFuture.java:1999)
at org.apache.beam.sdk.util.MoreFutures.get(MoreFutures.java:61)
at org.apache.beam.runners.fnexecution.control.SdkHarnessClient$BundleProcessor$ActiveBundle.close(SdkHarnessClient.java:522)
at org.apache.beam.runners.fnexecution.control.DefaultJobBundleFactory$SimpleStageBundleFactory$1.close(DefaultJobBundleFactory.java:556)
at org.apache.beam.runners.flink.translation.functions.FlinkExecutableStageFunction.$closeResource(FlinkExecutableStageFunction.java:269)
at org.apache.beam.runners.flink.translation.functions.FlinkExecutableStageFunction.mapPartition(FlinkExecutableStageFunction.java:269)
at org.apache.flink.runtime.operators.MapPartitionDriver.run(MapPartitionDriver.java:113)
at org.apache.flink.runtime.operators.BatchTask.run(BatchTask.java:514)
at org.apache.flink.runtime.operators.BatchTask.invoke(BatchTask.java:357)
at org.apache.flink.runtime.taskmanager.Task.runWithSystemExitMonitoring(Task.java:948)
at org.apache.flink.runtime.taskmanager.Task.restoreAndInvoke(Task.java:927)
at org.apache.flink.runtime.taskmanager.Task.doRun(Task.java:741)
at org.apache.flink.runtime.taskmanager.Task.run(Task.java:563)
at java.lang.Thread.run(Thread.java:829)
Caused by: java.lang.RuntimeException: Error received from SDK harness for instruction 3: process bundle failed for instruction 3 using plan 1-2 : panic: datamgr.go [{3 fn/write/n4:0}]: error flushing buffer of length 4000000
caused by:
rpc error: code = Unknown desc =
Full error:
while executing Process for Plan[1-2]:
2: DataSink[S[fn/write/n4:0@localhost:40765]] Coder:W;fn/wire/n4:0<KV;c1<bytes;c0,bytes;c0>>!GWC
3: PCollection[n4] Out:[2]
4: ParDo[load.RuntimeMonitor] Out:[2] Sig: func([]uint8, []uint8, func([]uint8, []uint8))
5: PCollection[n3] Out:[4]
6: SDF.ProcessSizedElementsAndRestrictions[synthetic.sourceFn] UID:6 Out:[5]
1: DataSource[S[fn/read/n2/SplitAndSize0:0@localhost:40765], local_output] Out:6 Coder:W;fn/wire/n2/SplitAndSize0:0<KV;c5/SplitAndSize0<KV;c5/PairWithRestriction0<R;c5[synthetic.SourceConfig],KV;c9<offsetrange.Restriction[offsetrange.Restriction;c6];c7,bool;c8>>,double;DoubleCoder0>>!GWC
caused by:
panic: datamgr.go [{3 fn/write/n4:0}]: error flushing buffer of length 4000000
caused by:
rpc error: code = Unknown desc = goroutine 27 [running]:
runtime/debug.Stack()
/home/jenkins/sdk/go1.20.4/src/runtime/debug/stack.go:24 +0x65
github.com/apache/beam/sdks/v2/go/pkg/beam/core/runtime/exec.callNoPanic.func1()
<https://ci-beam.apache.org/job/beam_LoadTests_Go_GBK_Flink_Batch/ws/src/sdks/go/pkg/beam/core/runtime/exec/util.go>:58 +0xa5
panic({0x14a3060, 0xc0003a8300})
/home/jenkins/sdk/go1.20.4/src/runtime/panic.go:884 +0x213
github.com/apache/beam/sdks/v2/go/pkg/beam/register.(*emit2[...]).invoke(0x18cec60, {0xc0009dc2b8, 0x40a90d?, 0x1?}, {0xc0009dc2c0?, 0x9, 0x9})
<https://ci-beam.apache.org/job/beam_LoadTests_Go_GBK_Flink_Batch/ws/src/sdks/go/pkg/beam/register/emitter.go>:81 +0x22f
github.com/apache/beam/sdks/v2/go/test/load.(*RuntimeMonitor).ProcessElement(0x13d7b00?, {0xc0009dc2b8?, 0xc0002b0a20?, 0xc0001162d0?}, {0xc0009dc2c0?, 0xc000116270?, 0xc0001160c0?}, 0x0?)
<https://ci-beam.apache.org/job/beam_LoadTests_Go_GBK_Flink_Batch/ws/src/sdks/go/test/load/util.go>:87 +0x39
github.com/apache/beam/sdks/v2/go/pkg/beam/register.registerDoFn3x0StructWrappersAndFuncs[...].func2.1({0xc0009dc2c0, 0x9, 0x9}, 0x46eb0a)
<https://ci-beam.apache.org/job/beam_LoadTests_Go_GBK_Flink_Batch/ws/src/sdks/go/pkg/beam/register/register.go>:2469 +0x9c
github.com/apache/beam/sdks/v2/go/pkg/beam/register.(*caller3x0[...]).Call3x0(0x46c383?, {0x12cfee0?, 0xc0009d7710?}, {0x12cfee0?, 0xc0009d7728?}, {0x1302160?, 0xc000310de0?})
<https://ci-beam.apache.org/job/beam_LoadTests_Go_GBK_Flink_Batch/ws/src/sdks/go/pkg/beam/register/register.go>:2458 +0x7f
github.com/apache/beam/sdks/v2/go/pkg/beam/core/runtime/exec.(*invoker).initCall.func4({0x0, 0x0, 0x0, 0x0, 0x0}, {0x23bbaf0?, 0x1?, 0x1?}, 0xffdf3b645a1cac09?)
<https://ci-beam.apache.org/job/beam_LoadTests_Go_GBK_Flink_Batch/ws/src/sdks/go/pkg/beam/core/runtime/exec/fn_arity.go>:55 +0x75
github.com/apache/beam/sdks/v2/go/pkg/beam/core/runtime/exec.(*invoker).invokeWithOpts(0xc000168f00, {0x18cd550?, 0xc00053bc40}, {0x0, 0x0, 0x0, 0x0, 0x0}, {0x23bbaf0, 0x1, ...}, ...)
<https://ci-beam.apache.org/job/beam_LoadTests_Go_GBK_Flink_Batch/ws/src/sdks/go/pkg/beam/core/runtime/exec/fn.go>:297 +0xfec
github.com/apache/beam/sdks/v2/go/pkg/beam/core/runtime/exec.(*ParDo).invokeProcessFn(0xc0001e4000, {0x18cd550, 0xc00053bc40}, {0x0, 0x0, 0x0, 0x0, 0x0}, {0x23bbaf0, 0x1, ...}, ...)
<https://ci-beam.apache.org/job/beam_LoadTests_Go_GBK_Flink_Batch/ws/src/sdks/go/pkg/beam/core/runtime/exec/pardo.go>:508 +0x2b5
github.com/apache/beam/sdks/v2/go/pkg/beam/core/runtime/exec.(*ParDo).processSingleWindow(0xc0001e4000, 0xc0009dacf0)
<https://ci-beam.apache.org/job/beam_LoadTests_Go_GBK_Flink_Batch/ws/src/sdks/go/pkg/beam/core/runtime/exec/pardo.go>:194 +0x9b
github.com/apache/beam/sdks/v2/go/pkg/beam/core/runtime/exec.(*ParDo).processMainInput(0x4273c0?, 0x18cd550?)
<https://ci-beam.apache.org/job/beam_LoadTests_Go_GBK_Flink_Batch/ws/src/sdks/go/pkg/beam/core/runtime/exec/pardo.go>:172 +0x91
github.com/apache/beam/sdks/v2/go/pkg/beam/core/runtime/exec.(*ParDo).ProcessElement(0xc0001e4000, {0x18?, 0x23df880?}, 0xc0003a6038, {0x0, 0x0, 0x0})
<https://ci-beam.apache.org/job/beam_LoadTests_Go_GBK_Flink_Batch/ws/src/sdks/go/pkg/beam/core/runtime/exec/pardo.go>:156 +0x125
github.com/apache/beam/sdks/v2/go/pkg/beam/core/runtime/exec.(*PCollection).ProcessElement(0xc0009dc2c0?, {0x18cd550?, 0xc00053b8c0?}, 0x4214c7?, {0x0?, 0xe64210?, 0xc000378640?})
<https://ci-beam.apache.org/job/beam_LoadTests_Go_GBK_Flink_Batch/ws/src/sdks/go/pkg/beam/core/runtime/exec/pcollection.go>:100 +0x151
github.com/apache/beam/sdks/v2/go/pkg/beam/register.(*emit2[...]).invoke(0x18cec60, {0xc0009dc2b8, 0xc0003786e8?, 0x18bb7f8?}, {0xc0009dc2c0?, 0x9, 0x9})
<https://ci-beam.apache.org/job/beam_LoadTests_Go_GBK_Flink_Batch/ws/src/sdks/go/pkg/beam/register/emitter.go>:80 +0x20f
github.com/apache/beam/sdks/v2/go/pkg/beam/io/synthetic.(*sourceFn).ProcessElement(0xc000484350, 0x7f65c4d27108?, {0xbebc200, 0x1, 0x1, 0x9, 0x0, 0x0}, 0xc000311848)
<https://ci-beam.apache.org/job/beam_LoadTests_Go_GBK_Flink_Batch/ws/src/sdks/go/pkg/beam/io/synthetic/source.go>:151 +0x123
github.com/apache/beam/sdks/v2/go/pkg/beam/register.registerDoFn3x1StructWrappersAndFuncs[...].func2.1({0xbebc200?, 0x1, 0x1, 0x9, 0x0, 0x0}, 0x0)
<https://ci-beam.apache.org/job/beam_LoadTests_Go_GBK_Flink_Batch/ws/src/sdks/go/pkg/beam/register/register.go>:3382 +0xb0
github.com/apache/beam/sdks/v2/go/pkg/beam/register.(*caller3x1[...]).Call3x1(0x0?, {0x157e0a0?, 0xc000311818?}, {0x15d4a80?, 0xc0005430e0?}, {0x1302160?, 0xc000311848?})
<https://ci-beam.apache.org/job/beam_LoadTests_Go_GBK_Flink_Batch/ws/src/sdks/go/pkg/beam/register/register.go>:3371 +0xb6
github.com/apache/beam/sdks/v2/go/pkg/beam/core/runtime/exec.(*invoker).initCall.func13({0x0, 0x0, 0x0, 0x0, 0x0}, {0x23bbaf0, 0x1, 0x1}, 0x7f65c4d27108?)
<https://ci-beam.apache.org/job/beam_LoadTests_Go_GBK_Flink_Batch/ws/src/sdks/go/pkg/beam/core/runtime/exec/fn_arity.go>:109 +0xad
github.com/apache/beam/sdks/v2/go/pkg/beam/core/runtime/exec.(*invoker).invokeWithOpts(0xc000169040, {0x18cd550?, 0xc00053b8c0}, {0x0, 0x0, 0x0, 0x0, 0x0}, {0x23bbaf0, 0x1, ...}, ...)
<https://ci-beam.apache.org/job/beam_LoadTests_Go_GBK_Flink_Batch/ws/src/sdks/go/pkg/beam/core/runtime/exec/fn.go>:297 +0xfec
github.com/apache/beam/sdks/v2/go/pkg/beam/core/runtime/exec.(*ParDo).invokeProcessFn(0xc0001e4240, {0x18cd550, 0xc00053b8c0}, {0x0, 0x0, 0x0, 0x0, 0x0}, {0x23bbaf0, 0x1, ...}, ...)
<https://ci-beam.apache.org/job/beam_LoadTests_Go_GBK_Flink_Batch/ws/src/sdks/go/pkg/beam/core/runtime/exec/pardo.go>:508 +0x2b5
github.com/apache/beam/sdks/v2/go/pkg/beam/core/runtime/exec.(*ParDo).processSingleWindow(0xc0001e4240, 0xc0003bc990)
<https://ci-beam.apache.org/job/beam_LoadTests_Go_GBK_Flink_Batch/ws/src/sdks/go/pkg/beam/core/runtime/exec/pardo.go>:194 +0x9b
github.com/apache/beam/sdks/v2/go/pkg/beam/core/runtime/exec.(*ProcessSizedElementsAndRestrictions).ProcessElement(0xc0003937c0, {0x18cd550, 0xc000275f80}, 0xc00050c700, {0x0, 0x0, 0x0})
<https://ci-beam.apache.org/job/beam_LoadTests_Go_GBK_Flink_Batch/ws/src/sdks/go/pkg/beam/core/runtime/exec/sdf.go>:556 +0x63d
github.com/apache/beam/sdks/v2/go/pkg/beam/core/runtime/exec.(*DataSource).Process.func1(0xc000310df8, {0xc000379340?, 0xc00011d6a0?})
<https://ci-beam.apache.org/job/beam_LoadTests_Go_GBK_Flink_Batch/ws/src/sdks/go/pkg/beam/core/runtime/exec/datasource.go>:241 +0x21e
github.com/apache/beam/sdks/v2/go/pkg/beam/core/runtime/exec.(*DataSource).process(0xc00037a2c0, {0x18cd550, 0xc000275f80}, 0xc000379630, 0xc000379610)
<https://ci-beam.apache.org/job/beam_LoadTests_Go_GBK_Flink_Batch/ws/src/sdks/go/pkg/beam/core/runtime/exec/datasource.go>:147 +0x4f6
github.com/apache/beam/sdks/v2/go/pkg/beam/core/runtime/exec.(*DataSource).Process(0xc00037a2c0, {0x18cd550, 0xc000275f80})
<https://ci-beam.apache.org/job/beam_LoadTests_Go_GBK_Flink_Batch/ws/src/sdks/go/pkg/beam/core/runtime/exec/datasource.go>:215 +0x226
github.com/apache/beam/sdks/v2/go/pkg/beam/core/runtime/exec.(*Plan).Execute.func2({0x18cd550?, 0xc000275f80?})
<https://ci-beam.apache.org/job/beam_LoadTests_Go_GBK_Flink_Batch/ws/src/sdks/go/pkg/beam/core/runtime/exec/plan.go>:151 +0x42
github.com/apache/beam/sdks/v2/go/pkg/beam/core/runtime/exec.callNoPanic({0x18cd550?, 0xc000275f80?}, 0x415d50?)
<https://ci-beam.apache.org/job/beam_LoadTests_Go_GBK_Flink_Batch/ws/src/sdks/go/pkg/beam/core/runtime/exec/util.go>:62 +0x6c
github.com/apache/beam/sdks/v2/go/pkg/beam/core/runtime/exec.(*Plan).Execute(0xc000396480, {0x18cd550, 0xc000275f80}, {0x2362c98, 0x1}, {{0x18bf410?, 0xc00053b640?}, {0x18f9998?, 0xc000398ed0?}})
<https://ci-beam.apache.org/job/beam_LoadTests_Go_GBK_Flink_Batch/ws/src/sdks/go/pkg/beam/core/runtime/exec/plan.go>:150 +0x3df
github.com/apache/beam/sdks/v2/go/pkg/beam/core/runtime/harness.(*control).handleInstruction(0xc00008c000, {0x18cd438?, 0xc00053cc90?}, 0xc00018cd20)
<https://ci-beam.apache.org/job/beam_LoadTests_Go_GBK_Flink_Batch/ws/src/sdks/go/pkg/beam/core/runtime/harness/harness.go>:408 +0xa53
github.com/apache/beam/sdks/v2/go/pkg/beam/core/runtime/harness.MainWithOptions.func4({0x18cd438?, 0xc00053cc90?}, 0x0?)
<https://ci-beam.apache.org/job/beam_LoadTests_Go_GBK_Flink_Batch/ws/src/sdks/go/pkg/beam/core/runtime/harness/harness.go>:195 +0x7a
created by github.com/apache/beam/sdks/v2/go/pkg/beam/core/runtime/harness.MainWithOptions
<https://ci-beam.apache.org/job/beam_LoadTests_Go_GBK_Flink_Batch/ws/src/sdks/go/pkg/beam/core/runtime/harness/harness.go>:213 +0xf1d
at org.apache.beam.runners.fnexecution.control.FnApiControlClient$ResponseStreamObserver.onNext(FnApiControlClient.java:180)
at org.apache.beam.runners.fnexecution.control.FnApiControlClient$ResponseStreamObserver.onNext(FnApiControlClient.java:160)
at org.apache.beam.vendor.grpc.v1p54p0.io.grpc.stub.ServerCalls$StreamingServerCallHandler$StreamingServerCallListener.onMessage(ServerCalls.java:262)
at org.apache.beam.vendor.grpc.v1p54p0.io.grpc.ForwardingServerCallListener.onMessage(ForwardingServerCallListener.java:33)
at org.apache.beam.vendor.grpc.v1p54p0.io.grpc.Contexts$ContextualizedServerCallListener.onMessage(Contexts.java:76)
at org.apache.beam.vendor.grpc.v1p54p0.io.grpc.internal.ServerCallImpl$ServerStreamListenerImpl.messagesAvailableInternal(ServerCallImpl.java:333)
at org.apache.beam.vendor.grpc.v1p54p0.io.grpc.internal.ServerCallImpl$ServerStreamListenerImpl.messagesAvailable(ServerCallImpl.java:316)
at org.apache.beam.vendor.grpc.v1p54p0.io.grpc.internal.ServerImpl$JumpToApplicationThreadServerStreamListener$1MessagesAvailable.runInContext(ServerImpl.java:835)
at org.apache.beam.vendor.grpc.v1p54p0.io.grpc.internal.ContextRunnable.run(ContextRunnable.java:37)
at org.apache.beam.vendor.grpc.v1p54p0.io.grpc.internal.SerializingExecutor.run(SerializingExecutor.java:133)
at java.util.concurrent.ThreadPoolExecutor.runWorker(ThreadPoolExecutor.java:1128)
at java.util.concurrent.ThreadPoolExecutor$Worker.run(ThreadPoolExecutor.java:628)
... 1 more
2023/06/13 08:07:40 (): java.lang.RuntimeException: Error received from SDK harness for instruction 3: process bundle failed for instruction 3 using plan 1-2 : panic: datamgr.go [{3 fn/write/n4:0}]: error flushing buffer of length 4000000
caused by:
rpc error: code = Unknown desc =
Full error:
while executing Process for Plan[1-2]:
2: DataSink[S[fn/write/n4:0@localhost:40765]] Coder:W;fn/wire/n4:0<KV;c1<bytes;c0,bytes;c0>>!GWC
3: PCollection[n4] Out:[2]
4: ParDo[load.RuntimeMonitor] Out:[2] Sig: func([]uint8, []uint8, func([]uint8, []uint8))
5: PCollection[n3] Out:[4]
6: SDF.ProcessSizedElementsAndRestrictions[synthetic.sourceFn] UID:6 Out:[5]
1: DataSource[S[fn/read/n2/SplitAndSize0:0@localhost:40765], local_output] Out:6 Coder:W;fn/wire/n2/SplitAndSize0:0<KV;c5/SplitAndSize0<KV;c5/PairWithRestriction0<R;c5[synthetic.SourceConfig],KV;c9<offsetrange.Restriction[offsetrange.Restriction;c6];c7,bool;c8>>,double;DoubleCoder0>>!GWC
caused by:
panic: datamgr.go [{3 fn/write/n4:0}]: error flushing buffer of length 4000000
caused by:
rpc error: code = Unknown desc = goroutine 27 [running]:
runtime/debug.Stack()
/home/jenkins/sdk/go1.20.4/src/runtime/debug/stack.go:24 +0x65
github.com/apache/beam/sdks/v2/go/pkg/beam/core/runtime/exec.callNoPanic.func1()
<https://ci-beam.apache.org/job/beam_LoadTests_Go_GBK_Flink_Batch/ws/src/sdks/go/pkg/beam/core/runtime/exec/util.go>:58 +0xa5
panic({0x14a3060, 0xc0003a8300})
/home/jenkins/sdk/go1.20.4/src/runtime/panic.go:884 +0x213
github.com/apache/beam/sdks/v2/go/pkg/beam/register.(*emit2[...]).invoke(0x18cec60, {0xc0009dc2b8, 0x40a90d?, 0x1?}, {0xc0009dc2c0?, 0x9, 0x9})
<https://ci-beam.apache.org/job/beam_LoadTests_Go_GBK_Flink_Batch/ws/src/sdks/go/pkg/beam/register/emitter.go>:81 +0x22f
github.com/apache/beam/sdks/v2/go/test/load.(*RuntimeMonitor).ProcessElement(0x13d7b00?, {0xc0009dc2b8?, 0xc0002b0a20?, 0xc0001162d0?}, {0xc0009dc2c0?, 0xc000116270?, 0xc0001160c0?}, 0x0?)
<https://ci-beam.apache.org/job/beam_LoadTests_Go_GBK_Flink_Batch/ws/src/sdks/go/test/load/util.go>:87 +0x39
github.com/apache/beam/sdks/v2/go/pkg/beam/register.registerDoFn3x0StructWrappersAndFuncs[...].func2.1({0xc0009dc2c0, 0x9, 0x9}, 0x46eb0a)
<https://ci-beam.apache.org/job/beam_LoadTests_Go_GBK_Flink_Batch/ws/src/sdks/go/pkg/beam/register/register.go>:2469 +0x9c
github.com/apache/beam/sdks/v2/go/pkg/beam/register.(*caller3x0[...]).Call3x0(0x46c383?, {0x12cfee0?, 0xc0009d7710?}, {0x12cfee0?, 0xc0009d7728?}, {0x1302160?, 0xc000310de0?})
<https://ci-beam.apache.org/job/beam_LoadTests_Go_GBK_Flink_Batch/ws/src/sdks/go/pkg/beam/register/register.go>:2458 +0x7f
github.com/apache/beam/sdks/v2/go/pkg/beam/core/runtime/exec.(*invoker).initCall.func4({0x0, 0x0, 0x0, 0x0, 0x0}, {0x23bbaf0?, 0x1?, 0x1?}, 0xffdf3b645a1cac09?)
<https://ci-beam.apache.org/job/beam_LoadTests_Go_GBK_Flink_Batch/ws/src/sdks/go/pkg/beam/core/runtime/exec/fn_arity.go>:55 +0x75
github.com/apache/beam/sdks/v2/go/pkg/beam/core/runtime/exec.(*invoker).invokeWithOpts(0xc000168f00, {0x18cd550?, 0xc00053bc40}, {0x0, 0x0, 0x0, 0x0, 0x0}, {0x23bbaf0, 0x1, ...}, ...)
<https://ci-beam.apache.org/job/beam_LoadTests_Go_GBK_Flink_Batch/ws/src/sdks/go/pkg/beam/core/runtime/exec/fn.go>:297 +0xfec
github.com/apache/beam/sdks/v2/go/pkg/beam/core/runtime/exec.(*ParDo).invokeProcessFn(0xc0001e4000, {0x18cd550, 0xc00053bc40}, {0x0, 0x0, 0x0, 0x0, 0x0}, {0x23bbaf0, 0x1, ...}, ...)
<https://ci-beam.apache.org/job/beam_LoadTests_Go_GBK_Flink_Batch/ws/src/sdks/go/pkg/beam/core/runtime/exec/pardo.go>:508 +0x2b5
github.com/apache/beam/sdks/v2/go/pkg/beam/core/runtime/exec.(*ParDo).processSingleWindow(0xc0001e4000, 0xc0009dacf0)
<https://ci-beam.apache.org/job/beam_LoadTests_Go_GBK_Flink_Batch/ws/src/sdks/go/pkg/beam/core/runtime/exec/pardo.go>:194 +0x9b
github.com/apache/beam/sdks/v2/go/pkg/beam/core/runtime/exec.(*ParDo).processMainInput(0x4273c0?, 0x18cd550?)
<https://ci-beam.apache.org/job/beam_LoadTests_Go_GBK_Flink_Batch/ws/src/sdks/go/pkg/beam/core/runtime/exec/pardo.go>:172 +0x91
github.com/apache/beam/sdks/v2/go/pkg/beam/core/runtime/exec.(*ParDo).ProcessElement(0xc0001e4000, {0x18?, 0x23df880?}, 0xc0003a6038, {0x0, 0x0, 0x0})
<https://ci-beam.apache.org/job/beam_LoadTests_Go_GBK_Flink_Batch/ws/src/sdks/go/pkg/beam/core/runtime/exec/pardo.go>:156 +0x125
github.com/apache/beam/sdks/v2/go/pkg/beam/core/runtime/exec.(*PCollection).ProcessElement(0xc0009dc2c0?, {0x18cd550?, 0xc00053b8c0?}, 0x4214c7?, {0x0?, 0xe64210?, 0xc000378640?})
<https://ci-beam.apache.org/job/beam_LoadTests_Go_GBK_Flink_Batch/ws/src/sdks/go/pkg/beam/core/runtime/exec/pcollection.go>:100 +0x151
github.com/apache/beam/sdks/v2/go/pkg/beam/register.(*emit2[...]).invoke(0x18cec60, {0xc0009dc2b8, 0xc0003786e8?, 0x18bb7f8?}, {0xc0009dc2c0?, 0x9, 0x9})
<https://ci-beam.apache.org/job/beam_LoadTests_Go_GBK_Flink_Batch/ws/src/sdks/go/pkg/beam/register/emitter.go>:80 +0x20f
github.com/apache/beam/sdks/v2/go/pkg/beam/io/synthetic.(*sourceFn).ProcessElement(0xc000484350, 0x7f65c4d27108?, {0xbebc200, 0x1, 0x1, 0x9, 0x0, 0x0}, 0xc000311848)
<https://ci-beam.apache.org/job/beam_LoadTests_Go_GBK_Flink_Batch/ws/src/sdks/go/pkg/beam/io/synthetic/source.go>:151 +0x123
github.com/apache/beam/sdks/v2/go/pkg/beam/register.registerDoFn3x1StructWrappersAndFuncs[...].func2.1({0xbebc200?, 0x1, 0x1, 0x9, 0x0, 0x0}, 0x0)
<https://ci-beam.apache.org/job/beam_LoadTests_Go_GBK_Flink_Batch/ws/src/sdks/go/pkg/beam/register/register.go>:3382 +0xb0
github.com/apache/beam/sdks/v2/go/pkg/beam/register.(*caller3x1[...]).Call3x1(0x0?, {0x157e0a0?, 0xc000311818?}, {0x15d4a80?, 0xc0005430e0?}, {0x1302160?, 0xc000311848?})
<https://ci-beam.apache.org/job/beam_LoadTests_Go_GBK_Flink_Batch/ws/src/sdks/go/pkg/beam/register/register.go>:3371 +0xb6
github.com/apache/beam/sdks/v2/go/pkg/beam/core/runtime/exec.(*invoker).initCall.func13({0x0, 0x0, 0x0, 0x0, 0x0}, {0x23bbaf0, 0x1, 0x1}, 0x7f65c4d27108?)
<https://ci-beam.apache.org/job/beam_LoadTests_Go_GBK_Flink_Batch/ws/src/sdks/go/pkg/beam/core/runtime/exec/fn_arity.go>:109 +0xad
github.com/apache/beam/sdks/v2/go/pkg/beam/core/runtime/exec.(*invoker).invokeWithOpts(0xc000169040, {0x18cd550?, 0xc00053b8c0}, {0x0, 0x0, 0x0, 0x0, 0x0}, {0x23bbaf0, 0x1, ...}, ...)
<https://ci-beam.apache.org/job/beam_LoadTests_Go_GBK_Flink_Batch/ws/src/sdks/go/pkg/beam/core/runtime/exec/fn.go>:297 +0xfec
github.com/apache/beam/sdks/v2/go/pkg/beam/core/runtime/exec.(*ParDo).invokeProcessFn(0xc0001e4240, {0x18cd550, 0xc00053b8c0}, {0x0, 0x0, 0x0, 0x0, 0x0}, {0x23bbaf0, 0x1, ...}, ...)
<https://ci-beam.apache.org/job/beam_LoadTests_Go_GBK_Flink_Batch/ws/src/sdks/go/pkg/beam/core/runtime/exec/pardo.go>:508 +0x2b5
github.com/apache/beam/sdks/v2/go/pkg/beam/core/runtime/exec.(*ParDo).processSingleWindow(0xc0001e4240, 0xc0003bc990)
<https://ci-beam.apache.org/job/beam_LoadTests_Go_GBK_Flink_Batch/ws/src/sdks/go/pkg/beam/core/runtime/exec/pardo.go>:194 +0x9b
github.com/apache/beam/sdks/v2/go/pkg/beam/core/runtime/exec.(*ProcessSizedElementsAndRestrictions).ProcessElement(0xc0003937c0, {0x18cd550, 0xc000275f80}, 0xc00050c700, {0x0, 0x0, 0x0})
<https://ci-beam.apache.org/job/beam_LoadTests_Go_GBK_Flink_Batch/ws/src/sdks/go/pkg/beam/core/runtime/exec/sdf.go>:556 +0x63d
github.com/apache/beam/sdks/v2/go/pkg/beam/core/runtime/exec.(*DataSource).Process.func1(0xc000310df8, {0xc000379340?, 0xc00011d6a0?})
<https://ci-beam.apache.org/job/beam_LoadTests_Go_GBK_Flink_Batch/ws/src/sdks/go/pkg/beam/core/runtime/exec/datasource.go>:241 +0x21e
github.com/apache/beam/sdks/v2/go/pkg/beam/core/runtime/exec.(*DataSource).process(0xc00037a2c0, {0x18cd550, 0xc000275f80}, 0xc000379630, 0xc000379610)
<https://ci-beam.apache.org/job/beam_LoadTests_Go_GBK_Flink_Batch/ws/src/sdks/go/pkg/beam/core/runtime/exec/datasource.go>:147 +0x4f6
github.com/apache/beam/sdks/v2/go/pkg/beam/core/runtime/exec.(*DataSource).Process(0xc00037a2c0, {0x18cd550, 0xc000275f80})
<https://ci-beam.apache.org/job/beam_LoadTests_Go_GBK_Flink_Batch/ws/src/sdks/go/pkg/beam/core/runtime/exec/datasource.go>:215 +0x226
github.com/apache/beam/sdks/v2/go/pkg/beam/core/runtime/exec.(*Plan).Execute.func2({0x18cd550?, 0xc000275f80?})
<https://ci-beam.apache.org/job/beam_LoadTests_Go_GBK_Flink_Batch/ws/src/sdks/go/pkg/beam/core/runtime/exec/plan.go>:151 +0x42
github.com/apache/beam/sdks/v2/go/pkg/beam/core/runtime/exec.callNoPanic({0x18cd550?, 0xc000275f80?}, 0x415d50?)
<https://ci-beam.apache.org/job/beam_LoadTests_Go_GBK_Flink_Batch/ws/src/sdks/go/pkg/beam/core/runtime/exec/util.go>:62 +0x6c
github.com/apache/beam/sdks/v2/go/pkg/beam/core/runtime/exec.(*Plan).Execute(0xc000396480, {0x18cd550, 0xc000275f80}, {0x2362c98, 0x1}, {{0x18bf410?, 0xc00053b640?}, {0x18f9998?, 0xc000398ed0?}})
<https://ci-beam.apache.org/job/beam_LoadTests_Go_GBK_Flink_Batch/ws/src/sdks/go/pkg/beam/core/runtime/exec/plan.go>:150 +0x3df
github.com/apache/beam/sdks/v2/go/pkg/beam/core/runtime/harness.(*control).handleInstruction(0xc00008c000, {0x18cd438?, 0xc00053cc90?}, 0xc00018cd20)
<https://ci-beam.apache.org/job/beam_LoadTests_Go_GBK_Flink_Batch/ws/src/sdks/go/pkg/beam/core/runtime/harness/harness.go>:408 +0xa53
github.com/apache/beam/sdks/v2/go/pkg/beam/core/runtime/harness.MainWithOptions.func4({0x18cd438?, 0xc00053cc90?}, 0x0?)
<https://ci-beam.apache.org/job/beam_LoadTests_Go_GBK_Flink_Batch/ws/src/sdks/go/pkg/beam/core/runtime/harness/harness.go>:195 +0x7a
created by github.com/apache/beam/sdks/v2/go/pkg/beam/core/runtime/harness.MainWithOptions
<https://ci-beam.apache.org/job/beam_LoadTests_Go_GBK_Flink_Batch/ws/src/sdks/go/pkg/beam/core/runtime/harness/harness.go>:213 +0xf1d
2023/06/13 08:07:40 Job state: FAILED
2023/06/13 08:07:40 Failed to execute job: job load0tests0go0flink0batch0gbk0100613065410-root-0613080518-71a00b4_c7e2e843-a4df-48b2-befc-f6e0adec9571 failed
panic: Failed to execute job: job load0tests0go0flink0batch0gbk0100613065410-root-0613080518-71a00b4_c7e2e843-a4df-48b2-befc-f6e0adec9571 failed
goroutine 1 [running]:
github.com/apache/beam/sdks/v2/go/pkg/beam/log.Fatalf({0x18cd3c8, 0xc00004c0c0}, {0x1747d67?, 0x240e3b0?}, {0xc0005b9e70?, 0x0?, 0x0?})
<https://ci-beam.apache.org/job/beam_LoadTests_Go_GBK_Flink_Batch/ws/src/sdks/go/pkg/beam/log/log.go>:162 +0x8c
main.main()
<https://ci-beam.apache.org/job/beam_LoadTests_Go_GBK_Flink_Batch/ws/src/sdks/go/test/load/group_by_key/group_by_key.go>:98 +0x3eb
> Task :sdks:go:test:load:run FAILED
FAILURE: Build failed with an exception.
* Where:
Build file '<https://ci-beam.apache.org/job/beam_LoadTests_Go_GBK_Flink_Batch/ws/src/sdks/go/test/load/build.gradle'> line: 31
* What went wrong:
Execution failed for task ':sdks:go:test:load:run'.
> Process 'command 'sh'' finished with non-zero exit value 2
* Try:
> Run with --stacktrace option to get the stack trace.
> Run with --info or --debug option to get more log output.
* Get more help at https://help.gradle.org
BUILD FAILED in 2m 52s
12 actionable tasks: 6 executed, 4 from cache, 2 up-to-date
Publishing build scan...
https://ge.apache.org/s/ig6cmwblyxf32
Build step 'Invoke Gradle script' changed build result to FAILURE
Build step 'Invoke Gradle script' marked build as failure
---------------------------------------------------------------------
To unsubscribe, e-mail: builds-unsubscribe@beam.apache.org
For additional commands, e-mail: builds-help@beam.apache.org
Build failed in Jenkins: beam_LoadTests_Go_GBK_Flink_Batch #921
Posted by Apache Jenkins Server <je...@builds.apache.org>.
See <https://ci-beam.apache.org/job/beam_LoadTests_Go_GBK_Flink_Batch/921/display/redirect>
Changes:
------------------------------------------
[...truncated 48.33 KB...]
github.com/apache/beam/sdks/v2/go/pkg/beam/core/runtime/exec.(*invoker).invokeWithOpts(0xc00051c140, {0x18cd550?, 0xc0003fd600}, {0x0, 0x0, 0x0, 0x0, 0x0}, {0x23bbaf0, 0x1, ...}, ...)
<https://ci-beam.apache.org/job/beam_LoadTests_Go_GBK_Flink_Batch/ws/src/sdks/go/pkg/beam/core/runtime/exec/fn.go>:297 +0xfec
github.com/apache/beam/sdks/v2/go/pkg/beam/core/runtime/exec.(*ParDo).invokeProcessFn(0xc0001a9e60, {0x18cd550, 0xc0003fd600}, {0x0, 0x0, 0x0, 0x0, 0x0}, {0x23bbaf0, 0x1, ...}, ...)
<https://ci-beam.apache.org/job/beam_LoadTests_Go_GBK_Flink_Batch/ws/src/sdks/go/pkg/beam/core/runtime/exec/pardo.go>:508 +0x2b5
github.com/apache/beam/sdks/v2/go/pkg/beam/core/runtime/exec.(*ParDo).processSingleWindow(0xc0001a9e60, 0xc0003ba090)
<https://ci-beam.apache.org/job/beam_LoadTests_Go_GBK_Flink_Batch/ws/src/sdks/go/pkg/beam/core/runtime/exec/pardo.go>:194 +0x9b
github.com/apache/beam/sdks/v2/go/pkg/beam/core/runtime/exec.(*ProcessSizedElementsAndRestrictions).ProcessElement(0xc0004306e0, {0x18cd550, 0xc0000ae780}, 0xc00003ee70, {0x0, 0x0, 0x0})
<https://ci-beam.apache.org/job/beam_LoadTests_Go_GBK_Flink_Batch/ws/src/sdks/go/pkg/beam/core/runtime/exec/sdf.go>:556 +0x63d
github.com/apache/beam/sdks/v2/go/pkg/beam/core/runtime/exec.(*DataSource).Process.func1(0xc0003f47b0, {0xc000407340?, 0xc000444b60?})
<https://ci-beam.apache.org/job/beam_LoadTests_Go_GBK_Flink_Batch/ws/src/sdks/go/pkg/beam/core/runtime/exec/datasource.go>:241 +0x21e
github.com/apache/beam/sdks/v2/go/pkg/beam/core/runtime/exec.(*DataSource).process(0xc0000ea2c0, {0x18cd550, 0xc0000ae780}, 0xc000407630, 0xc000407610)
<https://ci-beam.apache.org/job/beam_LoadTests_Go_GBK_Flink_Batch/ws/src/sdks/go/pkg/beam/core/runtime/exec/datasource.go>:147 +0x4f6
github.com/apache/beam/sdks/v2/go/pkg/beam/core/runtime/exec.(*DataSource).Process(0xc0000ea2c0, {0x18cd550, 0xc0000ae780})
<https://ci-beam.apache.org/job/beam_LoadTests_Go_GBK_Flink_Batch/ws/src/sdks/go/pkg/beam/core/runtime/exec/datasource.go>:215 +0x226
github.com/apache/beam/sdks/v2/go/pkg/beam/core/runtime/exec.(*Plan).Execute.func2({0x18cd550?, 0xc0000ae780?})
<https://ci-beam.apache.org/job/beam_LoadTests_Go_GBK_Flink_Batch/ws/src/sdks/go/pkg/beam/core/runtime/exec/plan.go>:151 +0x42
github.com/apache/beam/sdks/v2/go/pkg/beam/core/runtime/exec.callNoPanic({0x18cd550?, 0xc0000ae780?}, 0x415d50?)
<https://ci-beam.apache.org/job/beam_LoadTests_Go_GBK_Flink_Batch/ws/src/sdks/go/pkg/beam/core/runtime/exec/util.go>:62 +0x6c
github.com/apache/beam/sdks/v2/go/pkg/beam/core/runtime/exec.(*Plan).Execute(0xc0003bb560, {0x18cd550, 0xc0000ae780}, {0x2362ca8, 0x1}, {{0x18bf410?, 0xc0003fd540?}, {0x18f9998?, 0xc0003fba70?}})
<https://ci-beam.apache.org/job/beam_LoadTests_Go_GBK_Flink_Batch/ws/src/sdks/go/pkg/beam/core/runtime/exec/plan.go>:150 +0x3df
github.com/apache/beam/sdks/v2/go/pkg/beam/core/runtime/harness.(*control).handleInstruction(0xc0001b2000, {0x18cd438?, 0xc00001ecf0?}, 0xc0000939a0)
<https://ci-beam.apache.org/job/beam_LoadTests_Go_GBK_Flink_Batch/ws/src/sdks/go/pkg/beam/core/runtime/harness/harness.go>:408 +0xa53
github.com/apache/beam/sdks/v2/go/pkg/beam/core/runtime/harness.MainWithOptions.func4({0x18cd438?, 0xc00001ecf0?}, 0x0?)
<https://ci-beam.apache.org/job/beam_LoadTests_Go_GBK_Flink_Batch/ws/src/sdks/go/pkg/beam/core/runtime/harness/harness.go>:195 +0x7a
created by github.com/apache/beam/sdks/v2/go/pkg/beam/core/runtime/harness.MainWithOptions
<https://ci-beam.apache.org/job/beam_LoadTests_Go_GBK_Flink_Batch/ws/src/sdks/go/pkg/beam/core/runtime/harness/harness.go>:213 +0xf1d
at java.util.concurrent.CompletableFuture.reportGet(CompletableFuture.java:395)
at java.util.concurrent.CompletableFuture.get(CompletableFuture.java:1999)
at org.apache.beam.sdk.util.MoreFutures.get(MoreFutures.java:61)
at org.apache.beam.runners.fnexecution.control.SdkHarnessClient$BundleProcessor$ActiveBundle.close(SdkHarnessClient.java:522)
at org.apache.beam.runners.fnexecution.control.DefaultJobBundleFactory$SimpleStageBundleFactory$1.close(DefaultJobBundleFactory.java:556)
at org.apache.beam.runners.flink.translation.functions.FlinkExecutableStageFunction.$closeResource(FlinkExecutableStageFunction.java:269)
at org.apache.beam.runners.flink.translation.functions.FlinkExecutableStageFunction.mapPartition(FlinkExecutableStageFunction.java:269)
at org.apache.flink.runtime.operators.MapPartitionDriver.run(MapPartitionDriver.java:113)
at org.apache.flink.runtime.operators.BatchTask.run(BatchTask.java:514)
at org.apache.flink.runtime.operators.BatchTask.invoke(BatchTask.java:357)
at org.apache.flink.runtime.taskmanager.Task.runWithSystemExitMonitoring(Task.java:948)
at org.apache.flink.runtime.taskmanager.Task.restoreAndInvoke(Task.java:927)
at org.apache.flink.runtime.taskmanager.Task.doRun(Task.java:741)
at org.apache.flink.runtime.taskmanager.Task.run(Task.java:563)
at java.lang.Thread.run(Thread.java:829)
Caused by: java.lang.RuntimeException: Error received from SDK harness for instruction 5: process bundle failed for instruction 5 using plan 1-6 : panic: datamgr.go [{5 fn/write/n4:0}]: error flushing buffer of length 4000000
caused by:
rpc error: code = Unknown desc =
Full error:
while executing Process for Plan[1-6]:
2: DataSink[S[fn/write/n4:0@localhost:41799]] Coder:W;fn/wire/n4:0<KV;c1<bytes;c0,bytes;c0>>!GWC
3: PCollection[n4] Out:[2]
4: ParDo[load.RuntimeMonitor] Out:[2] Sig: func([]uint8, []uint8, func([]uint8, []uint8))
5: PCollection[n3] Out:[4]
6: SDF.ProcessSizedElementsAndRestrictions[synthetic.sourceFn] UID:6 Out:[5]
1: DataSource[S[fn/read/n2/SplitAndSize0:0@localhost:41799], local_output] Out:6 Coder:W;fn/wire/n2/SplitAndSize0:0<KV;c5/SplitAndSize0<KV;c5/PairWithRestriction0<R;c5[synthetic.SourceConfig],KV;c9<offsetrange.Restriction[offsetrange.Restriction;c6];c7,bool;c8>>,double;DoubleCoder0>>!GWC
caused by:
panic: datamgr.go [{5 fn/write/n4:0}]: error flushing buffer of length 4000000
caused by:
rpc error: code = Unknown desc = goroutine 54 [running]:
runtime/debug.Stack()
/home/jenkins/sdk/go1.20.4/src/runtime/debug/stack.go:24 +0x65
github.com/apache/beam/sdks/v2/go/pkg/beam/core/runtime/exec.callNoPanic.func1()
<https://ci-beam.apache.org/job/beam_LoadTests_Go_GBK_Flink_Batch/ws/src/sdks/go/pkg/beam/core/runtime/exec/util.go>:58 +0xa5
panic({0x14a3060, 0xc00031a0c0})
/home/jenkins/sdk/go1.20.4/src/runtime/panic.go:884 +0x213
github.com/apache/beam/sdks/v2/go/pkg/beam/register.(*emit2[...]).invoke(0x18cec60, {0xc000938e48, 0x40a90d?, 0x4383bf?}, {0xc000938e50?, 0x9, 0x9})
<https://ci-beam.apache.org/job/beam_LoadTests_Go_GBK_Flink_Batch/ws/src/sdks/go/pkg/beam/register/emitter.go>:81 +0x22f
github.com/apache/beam/sdks/v2/go/test/load.(*RuntimeMonitor).ProcessElement(0x13d7b00?, {0xc000938e48?, 0x1?, 0x1?}, {0xc000938e50?, 0x9?, 0x9?}, 0xc0003f4798?)
<https://ci-beam.apache.org/job/beam_LoadTests_Go_GBK_Flink_Batch/ws/src/sdks/go/test/load/util.go>:87 +0x39
github.com/apache/beam/sdks/v2/go/pkg/beam/register.registerDoFn3x0StructWrappersAndFuncs[...].func2.1({0xc000938e50, 0x9, 0x9}, 0x46eb0a)
<https://ci-beam.apache.org/job/beam_LoadTests_Go_GBK_Flink_Batch/ws/src/sdks/go/pkg/beam/register/register.go>:2469 +0x9c
github.com/apache/beam/sdks/v2/go/pkg/beam/register.(*caller3x0[...]).Call3x0(0x46c383?, {0x12cfee0?, 0xc0009447c8?}, {0x12cfee0?, 0xc0009447e0?}, {0x1302160?, 0xc0003f4798?})
<https://ci-beam.apache.org/job/beam_LoadTests_Go_GBK_Flink_Batch/ws/src/sdks/go/pkg/beam/register/register.go>:2458 +0x7f
github.com/apache/beam/sdks/v2/go/pkg/beam/core/runtime/exec.(*invoker).initCall.func4({0x0, 0x0, 0x0, 0x0, 0x0}, {0x23bbaf0?, 0x1?, 0x1?}, 0xffdf3b645a1cac09?)
<https://ci-beam.apache.org/job/beam_LoadTests_Go_GBK_Flink_Batch/ws/src/sdks/go/pkg/beam/core/runtime/exec/fn_arity.go>:55 +0x75
github.com/apache/beam/sdks/v2/go/pkg/beam/core/runtime/exec.(*invoker).invokeWithOpts(0xc00002fe00, {0x18cd550?, 0xc0003fd640}, {0x0, 0x0, 0x0, 0x0, 0x0}, {0x23bbaf0, 0x1, ...}, ...)
<https://ci-beam.apache.org/job/beam_LoadTests_Go_GBK_Flink_Batch/ws/src/sdks/go/pkg/beam/core/runtime/exec/fn.go>:297 +0xfec
github.com/apache/beam/sdks/v2/go/pkg/beam/core/runtime/exec.(*ParDo).invokeProcessFn(0xc0001a9c20, {0x18cd550, 0xc0003fd640}, {0x0, 0x0, 0x0, 0x0, 0x0}, {0x23bbaf0, 0x1, ...}, ...)
<https://ci-beam.apache.org/job/beam_LoadTests_Go_GBK_Flink_Batch/ws/src/sdks/go/pkg/beam/core/runtime/exec/pardo.go>:508 +0x2b5
github.com/apache/beam/sdks/v2/go/pkg/beam/core/runtime/exec.(*ParDo).processSingleWindow(0xc0001a9c20, 0xc0009433b0)
<https://ci-beam.apache.org/job/beam_LoadTests_Go_GBK_Flink_Batch/ws/src/sdks/go/pkg/beam/core/runtime/exec/pardo.go>:194 +0x9b
github.com/apache/beam/sdks/v2/go/pkg/beam/core/runtime/exec.(*ParDo).processMainInput(0x155?, 0x18cd550?)
<https://ci-beam.apache.org/job/beam_LoadTests_Go_GBK_Flink_Batch/ws/src/sdks/go/pkg/beam/core/runtime/exec/pardo.go>:172 +0x91
github.com/apache/beam/sdks/v2/go/pkg/beam/core/runtime/exec.(*ParDo).ProcessElement(0xc0001a9c20, {0x18?, 0xc0002a6400?}, 0xc000241f28, {0x0, 0x0, 0x0})
<https://ci-beam.apache.org/job/beam_LoadTests_Go_GBK_Flink_Batch/ws/src/sdks/go/pkg/beam/core/runtime/exec/pardo.go>:156 +0x125
github.com/apache/beam/sdks/v2/go/pkg/beam/core/runtime/exec.(*PCollection).ProcessElement(0xc000938e50?, {0x18cd550?, 0xc0003fd600?}, 0x4214c7?, {0x0?, 0x200?, 0xc0?})
<https://ci-beam.apache.org/job/beam_LoadTests_Go_GBK_Flink_Batch/ws/src/sdks/go/pkg/beam/core/runtime/exec/pcollection.go>:100 +0x151
github.com/apache/beam/sdks/v2/go/pkg/beam/register.(*emit2[...]).invoke(0x18cec60, {0xc000938e48, 0xc0004066e8?, 0x18bb7f8?}, {0xc000938e50?, 0x9, 0x9})
<https://ci-beam.apache.org/job/beam_LoadTests_Go_GBK_Flink_Batch/ws/src/sdks/go/pkg/beam/register/emitter.go>:80 +0x20f
github.com/apache/beam/sdks/v2/go/pkg/beam/io/synthetic.(*sourceFn).ProcessElement(0xc0003f11f0, 0x7f67046a4108?, {0xbebc200, 0x1, 0x1, 0x9, 0x0, 0x0}, 0xc0003f4840)
<https://ci-beam.apache.org/job/beam_LoadTests_Go_GBK_Flink_Batch/ws/src/sdks/go/pkg/beam/io/synthetic/source.go>:151 +0x123
github.com/apache/beam/sdks/v2/go/pkg/beam/register.registerDoFn3x1StructWrappersAndFuncs[...].func2.1({0xbebc200?, 0x1, 0x1, 0x9, 0x0, 0x0}, 0x0)
<https://ci-beam.apache.org/job/beam_LoadTests_Go_GBK_Flink_Batch/ws/src/sdks/go/pkg/beam/register/register.go>:3382 +0xb0
github.com/apache/beam/sdks/v2/go/pkg/beam/register.(*caller3x1[...]).Call3x1(0x0?, {0x157e0a0?, 0xc0003f4810?}, {0x15d4a80?, 0xc0005deab0?}, {0x1302160?, 0xc0003f4840?})
<https://ci-beam.apache.org/job/beam_LoadTests_Go_GBK_Flink_Batch/ws/src/sdks/go/pkg/beam/register/register.go>:3371 +0xb6
github.com/apache/beam/sdks/v2/go/pkg/beam/core/runtime/exec.(*invoker).initCall.func13({0x0, 0x0, 0x0, 0x0, 0x0}, {0x23bbaf0, 0x1, 0x1}, 0x7f67046a4108?)
<https://ci-beam.apache.org/job/beam_LoadTests_Go_GBK_Flink_Batch/ws/src/sdks/go/pkg/beam/core/runtime/exec/fn_arity.go>:109 +0xad
github.com/apache/beam/sdks/v2/go/pkg/beam/core/runtime/exec.(*invoker).invokeWithOpts(0xc00051c140, {0x18cd550?, 0xc0003fd600}, {0x0, 0x0, 0x0, 0x0, 0x0}, {0x23bbaf0, 0x1, ...}, ...)
<https://ci-beam.apache.org/job/beam_LoadTests_Go_GBK_Flink_Batch/ws/src/sdks/go/pkg/beam/core/runtime/exec/fn.go>:297 +0xfec
github.com/apache/beam/sdks/v2/go/pkg/beam/core/runtime/exec.(*ParDo).invokeProcessFn(0xc0001a9e60, {0x18cd550, 0xc0003fd600}, {0x0, 0x0, 0x0, 0x0, 0x0}, {0x23bbaf0, 0x1, ...}, ...)
<https://ci-beam.apache.org/job/beam_LoadTests_Go_GBK_Flink_Batch/ws/src/sdks/go/pkg/beam/core/runtime/exec/pardo.go>:508 +0x2b5
github.com/apache/beam/sdks/v2/go/pkg/beam/core/runtime/exec.(*ParDo).processSingleWindow(0xc0001a9e60, 0xc0003ba090)
<https://ci-beam.apache.org/job/beam_LoadTests_Go_GBK_Flink_Batch/ws/src/sdks/go/pkg/beam/core/runtime/exec/pardo.go>:194 +0x9b
github.com/apache/beam/sdks/v2/go/pkg/beam/core/runtime/exec.(*ProcessSizedElementsAndRestrictions).ProcessElement(0xc0004306e0, {0x18cd550, 0xc0000ae780}, 0xc00003ee70, {0x0, 0x0, 0x0})
<https://ci-beam.apache.org/job/beam_LoadTests_Go_GBK_Flink_Batch/ws/src/sdks/go/pkg/beam/core/runtime/exec/sdf.go>:556 +0x63d
github.com/apache/beam/sdks/v2/go/pkg/beam/core/runtime/exec.(*DataSource).Process.func1(0xc0003f47b0, {0xc000407340?, 0xc000444b60?})
<https://ci-beam.apache.org/job/beam_LoadTests_Go_GBK_Flink_Batch/ws/src/sdks/go/pkg/beam/core/runtime/exec/datasource.go>:241 +0x21e
github.com/apache/beam/sdks/v2/go/pkg/beam/core/runtime/exec.(*DataSource).process(0xc0000ea2c0, {0x18cd550, 0xc0000ae780}, 0xc000407630, 0xc000407610)
<https://ci-beam.apache.org/job/beam_LoadTests_Go_GBK_Flink_Batch/ws/src/sdks/go/pkg/beam/core/runtime/exec/datasource.go>:147 +0x4f6
github.com/apache/beam/sdks/v2/go/pkg/beam/core/runtime/exec.(*DataSource).Process(0xc0000ea2c0, {0x18cd550, 0xc0000ae780})
<https://ci-beam.apache.org/job/beam_LoadTests_Go_GBK_Flink_Batch/ws/src/sdks/go/pkg/beam/core/runtime/exec/datasource.go>:215 +0x226
github.com/apache/beam/sdks/v2/go/pkg/beam/core/runtime/exec.(*Plan).Execute.func2({0x18cd550?, 0xc0000ae780?})
<https://ci-beam.apache.org/job/beam_LoadTests_Go_GBK_Flink_Batch/ws/src/sdks/go/pkg/beam/core/runtime/exec/plan.go>:151 +0x42
github.com/apache/beam/sdks/v2/go/pkg/beam/core/runtime/exec.callNoPanic({0x18cd550?, 0xc0000ae780?}, 0x415d50?)
<https://ci-beam.apache.org/job/beam_LoadTests_Go_GBK_Flink_Batch/ws/src/sdks/go/pkg/beam/core/runtime/exec/util.go>:62 +0x6c
github.com/apache/beam/sdks/v2/go/pkg/beam/core/runtime/exec.(*Plan).Execute(0xc0003bb560, {0x18cd550, 0xc0000ae780}, {0x2362ca8, 0x1}, {{0x18bf410?, 0xc0003fd540?}, {0x18f9998?, 0xc0003fba70?}})
<https://ci-beam.apache.org/job/beam_LoadTests_Go_GBK_Flink_Batch/ws/src/sdks/go/pkg/beam/core/runtime/exec/plan.go>:150 +0x3df
github.com/apache/beam/sdks/v2/go/pkg/beam/core/runtime/harness.(*control).handleInstruction(0xc0001b2000, {0x18cd438?, 0xc00001ecf0?}, 0xc0000939a0)
<https://ci-beam.apache.org/job/beam_LoadTests_Go_GBK_Flink_Batch/ws/src/sdks/go/pkg/beam/core/runtime/harness/harness.go>:408 +0xa53
github.com/apache/beam/sdks/v2/go/pkg/beam/core/runtime/harness.MainWithOptions.func4({0x18cd438?, 0xc00001ecf0?}, 0x0?)
<https://ci-beam.apache.org/job/beam_LoadTests_Go_GBK_Flink_Batch/ws/src/sdks/go/pkg/beam/core/runtime/harness/harness.go>:195 +0x7a
created by github.com/apache/beam/sdks/v2/go/pkg/beam/core/runtime/harness.MainWithOptions
<https://ci-beam.apache.org/job/beam_LoadTests_Go_GBK_Flink_Batch/ws/src/sdks/go/pkg/beam/core/runtime/harness/harness.go>:213 +0xf1d
at org.apache.beam.runners.fnexecution.control.FnApiControlClient$ResponseStreamObserver.onNext(FnApiControlClient.java:180)
at org.apache.beam.runners.fnexecution.control.FnApiControlClient$ResponseStreamObserver.onNext(FnApiControlClient.java:160)
at org.apache.beam.vendor.grpc.v1p54p0.io.grpc.stub.ServerCalls$StreamingServerCallHandler$StreamingServerCallListener.onMessage(ServerCalls.java:262)
at org.apache.beam.vendor.grpc.v1p54p0.io.grpc.ForwardingServerCallListener.onMessage(ForwardingServerCallListener.java:33)
at org.apache.beam.vendor.grpc.v1p54p0.io.grpc.Contexts$ContextualizedServerCallListener.onMessage(Contexts.java:76)
at org.apache.beam.vendor.grpc.v1p54p0.io.grpc.internal.ServerCallImpl$ServerStreamListenerImpl.messagesAvailableInternal(ServerCallImpl.java:333)
at org.apache.beam.vendor.grpc.v1p54p0.io.grpc.internal.ServerCallImpl$ServerStreamListenerImpl.messagesAvailable(ServerCallImpl.java:316)
at org.apache.beam.vendor.grpc.v1p54p0.io.grpc.internal.ServerImpl$JumpToApplicationThreadServerStreamListener$1MessagesAvailable.runInContext(ServerImpl.java:835)
at org.apache.beam.vendor.grpc.v1p54p0.io.grpc.internal.ContextRunnable.run(ContextRunnable.java:37)
at org.apache.beam.vendor.grpc.v1p54p0.io.grpc.internal.SerializingExecutor.run(SerializingExecutor.java:133)
at java.util.concurrent.ThreadPoolExecutor.runWorker(ThreadPoolExecutor.java:1128)
at java.util.concurrent.ThreadPoolExecutor$Worker.run(ThreadPoolExecutor.java:628)
... 1 more
2023/06/12 08:08:08 (): java.lang.RuntimeException: Error received from SDK harness for instruction 5: process bundle failed for instruction 5 using plan 1-6 : panic: datamgr.go [{5 fn/write/n4:0}]: error flushing buffer of length 4000000
caused by:
rpc error: code = Unknown desc =
Full error:
while executing Process for Plan[1-6]:
2: DataSink[S[fn/write/n4:0@localhost:41799]] Coder:W;fn/wire/n4:0<KV;c1<bytes;c0,bytes;c0>>!GWC
3: PCollection[n4] Out:[2]
4: ParDo[load.RuntimeMonitor] Out:[2] Sig: func([]uint8, []uint8, func([]uint8, []uint8))
5: PCollection[n3] Out:[4]
6: SDF.ProcessSizedElementsAndRestrictions[synthetic.sourceFn] UID:6 Out:[5]
1: DataSource[S[fn/read/n2/SplitAndSize0:0@localhost:41799], local_output] Out:6 Coder:W;fn/wire/n2/SplitAndSize0:0<KV;c5/SplitAndSize0<KV;c5/PairWithRestriction0<R;c5[synthetic.SourceConfig],KV;c9<offsetrange.Restriction[offsetrange.Restriction;c6];c7,bool;c8>>,double;DoubleCoder0>>!GWC
caused by:
panic: datamgr.go [{5 fn/write/n4:0}]: error flushing buffer of length 4000000
caused by:
rpc error: code = Unknown desc = goroutine 54 [running]:
runtime/debug.Stack()
/home/jenkins/sdk/go1.20.4/src/runtime/debug/stack.go:24 +0x65
github.com/apache/beam/sdks/v2/go/pkg/beam/core/runtime/exec.callNoPanic.func1()
<https://ci-beam.apache.org/job/beam_LoadTests_Go_GBK_Flink_Batch/ws/src/sdks/go/pkg/beam/core/runtime/exec/util.go>:58 +0xa5
panic({0x14a3060, 0xc00031a0c0})
/home/jenkins/sdk/go1.20.4/src/runtime/panic.go:884 +0x213
github.com/apache/beam/sdks/v2/go/pkg/beam/register.(*emit2[...]).invoke(0x18cec60, {0xc000938e48, 0x40a90d?, 0x4383bf?}, {0xc000938e50?, 0x9, 0x9})
<https://ci-beam.apache.org/job/beam_LoadTests_Go_GBK_Flink_Batch/ws/src/sdks/go/pkg/beam/register/emitter.go>:81 +0x22f
github.com/apache/beam/sdks/v2/go/test/load.(*RuntimeMonitor).ProcessElement(0x13d7b00?, {0xc000938e48?, 0x1?, 0x1?}, {0xc000938e50?, 0x9?, 0x9?}, 0xc0003f4798?)
<https://ci-beam.apache.org/job/beam_LoadTests_Go_GBK_Flink_Batch/ws/src/sdks/go/test/load/util.go>:87 +0x39
github.com/apache/beam/sdks/v2/go/pkg/beam/register.registerDoFn3x0StructWrappersAndFuncs[...].func2.1({0xc000938e50, 0x9, 0x9}, 0x46eb0a)
<https://ci-beam.apache.org/job/beam_LoadTests_Go_GBK_Flink_Batch/ws/src/sdks/go/pkg/beam/register/register.go>:2469 +0x9c
github.com/apache/beam/sdks/v2/go/pkg/beam/register.(*caller3x0[...]).Call3x0(0x46c383?, {0x12cfee0?, 0xc0009447c8?}, {0x12cfee0?, 0xc0009447e0?}, {0x1302160?, 0xc0003f4798?})
<https://ci-beam.apache.org/job/beam_LoadTests_Go_GBK_Flink_Batch/ws/src/sdks/go/pkg/beam/register/register.go>:2458 +0x7f
github.com/apache/beam/sdks/v2/go/pkg/beam/core/runtime/exec.(*invoker).initCall.func4({0x0, 0x0, 0x0, 0x0, 0x0}, {0x23bbaf0?, 0x1?, 0x1?}, 0xffdf3b645a1cac09?)
<https://ci-beam.apache.org/job/beam_LoadTests_Go_GBK_Flink_Batch/ws/src/sdks/go/pkg/beam/core/runtime/exec/fn_arity.go>:55 +0x75
github.com/apache/beam/sdks/v2/go/pkg/beam/core/runtime/exec.(*invoker).invokeWithOpts(0xc00002fe00, {0x18cd550?, 0xc0003fd640}, {0x0, 0x0, 0x0, 0x0, 0x0}, {0x23bbaf0, 0x1, ...}, ...)
<https://ci-beam.apache.org/job/beam_LoadTests_Go_GBK_Flink_Batch/ws/src/sdks/go/pkg/beam/core/runtime/exec/fn.go>:297 +0xfec
github.com/apache/beam/sdks/v2/go/pkg/beam/core/runtime/exec.(*ParDo).invokeProcessFn(0xc0001a9c20, {0x18cd550, 0xc0003fd640}, {0x0, 0x0, 0x0, 0x0, 0x0}, {0x23bbaf0, 0x1, ...}, ...)
<https://ci-beam.apache.org/job/beam_LoadTests_Go_GBK_Flink_Batch/ws/src/sdks/go/pkg/beam/core/runtime/exec/pardo.go>:508 +0x2b5
github.com/apache/beam/sdks/v2/go/pkg/beam/core/runtime/exec.(*ParDo).processSingleWindow(0xc0001a9c20, 0xc0009433b0)
<https://ci-beam.apache.org/job/beam_LoadTests_Go_GBK_Flink_Batch/ws/src/sdks/go/pkg/beam/core/runtime/exec/pardo.go>:194 +0x9b
github.com/apache/beam/sdks/v2/go/pkg/beam/core/runtime/exec.(*ParDo).processMainInput(0x155?, 0x18cd550?)
<https://ci-beam.apache.org/job/beam_LoadTests_Go_GBK_Flink_Batch/ws/src/sdks/go/pkg/beam/core/runtime/exec/pardo.go>:172 +0x91
github.com/apache/beam/sdks/v2/go/pkg/beam/core/runtime/exec.(*ParDo).ProcessElement(0xc0001a9c20, {0x18?, 0xc0002a6400?}, 0xc000241f28, {0x0, 0x0, 0x0})
<https://ci-beam.apache.org/job/beam_LoadTests_Go_GBK_Flink_Batch/ws/src/sdks/go/pkg/beam/core/runtime/exec/pardo.go>:156 +0x125
github.com/apache/beam/sdks/v2/go/pkg/beam/core/runtime/exec.(*PCollection).ProcessElement(0xc000938e50?, {0x18cd550?, 0xc0003fd600?}, 0x4214c7?, {0x0?, 0x200?, 0xc0?})
<https://ci-beam.apache.org/job/beam_LoadTests_Go_GBK_Flink_Batch/ws/src/sdks/go/pkg/beam/core/runtime/exec/pcollection.go>:100 +0x151
github.com/apache/beam/sdks/v2/go/pkg/beam/register.(*emit2[...]).invoke(0x18cec60, {0xc000938e48, 0xc0004066e8?, 0x18bb7f8?}, {0xc000938e50?, 0x9, 0x9})
<https://ci-beam.apache.org/job/beam_LoadTests_Go_GBK_Flink_Batch/ws/src/sdks/go/pkg/beam/register/emitter.go>:80 +0x20f
github.com/apache/beam/sdks/v2/go/pkg/beam/io/synthetic.(*sourceFn).ProcessElement(0xc0003f11f0, 0x7f67046a4108?, {0xbebc200, 0x1, 0x1, 0x9, 0x0, 0x0}, 0xc0003f4840)
<https://ci-beam.apache.org/job/beam_LoadTests_Go_GBK_Flink_Batch/ws/src/sdks/go/pkg/beam/io/synthetic/source.go>:151 +0x123
github.com/apache/beam/sdks/v2/go/pkg/beam/register.registerDoFn3x1StructWrappersAndFuncs[...].func2.1({0xbebc200?, 0x1, 0x1, 0x9, 0x0, 0x0}, 0x0)
<https://ci-beam.apache.org/job/beam_LoadTests_Go_GBK_Flink_Batch/ws/src/sdks/go/pkg/beam/register/register.go>:3382 +0xb0
github.com/apache/beam/sdks/v2/go/pkg/beam/register.(*caller3x1[...]).Call3x1(0x0?, {0x157e0a0?, 0xc0003f4810?}, {0x15d4a80?, 0xc0005deab0?}, {0x1302160?, 0xc0003f4840?})
<https://ci-beam.apache.org/job/beam_LoadTests_Go_GBK_Flink_Batch/ws/src/sdks/go/pkg/beam/register/register.go>:3371 +0xb6
github.com/apache/beam/sdks/v2/go/pkg/beam/core/runtime/exec.(*invoker).initCall.func13({0x0, 0x0, 0x0, 0x0, 0x0}, {0x23bbaf0, 0x1, 0x1}, 0x7f67046a4108?)
<https://ci-beam.apache.org/job/beam_LoadTests_Go_GBK_Flink_Batch/ws/src/sdks/go/pkg/beam/core/runtime/exec/fn_arity.go>:109 +0xad
github.com/apache/beam/sdks/v2/go/pkg/beam/core/runtime/exec.(*invoker).invokeWithOpts(0xc00051c140, {0x18cd550?, 0xc0003fd600}, {0x0, 0x0, 0x0, 0x0, 0x0}, {0x23bbaf0, 0x1, ...}, ...)
<https://ci-beam.apache.org/job/beam_LoadTests_Go_GBK_Flink_Batch/ws/src/sdks/go/pkg/beam/core/runtime/exec/fn.go>:297 +0xfec
github.com/apache/beam/sdks/v2/go/pkg/beam/core/runtime/exec.(*ParDo).invokeProcessFn(0xc0001a9e60, {0x18cd550, 0xc0003fd600}, {0x0, 0x0, 0x0, 0x0, 0x0}, {0x23bbaf0, 0x1, ...}, ...)
<https://ci-beam.apache.org/job/beam_LoadTests_Go_GBK_Flink_Batch/ws/src/sdks/go/pkg/beam/core/runtime/exec/pardo.go>:508 +0x2b5
github.com/apache/beam/sdks/v2/go/pkg/beam/core/runtime/exec.(*ParDo).processSingleWindow(0xc0001a9e60, 0xc0003ba090)
<https://ci-beam.apache.org/job/beam_LoadTests_Go_GBK_Flink_Batch/ws/src/sdks/go/pkg/beam/core/runtime/exec/pardo.go>:194 +0x9b
github.com/apache/beam/sdks/v2/go/pkg/beam/core/runtime/exec.(*ProcessSizedElementsAndRestrictions).ProcessElement(0xc0004306e0, {0x18cd550, 0xc0000ae780}, 0xc00003ee70, {0x0, 0x0, 0x0})
<https://ci-beam.apache.org/job/beam_LoadTests_Go_GBK_Flink_Batch/ws/src/sdks/go/pkg/beam/core/runtime/exec/sdf.go>:556 +0x63d
github.com/apache/beam/sdks/v2/go/pkg/beam/core/runtime/exec.(*DataSource).Process.func1(0xc0003f47b0, {0xc000407340?, 0xc000444b60?})
<https://ci-beam.apache.org/job/beam_LoadTests_Go_GBK_Flink_Batch/ws/src/sdks/go/pkg/beam/core/runtime/exec/datasource.go>:241 +0x21e
github.com/apache/beam/sdks/v2/go/pkg/beam/core/runtime/exec.(*DataSource).process(0xc0000ea2c0, {0x18cd550, 0xc0000ae780}, 0xc000407630, 0xc000407610)
<https://ci-beam.apache.org/job/beam_LoadTests_Go_GBK_Flink_Batch/ws/src/sdks/go/pkg/beam/core/runtime/exec/datasource.go>:147 +0x4f6
github.com/apache/beam/sdks/v2/go/pkg/beam/core/runtime/exec.(*DataSource).Process(0xc0000ea2c0, {0x18cd550, 0xc0000ae780})
<https://ci-beam.apache.org/job/beam_LoadTests_Go_GBK_Flink_Batch/ws/src/sdks/go/pkg/beam/core/runtime/exec/datasource.go>:215 +0x226
github.com/apache/beam/sdks/v2/go/pkg/beam/core/runtime/exec.(*Plan).Execute.func2({0x18cd550?, 0xc0000ae780?})
<https://ci-beam.apache.org/job/beam_LoadTests_Go_GBK_Flink_Batch/ws/src/sdks/go/pkg/beam/core/runtime/exec/plan.go>:151 +0x42
github.com/apache/beam/sdks/v2/go/pkg/beam/core/runtime/exec.callNoPanic({0x18cd550?, 0xc0000ae780?}, 0x415d50?)
<https://ci-beam.apache.org/job/beam_LoadTests_Go_GBK_Flink_Batch/ws/src/sdks/go/pkg/beam/core/runtime/exec/util.go>:62 +0x6c
github.com/apache/beam/sdks/v2/go/pkg/beam/core/runtime/exec.(*Plan).Execute(0xc0003bb560, {0x18cd550, 0xc0000ae780}, {0x2362ca8, 0x1}, {{0x18bf410?, 0xc0003fd540?}, {0x18f9998?, 0xc0003fba70?}})
<https://ci-beam.apache.org/job/beam_LoadTests_Go_GBK_Flink_Batch/ws/src/sdks/go/pkg/beam/core/runtime/exec/plan.go>:150 +0x3df
github.com/apache/beam/sdks/v2/go/pkg/beam/core/runtime/harness.(*control).handleInstruction(0xc0001b2000, {0x18cd438?, 0xc00001ecf0?}, 0xc0000939a0)
<https://ci-beam.apache.org/job/beam_LoadTests_Go_GBK_Flink_Batch/ws/src/sdks/go/pkg/beam/core/runtime/harness/harness.go>:408 +0xa53
github.com/apache/beam/sdks/v2/go/pkg/beam/core/runtime/harness.MainWithOptions.func4({0x18cd438?, 0xc00001ecf0?}, 0x0?)
<https://ci-beam.apache.org/job/beam_LoadTests_Go_GBK_Flink_Batch/ws/src/sdks/go/pkg/beam/core/runtime/harness/harness.go>:195 +0x7a
created by github.com/apache/beam/sdks/v2/go/pkg/beam/core/runtime/harness.MainWithOptions
<https://ci-beam.apache.org/job/beam_LoadTests_Go_GBK_Flink_Batch/ws/src/sdks/go/pkg/beam/core/runtime/harness/harness.go>:213 +0xf1d
2023/06/12 08:08:08 Job state: FAILED
2023/06/12 08:08:08 Failed to execute job: job load0tests0go0flink0batch0gbk0100612065411-root-0612080550-3f882918_f17346c3-8c15-4018-8766-8f8976192562 failed
panic: Failed to execute job: job load0tests0go0flink0batch0gbk0100612065411-root-0612080550-3f882918_f17346c3-8c15-4018-8766-8f8976192562 failed
goroutine 1 [running]:
github.com/apache/beam/sdks/v2/go/pkg/beam/log.Fatalf({0x18cd3c8, 0xc00004c0c0}, {0x1747d67?, 0x240e3b0?}, {0xc00053fe70?, 0x0?, 0x0?})
<https://ci-beam.apache.org/job/beam_LoadTests_Go_GBK_Flink_Batch/ws/src/sdks/go/pkg/beam/log/log.go>:162 +0x8c
main.main()
<https://ci-beam.apache.org/job/beam_LoadTests_Go_GBK_Flink_Batch/ws/src/sdks/go/test/load/group_by_key/group_by_key.go>:98 +0x3eb
> Task :sdks:go:test:load:run FAILED
FAILURE: Build failed with an exception.
* Where:
Build file '<https://ci-beam.apache.org/job/beam_LoadTests_Go_GBK_Flink_Batch/ws/src/sdks/go/test/load/build.gradle'> line: 31
* What went wrong:
Execution failed for task ':sdks:go:test:load:run'.
> Process 'command 'sh'' finished with non-zero exit value 2
* Try:
> Run with --stacktrace option to get the stack trace.
> Run with --info or --debug option to get more log output.
* Get more help at https://help.gradle.org
BUILD FAILED in 2m 58s
12 actionable tasks: 6 executed, 4 from cache, 2 up-to-date
Publishing build scan...
https://ge.apache.org/s/yqxqnnzlwcarw
Build step 'Invoke Gradle script' changed build result to FAILURE
Build step 'Invoke Gradle script' marked build as failure
---------------------------------------------------------------------
To unsubscribe, e-mail: builds-unsubscribe@beam.apache.org
For additional commands, e-mail: builds-help@beam.apache.org
Build failed in Jenkins: beam_LoadTests_Go_GBK_Flink_Batch #920
Posted by Apache Jenkins Server <je...@builds.apache.org>.
See <https://ci-beam.apache.org/job/beam_LoadTests_Go_GBK_Flink_Batch/920/display/redirect>
Changes:
------------------------------------------
[...truncated 48.03 KB...]
github.com/apache/beam/sdks/v2/go/pkg/beam/core/runtime/exec.(*invoker).invokeWithOpts(0xc0004d3e00, {0x18cd550?, 0xc00039c400}, {0x0, 0x0, 0x0, 0x0, 0x0}, {0x23bbaf0, 0x1, ...}, ...)
<https://ci-beam.apache.org/job/beam_LoadTests_Go_GBK_Flink_Batch/ws/src/sdks/go/pkg/beam/core/runtime/exec/fn.go>:297 +0xfec
github.com/apache/beam/sdks/v2/go/pkg/beam/core/runtime/exec.(*ParDo).invokeProcessFn(0xc00036a480, {0x18cd550, 0xc00039c400}, {0x0, 0x0, 0x0, 0x0, 0x0}, {0x23bbaf0, 0x1, ...}, ...)
<https://ci-beam.apache.org/job/beam_LoadTests_Go_GBK_Flink_Batch/ws/src/sdks/go/pkg/beam/core/runtime/exec/pardo.go>:508 +0x2b5
github.com/apache/beam/sdks/v2/go/pkg/beam/core/runtime/exec.(*ParDo).processSingleWindow(0xc00036a480, 0xc0003dc5a0)
<https://ci-beam.apache.org/job/beam_LoadTests_Go_GBK_Flink_Batch/ws/src/sdks/go/pkg/beam/core/runtime/exec/pardo.go>:194 +0x9b
github.com/apache/beam/sdks/v2/go/pkg/beam/core/runtime/exec.(*ProcessSizedElementsAndRestrictions).ProcessElement(0xc000372fa0, {0x18cd550, 0xc0004ce580}, 0xc0005d7ea0, {0x0, 0x0, 0x0})
<https://ci-beam.apache.org/job/beam_LoadTests_Go_GBK_Flink_Batch/ws/src/sdks/go/pkg/beam/core/runtime/exec/sdf.go>:556 +0x63d
github.com/apache/beam/sdks/v2/go/pkg/beam/core/runtime/exec.(*DataSource).Process.func1(0xc000203b30, {0xc000399340?, 0xc000488900?})
<https://ci-beam.apache.org/job/beam_LoadTests_Go_GBK_Flink_Batch/ws/src/sdks/go/pkg/beam/core/runtime/exec/datasource.go>:241 +0x21e
github.com/apache/beam/sdks/v2/go/pkg/beam/core/runtime/exec.(*DataSource).process(0xc00035e420, {0x18cd550, 0xc0004ce580}, 0xc000399630, 0xc000399610)
<https://ci-beam.apache.org/job/beam_LoadTests_Go_GBK_Flink_Batch/ws/src/sdks/go/pkg/beam/core/runtime/exec/datasource.go>:147 +0x4f6
github.com/apache/beam/sdks/v2/go/pkg/beam/core/runtime/exec.(*DataSource).Process(0xc00035e420, {0x18cd550, 0xc0004ce580})
<https://ci-beam.apache.org/job/beam_LoadTests_Go_GBK_Flink_Batch/ws/src/sdks/go/pkg/beam/core/runtime/exec/datasource.go>:215 +0x226
github.com/apache/beam/sdks/v2/go/pkg/beam/core/runtime/exec.(*Plan).Execute.func2({0x18cd550?, 0xc0004ce580?})
<https://ci-beam.apache.org/job/beam_LoadTests_Go_GBK_Flink_Batch/ws/src/sdks/go/pkg/beam/core/runtime/exec/plan.go>:151 +0x42
github.com/apache/beam/sdks/v2/go/pkg/beam/core/runtime/exec.callNoPanic({0x18cd550?, 0xc0004ce580?}, 0x415d50?)
<https://ci-beam.apache.org/job/beam_LoadTests_Go_GBK_Flink_Batch/ws/src/sdks/go/pkg/beam/core/runtime/exec/util.go>:62 +0x6c
github.com/apache/beam/sdks/v2/go/pkg/beam/core/runtime/exec.(*Plan).Execute(0xc0003a2000, {0x18cd550, 0xc0004ce580}, {0x2362cb0, 0x1}, {{0x18bf410?, 0xc00039c340?}, {0x18f9998?, 0xc00036eb70?}})
<https://ci-beam.apache.org/job/beam_LoadTests_Go_GBK_Flink_Batch/ws/src/sdks/go/pkg/beam/core/runtime/exec/plan.go>:150 +0x3df
github.com/apache/beam/sdks/v2/go/pkg/beam/core/runtime/harness.(*control).handleInstruction(0xc000172000, {0x18cd438?, 0xc000038c90?}, 0xc0000f0050)
<https://ci-beam.apache.org/job/beam_LoadTests_Go_GBK_Flink_Batch/ws/src/sdks/go/pkg/beam/core/runtime/harness/harness.go>:408 +0xa53
github.com/apache/beam/sdks/v2/go/pkg/beam/core/runtime/harness.MainWithOptions.func4({0x18cd438?, 0xc000038c90?}, 0x0?)
<https://ci-beam.apache.org/job/beam_LoadTests_Go_GBK_Flink_Batch/ws/src/sdks/go/pkg/beam/core/runtime/harness/harness.go>:195 +0x7a
created by github.com/apache/beam/sdks/v2/go/pkg/beam/core/runtime/harness.MainWithOptions
<https://ci-beam.apache.org/job/beam_LoadTests_Go_GBK_Flink_Batch/ws/src/sdks/go/pkg/beam/core/runtime/harness/harness.go>:213 +0xf1d
at java.util.concurrent.CompletableFuture.reportGet(CompletableFuture.java:395)
at java.util.concurrent.CompletableFuture.get(CompletableFuture.java:1999)
at org.apache.beam.sdk.util.MoreFutures.get(MoreFutures.java:61)
at org.apache.beam.runners.fnexecution.control.SdkHarnessClient$BundleProcessor$ActiveBundle.close(SdkHarnessClient.java:522)
at org.apache.beam.runners.fnexecution.control.DefaultJobBundleFactory$SimpleStageBundleFactory$1.close(DefaultJobBundleFactory.java:556)
at org.apache.beam.runners.flink.translation.functions.FlinkExecutableStageFunction.$closeResource(FlinkExecutableStageFunction.java:269)
at org.apache.beam.runners.flink.translation.functions.FlinkExecutableStageFunction.mapPartition(FlinkExecutableStageFunction.java:269)
at org.apache.flink.runtime.operators.MapPartitionDriver.run(MapPartitionDriver.java:113)
at org.apache.flink.runtime.operators.BatchTask.run(BatchTask.java:514)
at org.apache.flink.runtime.operators.BatchTask.invoke(BatchTask.java:357)
at org.apache.flink.runtime.taskmanager.Task.runWithSystemExitMonitoring(Task.java:948)
at org.apache.flink.runtime.taskmanager.Task.restoreAndInvoke(Task.java:927)
at org.apache.flink.runtime.taskmanager.Task.doRun(Task.java:741)
at org.apache.flink.runtime.taskmanager.Task.run(Task.java:563)
at java.lang.Thread.run(Thread.java:829)
Caused by: java.lang.RuntimeException: Error received from SDK harness for instruction 6: process bundle failed for instruction 6 using plan 1-7 : panic: datamgr.go [{6 fn/write/n4:0}]: error flushing buffer of length 4000000
caused by:
rpc error: code = Unknown desc =
Full error:
while executing Process for Plan[1-7]:
2: DataSink[S[fn/write/n4:0@localhost:35003]] Coder:W;fn/wire/n4:0<KV;c1<bytes;c0,bytes;c0>>!GWC
3: PCollection[n4] Out:[2]
4: ParDo[load.RuntimeMonitor] Out:[2] Sig: func([]uint8, []uint8, func([]uint8, []uint8))
5: PCollection[n3] Out:[4]
6: SDF.ProcessSizedElementsAndRestrictions[synthetic.sourceFn] UID:6 Out:[5]
1: DataSource[S[fn/read/n2/SplitAndSize0:0@localhost:35003], local_output] Out:6 Coder:W;fn/wire/n2/SplitAndSize0:0<KV;c5/SplitAndSize0<KV;c5/PairWithRestriction0<R;c5[synthetic.SourceConfig],KV;c9<offsetrange.Restriction[offsetrange.Restriction;c6];c7,bool;c8>>,double;DoubleCoder0>>!GWC
caused by:
panic: datamgr.go [{6 fn/write/n4:0}]: error flushing buffer of length 4000000
caused by:
rpc error: code = Unknown desc = goroutine 35 [running]:
runtime/debug.Stack()
/home/jenkins/sdk/go1.20.4/src/runtime/debug/stack.go:24 +0x65
github.com/apache/beam/sdks/v2/go/pkg/beam/core/runtime/exec.callNoPanic.func1()
<https://ci-beam.apache.org/job/beam_LoadTests_Go_GBK_Flink_Batch/ws/src/sdks/go/pkg/beam/core/runtime/exec/util.go>:58 +0xa5
panic({0x14a3060, 0xc00039c480})
/home/jenkins/sdk/go1.20.4/src/runtime/panic.go:884 +0x213
github.com/apache/beam/sdks/v2/go/pkg/beam/register.(*emit2[...]).invoke(0x18cec60, {0xc00096c498, 0x40a90d?, 0x1?}, {0xc00096c4a0?, 0x9, 0x9})
<https://ci-beam.apache.org/job/beam_LoadTests_Go_GBK_Flink_Batch/ws/src/sdks/go/pkg/beam/register/emitter.go>:81 +0x22f
github.com/apache/beam/sdks/v2/go/test/load.(*RuntimeMonitor).ProcessElement(0x13d7b00?, {0xc00096c498?, 0x1?, 0x1?}, {0xc00096c4a0?, 0x9?, 0x9?}, 0xc000203b18?)
<https://ci-beam.apache.org/job/beam_LoadTests_Go_GBK_Flink_Batch/ws/src/sdks/go/test/load/util.go>:87 +0x39
github.com/apache/beam/sdks/v2/go/pkg/beam/register.registerDoFn3x0StructWrappersAndFuncs[...].func2.1({0xc00096c4a0, 0x9, 0x9}, 0x46eb0a)
<https://ci-beam.apache.org/job/beam_LoadTests_Go_GBK_Flink_Batch/ws/src/sdks/go/pkg/beam/register/register.go>:2469 +0x9c
github.com/apache/beam/sdks/v2/go/pkg/beam/register.(*caller3x0[...]).Call3x0(0x46c383?, {0x12cfee0?, 0xc00096ea20?}, {0x12cfee0?, 0xc00096ea38?}, {0x1302160?, 0xc000203b18?})
<https://ci-beam.apache.org/job/beam_LoadTests_Go_GBK_Flink_Batch/ws/src/sdks/go/pkg/beam/register/register.go>:2458 +0x7f
github.com/apache/beam/sdks/v2/go/pkg/beam/core/runtime/exec.(*invoker).initCall.func4({0x0, 0x0, 0x0, 0x0, 0x0}, {0x23bbaf0?, 0x1?, 0x1?}, 0xffdf3b645a1cac09?)
<https://ci-beam.apache.org/job/beam_LoadTests_Go_GBK_Flink_Batch/ws/src/sdks/go/pkg/beam/core/runtime/exec/fn_arity.go>:55 +0x75
github.com/apache/beam/sdks/v2/go/pkg/beam/core/runtime/exec.(*invoker).invokeWithOpts(0xc0004d3cc0, {0x18cd550?, 0xc00039c440}, {0x0, 0x0, 0x0, 0x0, 0x0}, {0x23bbaf0, 0x1, ...}, ...)
<https://ci-beam.apache.org/job/beam_LoadTests_Go_GBK_Flink_Batch/ws/src/sdks/go/pkg/beam/core/runtime/exec/fn.go>:297 +0xfec
github.com/apache/beam/sdks/v2/go/pkg/beam/core/runtime/exec.(*ParDo).invokeProcessFn(0xc00036a240, {0x18cd550, 0xc00039c440}, {0x0, 0x0, 0x0, 0x0, 0x0}, {0x23bbaf0, 0x1, ...}, ...)
<https://ci-beam.apache.org/job/beam_LoadTests_Go_GBK_Flink_Batch/ws/src/sdks/go/pkg/beam/core/runtime/exec/pardo.go>:508 +0x2b5
github.com/apache/beam/sdks/v2/go/pkg/beam/core/runtime/exec.(*ParDo).processSingleWindow(0xc00036a240, 0xc000972630)
<https://ci-beam.apache.org/job/beam_LoadTests_Go_GBK_Flink_Batch/ws/src/sdks/go/pkg/beam/core/runtime/exec/pardo.go>:194 +0x9b
github.com/apache/beam/sdks/v2/go/pkg/beam/core/runtime/exec.(*ParDo).processMainInput(0x155?, 0x18cd550?)
<https://ci-beam.apache.org/job/beam_LoadTests_Go_GBK_Flink_Batch/ws/src/sdks/go/pkg/beam/core/runtime/exec/pardo.go>:172 +0x91
github.com/apache/beam/sdks/v2/go/pkg/beam/core/runtime/exec.(*ParDo).ProcessElement(0xc00036a240, {0x18?, 0xc000062400?}, 0xc0003a40e8, {0x0, 0x0, 0x0})
<https://ci-beam.apache.org/job/beam_LoadTests_Go_GBK_Flink_Batch/ws/src/sdks/go/pkg/beam/core/runtime/exec/pardo.go>:156 +0x125
github.com/apache/beam/sdks/v2/go/pkg/beam/core/runtime/exec.(*PCollection).ProcessElement(0xc00096c4a0?, {0x18cd550?, 0xc00039c400?}, 0x4214c7?, {0x0?, 0x200?, 0x40?})
<https://ci-beam.apache.org/job/beam_LoadTests_Go_GBK_Flink_Batch/ws/src/sdks/go/pkg/beam/core/runtime/exec/pcollection.go>:100 +0x151
github.com/apache/beam/sdks/v2/go/pkg/beam/register.(*emit2[...]).invoke(0x18cec60, {0xc00096c498, 0xc0003986e8?, 0x18bb7f8?}, {0xc00096c4a0?, 0x9, 0x9})
<https://ci-beam.apache.org/job/beam_LoadTests_Go_GBK_Flink_Batch/ws/src/sdks/go/pkg/beam/register/emitter.go>:80 +0x20f
github.com/apache/beam/sdks/v2/go/pkg/beam/io/synthetic.(*sourceFn).ProcessElement(0xc000360b60, 0x7f94dc7255b8?, {0xbebc200, 0x1, 0x1, 0x9, 0x0, 0x0}, 0xc0004dcc48)
<https://ci-beam.apache.org/job/beam_LoadTests_Go_GBK_Flink_Batch/ws/src/sdks/go/pkg/beam/io/synthetic/source.go>:151 +0x123
github.com/apache/beam/sdks/v2/go/pkg/beam/register.registerDoFn3x1StructWrappersAndFuncs[...].func2.1({0xbebc200?, 0x1, 0x1, 0x9, 0x0, 0x0}, 0x0)
<https://ci-beam.apache.org/job/beam_LoadTests_Go_GBK_Flink_Batch/ws/src/sdks/go/pkg/beam/register/register.go>:3382 +0xb0
github.com/apache/beam/sdks/v2/go/pkg/beam/register.(*caller3x1[...]).Call3x1(0x0?, {0x157e0a0?, 0xc0004dcbb8?}, {0x15d4a80?, 0xc00051ccf0?}, {0x1302160?, 0xc0004dcc48?})
<https://ci-beam.apache.org/job/beam_LoadTests_Go_GBK_Flink_Batch/ws/src/sdks/go/pkg/beam/register/register.go>:3371 +0xb6
github.com/apache/beam/sdks/v2/go/pkg/beam/core/runtime/exec.(*invoker).initCall.func13({0x0, 0x0, 0x0, 0x0, 0x0}, {0x23bbaf0, 0x1, 0x1}, 0x7f94dc725108?)
<https://ci-beam.apache.org/job/beam_LoadTests_Go_GBK_Flink_Batch/ws/src/sdks/go/pkg/beam/core/runtime/exec/fn_arity.go>:109 +0xad
github.com/apache/beam/sdks/v2/go/pkg/beam/core/runtime/exec.(*invoker).invokeWithOpts(0xc0004d3e00, {0x18cd550?, 0xc00039c400}, {0x0, 0x0, 0x0, 0x0, 0x0}, {0x23bbaf0, 0x1, ...}, ...)
<https://ci-beam.apache.org/job/beam_LoadTests_Go_GBK_Flink_Batch/ws/src/sdks/go/pkg/beam/core/runtime/exec/fn.go>:297 +0xfec
github.com/apache/beam/sdks/v2/go/pkg/beam/core/runtime/exec.(*ParDo).invokeProcessFn(0xc00036a480, {0x18cd550, 0xc00039c400}, {0x0, 0x0, 0x0, 0x0, 0x0}, {0x23bbaf0, 0x1, ...}, ...)
<https://ci-beam.apache.org/job/beam_LoadTests_Go_GBK_Flink_Batch/ws/src/sdks/go/pkg/beam/core/runtime/exec/pardo.go>:508 +0x2b5
github.com/apache/beam/sdks/v2/go/pkg/beam/core/runtime/exec.(*ParDo).processSingleWindow(0xc00036a480, 0xc0003dc5a0)
<https://ci-beam.apache.org/job/beam_LoadTests_Go_GBK_Flink_Batch/ws/src/sdks/go/pkg/beam/core/runtime/exec/pardo.go>:194 +0x9b
github.com/apache/beam/sdks/v2/go/pkg/beam/core/runtime/exec.(*ProcessSizedElementsAndRestrictions).ProcessElement(0xc000372fa0, {0x18cd550, 0xc0004ce580}, 0xc0005d7ea0, {0x0, 0x0, 0x0})
<https://ci-beam.apache.org/job/beam_LoadTests_Go_GBK_Flink_Batch/ws/src/sdks/go/pkg/beam/core/runtime/exec/sdf.go>:556 +0x63d
github.com/apache/beam/sdks/v2/go/pkg/beam/core/runtime/exec.(*DataSource).Process.func1(0xc000203b30, {0xc000399340?, 0xc000488900?})
<https://ci-beam.apache.org/job/beam_LoadTests_Go_GBK_Flink_Batch/ws/src/sdks/go/pkg/beam/core/runtime/exec/datasource.go>:241 +0x21e
github.com/apache/beam/sdks/v2/go/pkg/beam/core/runtime/exec.(*DataSource).process(0xc00035e420, {0x18cd550, 0xc0004ce580}, 0xc000399630, 0xc000399610)
<https://ci-beam.apache.org/job/beam_LoadTests_Go_GBK_Flink_Batch/ws/src/sdks/go/pkg/beam/core/runtime/exec/datasource.go>:147 +0x4f6
github.com/apache/beam/sdks/v2/go/pkg/beam/core/runtime/exec.(*DataSource).Process(0xc00035e420, {0x18cd550, 0xc0004ce580})
<https://ci-beam.apache.org/job/beam_LoadTests_Go_GBK_Flink_Batch/ws/src/sdks/go/pkg/beam/core/runtime/exec/datasource.go>:215 +0x226
github.com/apache/beam/sdks/v2/go/pkg/beam/core/runtime/exec.(*Plan).Execute.func2({0x18cd550?, 0xc0004ce580?})
<https://ci-beam.apache.org/job/beam_LoadTests_Go_GBK_Flink_Batch/ws/src/sdks/go/pkg/beam/core/runtime/exec/plan.go>:151 +0x42
github.com/apache/beam/sdks/v2/go/pkg/beam/core/runtime/exec.callNoPanic({0x18cd550?, 0xc0004ce580?}, 0x415d50?)
<https://ci-beam.apache.org/job/beam_LoadTests_Go_GBK_Flink_Batch/ws/src/sdks/go/pkg/beam/core/runtime/exec/util.go>:62 +0x6c
github.com/apache/beam/sdks/v2/go/pkg/beam/core/runtime/exec.(*Plan).Execute(0xc0003a2000, {0x18cd550, 0xc0004ce580}, {0x2362cb0, 0x1}, {{0x18bf410?, 0xc00039c340?}, {0x18f9998?, 0xc00036eb70?}})
<https://ci-beam.apache.org/job/beam_LoadTests_Go_GBK_Flink_Batch/ws/src/sdks/go/pkg/beam/core/runtime/exec/plan.go>:150 +0x3df
github.com/apache/beam/sdks/v2/go/pkg/beam/core/runtime/harness.(*control).handleInstruction(0xc000172000, {0x18cd438?, 0xc000038c90?}, 0xc0000f0050)
<https://ci-beam.apache.org/job/beam_LoadTests_Go_GBK_Flink_Batch/ws/src/sdks/go/pkg/beam/core/runtime/harness/harness.go>:408 +0xa53
github.com/apache/beam/sdks/v2/go/pkg/beam/core/runtime/harness.MainWithOptions.func4({0x18cd438?, 0xc000038c90?}, 0x0?)
<https://ci-beam.apache.org/job/beam_LoadTests_Go_GBK_Flink_Batch/ws/src/sdks/go/pkg/beam/core/runtime/harness/harness.go>:195 +0x7a
created by github.com/apache/beam/sdks/v2/go/pkg/beam/core/runtime/harness.MainWithOptions
<https://ci-beam.apache.org/job/beam_LoadTests_Go_GBK_Flink_Batch/ws/src/sdks/go/pkg/beam/core/runtime/harness/harness.go>:213 +0xf1d
at org.apache.beam.runners.fnexecution.control.FnApiControlClient$ResponseStreamObserver.onNext(FnApiControlClient.java:180)
at org.apache.beam.runners.fnexecution.control.FnApiControlClient$ResponseStreamObserver.onNext(FnApiControlClient.java:160)
at org.apache.beam.vendor.grpc.v1p54p0.io.grpc.stub.ServerCalls$StreamingServerCallHandler$StreamingServerCallListener.onMessage(ServerCalls.java:262)
at org.apache.beam.vendor.grpc.v1p54p0.io.grpc.ForwardingServerCallListener.onMessage(ForwardingServerCallListener.java:33)
at org.apache.beam.vendor.grpc.v1p54p0.io.grpc.Contexts$ContextualizedServerCallListener.onMessage(Contexts.java:76)
at org.apache.beam.vendor.grpc.v1p54p0.io.grpc.internal.ServerCallImpl$ServerStreamListenerImpl.messagesAvailableInternal(ServerCallImpl.java:333)
at org.apache.beam.vendor.grpc.v1p54p0.io.grpc.internal.ServerCallImpl$ServerStreamListenerImpl.messagesAvailable(ServerCallImpl.java:316)
at org.apache.beam.vendor.grpc.v1p54p0.io.grpc.internal.ServerImpl$JumpToApplicationThreadServerStreamListener$1MessagesAvailable.runInContext(ServerImpl.java:835)
at org.apache.beam.vendor.grpc.v1p54p0.io.grpc.internal.ContextRunnable.run(ContextRunnable.java:37)
at org.apache.beam.vendor.grpc.v1p54p0.io.grpc.internal.SerializingExecutor.run(SerializingExecutor.java:133)
at java.util.concurrent.ThreadPoolExecutor.runWorker(ThreadPoolExecutor.java:1128)
at java.util.concurrent.ThreadPoolExecutor$Worker.run(ThreadPoolExecutor.java:628)
... 1 more
2023/06/11 08:07:32 (): java.lang.RuntimeException: Error received from SDK harness for instruction 6: process bundle failed for instruction 6 using plan 1-7 : panic: datamgr.go [{6 fn/write/n4:0}]: error flushing buffer of length 4000000
caused by:
rpc error: code = Unknown desc =
Full error:
while executing Process for Plan[1-7]:
2: DataSink[S[fn/write/n4:0@localhost:35003]] Coder:W;fn/wire/n4:0<KV;c1<bytes;c0,bytes;c0>>!GWC
3: PCollection[n4] Out:[2]
4: ParDo[load.RuntimeMonitor] Out:[2] Sig: func([]uint8, []uint8, func([]uint8, []uint8))
5: PCollection[n3] Out:[4]
6: SDF.ProcessSizedElementsAndRestrictions[synthetic.sourceFn] UID:6 Out:[5]
1: DataSource[S[fn/read/n2/SplitAndSize0:0@localhost:35003], local_output] Out:6 Coder:W;fn/wire/n2/SplitAndSize0:0<KV;c5/SplitAndSize0<KV;c5/PairWithRestriction0<R;c5[synthetic.SourceConfig],KV;c9<offsetrange.Restriction[offsetrange.Restriction;c6];c7,bool;c8>>,double;DoubleCoder0>>!GWC
caused by:
panic: datamgr.go [{6 fn/write/n4:0}]: error flushing buffer of length 4000000
caused by:
rpc error: code = Unknown desc = goroutine 35 [running]:
runtime/debug.Stack()
/home/jenkins/sdk/go1.20.4/src/runtime/debug/stack.go:24 +0x65
github.com/apache/beam/sdks/v2/go/pkg/beam/core/runtime/exec.callNoPanic.func1()
<https://ci-beam.apache.org/job/beam_LoadTests_Go_GBK_Flink_Batch/ws/src/sdks/go/pkg/beam/core/runtime/exec/util.go>:58 +0xa5
panic({0x14a3060, 0xc00039c480})
/home/jenkins/sdk/go1.20.4/src/runtime/panic.go:884 +0x213
github.com/apache/beam/sdks/v2/go/pkg/beam/register.(*emit2[...]).invoke(0x18cec60, {0xc00096c498, 0x40a90d?, 0x1?}, {0xc00096c4a0?, 0x9, 0x9})
<https://ci-beam.apache.org/job/beam_LoadTests_Go_GBK_Flink_Batch/ws/src/sdks/go/pkg/beam/register/emitter.go>:81 +0x22f
github.com/apache/beam/sdks/v2/go/test/load.(*RuntimeMonitor).ProcessElement(0x13d7b00?, {0xc00096c498?, 0x1?, 0x1?}, {0xc00096c4a0?, 0x9?, 0x9?}, 0xc000203b18?)
<https://ci-beam.apache.org/job/beam_LoadTests_Go_GBK_Flink_Batch/ws/src/sdks/go/test/load/util.go>:87 +0x39
github.com/apache/beam/sdks/v2/go/pkg/beam/register.registerDoFn3x0StructWrappersAndFuncs[...].func2.1({0xc00096c4a0, 0x9, 0x9}, 0x46eb0a)
<https://ci-beam.apache.org/job/beam_LoadTests_Go_GBK_Flink_Batch/ws/src/sdks/go/pkg/beam/register/register.go>:2469 +0x9c
github.com/apache/beam/sdks/v2/go/pkg/beam/register.(*caller3x0[...]).Call3x0(0x46c383?, {0x12cfee0?, 0xc00096ea20?}, {0x12cfee0?, 0xc00096ea38?}, {0x1302160?, 0xc000203b18?})
<https://ci-beam.apache.org/job/beam_LoadTests_Go_GBK_Flink_Batch/ws/src/sdks/go/pkg/beam/register/register.go>:2458 +0x7f
github.com/apache/beam/sdks/v2/go/pkg/beam/core/runtime/exec.(*invoker).initCall.func4({0x0, 0x0, 0x0, 0x0, 0x0}, {0x23bbaf0?, 0x1?, 0x1?}, 0xffdf3b645a1cac09?)
<https://ci-beam.apache.org/job/beam_LoadTests_Go_GBK_Flink_Batch/ws/src/sdks/go/pkg/beam/core/runtime/exec/fn_arity.go>:55 +0x75
github.com/apache/beam/sdks/v2/go/pkg/beam/core/runtime/exec.(*invoker).invokeWithOpts(0xc0004d3cc0, {0x18cd550?, 0xc00039c440}, {0x0, 0x0, 0x0, 0x0, 0x0}, {0x23bbaf0, 0x1, ...}, ...)
<https://ci-beam.apache.org/job/beam_LoadTests_Go_GBK_Flink_Batch/ws/src/sdks/go/pkg/beam/core/runtime/exec/fn.go>:297 +0xfec
github.com/apache/beam/sdks/v2/go/pkg/beam/core/runtime/exec.(*ParDo).invokeProcessFn(0xc00036a240, {0x18cd550, 0xc00039c440}, {0x0, 0x0, 0x0, 0x0, 0x0}, {0x23bbaf0, 0x1, ...}, ...)
<https://ci-beam.apache.org/job/beam_LoadTests_Go_GBK_Flink_Batch/ws/src/sdks/go/pkg/beam/core/runtime/exec/pardo.go>:508 +0x2b5
github.com/apache/beam/sdks/v2/go/pkg/beam/core/runtime/exec.(*ParDo).processSingleWindow(0xc00036a240, 0xc000972630)
<https://ci-beam.apache.org/job/beam_LoadTests_Go_GBK_Flink_Batch/ws/src/sdks/go/pkg/beam/core/runtime/exec/pardo.go>:194 +0x9b
github.com/apache/beam/sdks/v2/go/pkg/beam/core/runtime/exec.(*ParDo).processMainInput(0x155?, 0x18cd550?)
<https://ci-beam.apache.org/job/beam_LoadTests_Go_GBK_Flink_Batch/ws/src/sdks/go/pkg/beam/core/runtime/exec/pardo.go>:172 +0x91
github.com/apache/beam/sdks/v2/go/pkg/beam/core/runtime/exec.(*ParDo).ProcessElement(0xc00036a240, {0x18?, 0xc000062400?}, 0xc0003a40e8, {0x0, 0x0, 0x0})
<https://ci-beam.apache.org/job/beam_LoadTests_Go_GBK_Flink_Batch/ws/src/sdks/go/pkg/beam/core/runtime/exec/pardo.go>:156 +0x125
github.com/apache/beam/sdks/v2/go/pkg/beam/core/runtime/exec.(*PCollection).ProcessElement(0xc00096c4a0?, {0x18cd550?, 0xc00039c400?}, 0x4214c7?, {0x0?, 0x200?, 0x40?})
<https://ci-beam.apache.org/job/beam_LoadTests_Go_GBK_Flink_Batch/ws/src/sdks/go/pkg/beam/core/runtime/exec/pcollection.go>:100 +0x151
github.com/apache/beam/sdks/v2/go/pkg/beam/register.(*emit2[...]).invoke(0x18cec60, {0xc00096c498, 0xc0003986e8?, 0x18bb7f8?}, {0xc00096c4a0?, 0x9, 0x9})
<https://ci-beam.apache.org/job/beam_LoadTests_Go_GBK_Flink_Batch/ws/src/sdks/go/pkg/beam/register/emitter.go>:80 +0x20f
github.com/apache/beam/sdks/v2/go/pkg/beam/io/synthetic.(*sourceFn).ProcessElement(0xc000360b60, 0x7f94dc7255b8?, {0xbebc200, 0x1, 0x1, 0x9, 0x0, 0x0}, 0xc0004dcc48)
<https://ci-beam.apache.org/job/beam_LoadTests_Go_GBK_Flink_Batch/ws/src/sdks/go/pkg/beam/io/synthetic/source.go>:151 +0x123
github.com/apache/beam/sdks/v2/go/pkg/beam/register.registerDoFn3x1StructWrappersAndFuncs[...].func2.1({0xbebc200?, 0x1, 0x1, 0x9, 0x0, 0x0}, 0x0)
<https://ci-beam.apache.org/job/beam_LoadTests_Go_GBK_Flink_Batch/ws/src/sdks/go/pkg/beam/register/register.go>:3382 +0xb0
github.com/apache/beam/sdks/v2/go/pkg/beam/register.(*caller3x1[...]).Call3x1(0x0?, {0x157e0a0?, 0xc0004dcbb8?}, {0x15d4a80?, 0xc00051ccf0?}, {0x1302160?, 0xc0004dcc48?})
<https://ci-beam.apache.org/job/beam_LoadTests_Go_GBK_Flink_Batch/ws/src/sdks/go/pkg/beam/register/register.go>:3371 +0xb6
github.com/apache/beam/sdks/v2/go/pkg/beam/core/runtime/exec.(*invoker).initCall.func13({0x0, 0x0, 0x0, 0x0, 0x0}, {0x23bbaf0, 0x1, 0x1}, 0x7f94dc725108?)
<https://ci-beam.apache.org/job/beam_LoadTests_Go_GBK_Flink_Batch/ws/src/sdks/go/pkg/beam/core/runtime/exec/fn_arity.go>:109 +0xad
github.com/apache/beam/sdks/v2/go/pkg/beam/core/runtime/exec.(*invoker).invokeWithOpts(0xc0004d3e00, {0x18cd550?, 0xc00039c400}, {0x0, 0x0, 0x0, 0x0, 0x0}, {0x23bbaf0, 0x1, ...}, ...)
<https://ci-beam.apache.org/job/beam_LoadTests_Go_GBK_Flink_Batch/ws/src/sdks/go/pkg/beam/core/runtime/exec/fn.go>:297 +0xfec
github.com/apache/beam/sdks/v2/go/pkg/beam/core/runtime/exec.(*ParDo).invokeProcessFn(0xc00036a480, {0x18cd550, 0xc00039c400}, {0x0, 0x0, 0x0, 0x0, 0x0}, {0x23bbaf0, 0x1, ...}, ...)
<https://ci-beam.apache.org/job/beam_LoadTests_Go_GBK_Flink_Batch/ws/src/sdks/go/pkg/beam/core/runtime/exec/pardo.go>:508 +0x2b5
github.com/apache/beam/sdks/v2/go/pkg/beam/core/runtime/exec.(*ParDo).processSingleWindow(0xc00036a480, 0xc0003dc5a0)
<https://ci-beam.apache.org/job/beam_LoadTests_Go_GBK_Flink_Batch/ws/src/sdks/go/pkg/beam/core/runtime/exec/pardo.go>:194 +0x9b
github.com/apache/beam/sdks/v2/go/pkg/beam/core/runtime/exec.(*ProcessSizedElementsAndRestrictions).ProcessElement(0xc000372fa0, {0x18cd550, 0xc0004ce580}, 0xc0005d7ea0, {0x0, 0x0, 0x0})
<https://ci-beam.apache.org/job/beam_LoadTests_Go_GBK_Flink_Batch/ws/src/sdks/go/pkg/beam/core/runtime/exec/sdf.go>:556 +0x63d
github.com/apache/beam/sdks/v2/go/pkg/beam/core/runtime/exec.(*DataSource).Process.func1(0xc000203b30, {0xc000399340?, 0xc000488900?})
<https://ci-beam.apache.org/job/beam_LoadTests_Go_GBK_Flink_Batch/ws/src/sdks/go/pkg/beam/core/runtime/exec/datasource.go>:241 +0x21e
github.com/apache/beam/sdks/v2/go/pkg/beam/core/runtime/exec.(*DataSource).process(0xc00035e420, {0x18cd550, 0xc0004ce580}, 0xc000399630, 0xc000399610)
<https://ci-beam.apache.org/job/beam_LoadTests_Go_GBK_Flink_Batch/ws/src/sdks/go/pkg/beam/core/runtime/exec/datasource.go>:147 +0x4f6
github.com/apache/beam/sdks/v2/go/pkg/beam/core/runtime/exec.(*DataSource).Process(0xc00035e420, {0x18cd550, 0xc0004ce580})
<https://ci-beam.apache.org/job/beam_LoadTests_Go_GBK_Flink_Batch/ws/src/sdks/go/pkg/beam/core/runtime/exec/datasource.go>:215 +0x226
github.com/apache/beam/sdks/v2/go/pkg/beam/core/runtime/exec.(*Plan).Execute.func2({0x18cd550?, 0xc0004ce580?})
<https://ci-beam.apache.org/job/beam_LoadTests_Go_GBK_Flink_Batch/ws/src/sdks/go/pkg/beam/core/runtime/exec/plan.go>:151 +0x42
github.com/apache/beam/sdks/v2/go/pkg/beam/core/runtime/exec.callNoPanic({0x18cd550?, 0xc0004ce580?}, 0x415d50?)
<https://ci-beam.apache.org/job/beam_LoadTests_Go_GBK_Flink_Batch/ws/src/sdks/go/pkg/beam/core/runtime/exec/util.go>:62 +0x6c
github.com/apache/beam/sdks/v2/go/pkg/beam/core/runtime/exec.(*Plan).Execute(0xc0003a2000, {0x18cd550, 0xc0004ce580}, {0x2362cb0, 0x1}, {{0x18bf410?, 0xc00039c340?}, {0x18f9998?, 0xc00036eb70?}})
<https://ci-beam.apache.org/job/beam_LoadTests_Go_GBK_Flink_Batch/ws/src/sdks/go/pkg/beam/core/runtime/exec/plan.go>:150 +0x3df
github.com/apache/beam/sdks/v2/go/pkg/beam/core/runtime/harness.(*control).handleInstruction(0xc000172000, {0x18cd438?, 0xc000038c90?}, 0xc0000f0050)
<https://ci-beam.apache.org/job/beam_LoadTests_Go_GBK_Flink_Batch/ws/src/sdks/go/pkg/beam/core/runtime/harness/harness.go>:408 +0xa53
github.com/apache/beam/sdks/v2/go/pkg/beam/core/runtime/harness.MainWithOptions.func4({0x18cd438?, 0xc000038c90?}, 0x0?)
<https://ci-beam.apache.org/job/beam_LoadTests_Go_GBK_Flink_Batch/ws/src/sdks/go/pkg/beam/core/runtime/harness/harness.go>:195 +0x7a
created by github.com/apache/beam/sdks/v2/go/pkg/beam/core/runtime/harness.MainWithOptions
<https://ci-beam.apache.org/job/beam_LoadTests_Go_GBK_Flink_Batch/ws/src/sdks/go/pkg/beam/core/runtime/harness/harness.go>:213 +0xf1d
2023/06/11 08:07:33 Job state: FAILED
2023/06/11 08:07:33 Failed to execute job: job load0tests0go0flink0batch0gbk0100611065407-root-0611080510-7dd1bbd1_02e23608-eb5d-4cb3-a278-6d5b201fae3e failed
panic: Failed to execute job: job load0tests0go0flink0batch0gbk0100611065407-root-0611080510-7dd1bbd1_02e23608-eb5d-4cb3-a278-6d5b201fae3e failed
goroutine 1 [running]:
github.com/apache/beam/sdks/v2/go/pkg/beam/log.Fatalf({0x18cd3c8, 0xc00004c0c0}, {0x1747d67?, 0x240e3b0?}, {0xc000371e70?, 0x0?, 0x0?})
<https://ci-beam.apache.org/job/beam_LoadTests_Go_GBK_Flink_Batch/ws/src/sdks/go/pkg/beam/log/log.go>:162 +0x8c
main.main()
<https://ci-beam.apache.org/job/beam_LoadTests_Go_GBK_Flink_Batch/ws/src/sdks/go/test/load/group_by_key/group_by_key.go>:98 +0x3eb
> Task :sdks:go:test:load:run FAILED
FAILURE: Build failed with an exception.
* Where:
Build file '<https://ci-beam.apache.org/job/beam_LoadTests_Go_GBK_Flink_Batch/ws/src/sdks/go/test/load/build.gradle'> line: 31
* What went wrong:
Execution failed for task ':sdks:go:test:load:run'.
> Process 'command 'sh'' finished with non-zero exit value 2
* Try:
> Run with --stacktrace option to get the stack trace.
> Run with --info or --debug option to get more log output.
* Get more help at https://help.gradle.org
BUILD FAILED in 2m 49s
12 actionable tasks: 6 executed, 4 from cache, 2 up-to-date
Publishing build scan...
https://ge.apache.org/s/t3uzg7qavj2uc
Build step 'Invoke Gradle script' changed build result to FAILURE
Build step 'Invoke Gradle script' marked build as failure
---------------------------------------------------------------------
To unsubscribe, e-mail: builds-unsubscribe@beam.apache.org
For additional commands, e-mail: builds-help@beam.apache.org