You are viewing a plain text version of this content. The canonical link for it is here.
Posted to dev@zookeeper.apache.org by Apache Jenkins Server <je...@builds.apache.org> on 2016/06/20 17:26:51 UTC

ZooKeeper_branch35_solaris - Build # 141 - Failure

See https://builds.apache.org/job/ZooKeeper_branch35_solaris/141/

###################################################################################
########################## LAST 60 LINES OF THE CONSOLE ###########################
[...truncated 355225 lines...]
    [junit] 2016-06-20 17:26:07,026 [myid:] - INFO  [main:JMXEnv@146] - ensureOnly:[]
    [junit] 2016-06-20 17:26:07,027 [myid:] - INFO  [main:ClientBase@460] - STARTING server
    [junit] 2016-06-20 17:26:07,027 [myid:] - INFO  [main:ClientBase@380] - CREATING server instance 127.0.0.1:11222
    [junit] 2016-06-20 17:26:07,027 [myid:] - INFO  [main:NIOServerCnxnFactory@673] - Configuring NIO connection handler with 10s sessionless connection timeout, 2 selector thread(s), 16 worker threads, and 64 kB direct buffers.
    [junit] 2016-06-20 17:26:07,028 [myid:] - INFO  [main:NIOServerCnxnFactory@686] - binding to port 0.0.0.0/0.0.0.0:11222
    [junit] 2016-06-20 17:26:07,029 [myid:] - INFO  [main:ClientBase@355] - STARTING server instance 127.0.0.1:11222
    [junit] 2016-06-20 17:26:07,029 [myid:] - INFO  [main:ZooKeeperServer@858] - minSessionTimeout set to 6000
    [junit] 2016-06-20 17:26:07,030 [myid:] - INFO  [main:ZooKeeperServer@867] - maxSessionTimeout set to 60000
    [junit] 2016-06-20 17:26:07,030 [myid:] - INFO  [main:ZooKeeperServer@156] - Created server with tickTime 3000 minSessionTimeout 6000 maxSessionTimeout 60000 datadir /zonestorage/hudson_solaris/home/hudson/hudson-slave/workspace/ZooKeeper_branch35_solaris/branch-3.5/build/test/tmp/test1306353863797702876.junit.dir/version-2 snapdir /zonestorage/hudson_solaris/home/hudson/hudson-slave/workspace/ZooKeeper_branch35_solaris/branch-3.5/build/test/tmp/test1306353863797702876.junit.dir/version-2
    [junit] 2016-06-20 17:26:07,031 [myid:] - INFO  [main:FileSnap@83] - Reading snapshot /zonestorage/hudson_solaris/home/hudson/hudson-slave/workspace/ZooKeeper_branch35_solaris/branch-3.5/build/test/tmp/test1306353863797702876.junit.dir/version-2/snapshot.b
    [junit] 2016-06-20 17:26:07,033 [myid:] - INFO  [main:FileTxnSnapLog@298] - Snapshotting: 0xb to /zonestorage/hudson_solaris/home/hudson/hudson-slave/workspace/ZooKeeper_branch35_solaris/branch-3.5/build/test/tmp/test1306353863797702876.junit.dir/version-2/snapshot.b
    [junit] 2016-06-20 17:26:07,035 [myid:] - INFO  [main:FourLetterWordMain@85] - connecting to 127.0.0.1 11222
    [junit] 2016-06-20 17:26:07,035 [myid:] - INFO  [NIOServerCxnFactory.AcceptThread:0.0.0.0/0.0.0.0:11222:NIOServerCnxnFactory$AcceptThread@296] - Accepted socket connection from /127.0.0.1:61161
    [junit] 2016-06-20 17:26:07,036 [myid:] - INFO  [NIOWorkerThread-1:NIOServerCnxn@485] - Processing stat command from /127.0.0.1:61161
    [junit] 2016-06-20 17:26:07,036 [myid:] - INFO  [NIOWorkerThread-1:StatCommand@49] - Stat command output
    [junit] 2016-06-20 17:26:07,036 [myid:] - INFO  [NIOWorkerThread-1:NIOServerCnxn@607] - Closed socket connection for client /127.0.0.1:61161 (no session established for client)
    [junit] 2016-06-20 17:26:07,037 [myid:] - INFO  [main:JMXEnv@228] - ensureParent:[InMemoryDataTree, StandaloneServer_port]
    [junit] 2016-06-20 17:26:07,038 [myid:] - INFO  [main:JMXEnv@245] - expect:InMemoryDataTree
    [junit] 2016-06-20 17:26:07,038 [myid:] - INFO  [main:JMXEnv@249] - found:InMemoryDataTree org.apache.ZooKeeperService:name0=StandaloneServer_port11222,name1=InMemoryDataTree
    [junit] 2016-06-20 17:26:07,038 [myid:] - INFO  [main:JMXEnv@245] - expect:StandaloneServer_port
    [junit] 2016-06-20 17:26:07,039 [myid:] - INFO  [main:JMXEnv@249] - found:StandaloneServer_port org.apache.ZooKeeperService:name0=StandaloneServer_port11222
    [junit] 2016-06-20 17:26:07,039 [myid:] - INFO  [main:JUnit4ZKTestRunner$LoggedInvokeMethod@82] - Memory used 17735
    [junit] 2016-06-20 17:26:07,039 [myid:] - INFO  [main:JUnit4ZKTestRunner$LoggedInvokeMethod@87] - Number of threads 24
    [junit] 2016-06-20 17:26:07,039 [myid:] - INFO  [main:JUnit4ZKTestRunner$LoggedInvokeMethod@102] - FINISHED TEST METHOD testQuota
    [junit] 2016-06-20 17:26:07,039 [myid:] - INFO  [main:ClientBase@537] - tearDown starting
    [junit] 2016-06-20 17:26:07,112 [myid:] - INFO  [main:ZooKeeper@1313] - Session: 0x121ebd5c4690000 closed
    [junit] 2016-06-20 17:26:07,112 [myid:] - INFO  [main-EventThread:ClientCnxn$EventThread@513] - EventThread shut down for session: 0x121ebd5c4690000
    [junit] 2016-06-20 17:26:07,112 [myid:] - INFO  [main:ClientBase@507] - STOPPING server
    [junit] 2016-06-20 17:26:07,113 [myid:] - INFO  [NIOServerCxnFactory.SelectorThread-0:NIOServerCnxnFactory$SelectorThread@420] - selector thread exitted run method
    [junit] 2016-06-20 17:26:07,113 [myid:] - INFO  [NIOServerCxnFactory.SelectorThread-1:NIOServerCnxnFactory$SelectorThread@420] - selector thread exitted run method
    [junit] 2016-06-20 17:26:07,113 [myid:] - INFO  [ConnnectionExpirer:NIOServerCnxnFactory$ConnectionExpirerThread@583] - ConnnectionExpirerThread interrupted
    [junit] 2016-06-20 17:26:07,113 [myid:] - INFO  [NIOServerCxnFactory.AcceptThread:0.0.0.0/0.0.0.0:11222:NIOServerCnxnFactory$AcceptThread@219] - accept thread exitted run method
    [junit] 2016-06-20 17:26:07,114 [myid:] - INFO  [main:ZooKeeperServer@498] - shutting down
    [junit] 2016-06-20 17:26:07,114 [myid:] - INFO  [main:SessionTrackerImpl@232] - Shutting down
    [junit] 2016-06-20 17:26:07,114 [myid:] - INFO  [main:PrepRequestProcessor@965] - Shutting down
    [junit] 2016-06-20 17:26:07,114 [myid:] - INFO  [main:SyncRequestProcessor@191] - Shutting down
    [junit] 2016-06-20 17:26:07,114 [myid:] - INFO  [ProcessThread(sid:0 cport:11222)::PrepRequestProcessor@154] - PrepRequestProcessor exited loop!
    [junit] 2016-06-20 17:26:07,115 [myid:] - INFO  [SyncThread:0:SyncRequestProcessor@169] - SyncRequestProcessor exited!
    [junit] 2016-06-20 17:26:07,115 [myid:] - INFO  [main:FinalRequestProcessor@479] - shutdown of request processor complete
    [junit] 2016-06-20 17:26:07,115 [myid:] - INFO  [main:MBeanRegistry@128] - Unregister MBean [org.apache.ZooKeeperService:name0=StandaloneServer_port11222,name1=InMemoryDataTree]
    [junit] 2016-06-20 17:26:07,116 [myid:] - INFO  [main:MBeanRegistry@128] - Unregister MBean [org.apache.ZooKeeperService:name0=StandaloneServer_port11222]
    [junit] 2016-06-20 17:26:07,116 [myid:] - INFO  [main:FourLetterWordMain@85] - connecting to 127.0.0.1 11222
    [junit] 2016-06-20 17:26:07,116 [myid:] - INFO  [main:JMXEnv@146] - ensureOnly:[]
    [junit] 2016-06-20 17:26:07,226 [myid:] - INFO  [main:ClientBase@562] - fdcount after test is: 52 at start it was 39
    [junit] 2016-06-20 17:26:07,226 [myid:] - INFO  [main:ClientBase@564] - sleeping for 20 secs
    [junit] 2016-06-20 17:26:07,228 [myid:] - INFO  [main:ZKTestCase$1@65] - SUCCEEDED testQuota
    [junit] 2016-06-20 17:26:07,228 [myid:] - INFO  [main:ZKTestCase$1@60] - FINISHED testQuota
    [junit] Tests run: 1, Failures: 0, Errors: 0, Time elapsed: 1.514 sec

BUILD FAILED
/zonestorage/hudson_solaris/home/hudson/hudson-slave/workspace/ZooKeeper_branch35_solaris/branch-3.5/build.xml:1233: Tests failed!

Total time: 74 minutes 17 seconds
Build step 'Invoke Ant' marked build as failure
[locks-and-latches] Releasing all the locks
[locks-and-latches] All the locks released
Recording test results
Email was triggered for: Failure - Any
Sending email for trigger: Failure - Any



###################################################################################
############################## FAILED TESTS (if any) ##############################
1 tests failed.
FAILED:  org.apache.zookeeper.test.ObserverQuorumHammerTest.testHammerBasic

Error Message:
Timeout occurred. Please note the time in the report does not reflect the time until the timeout.

Stack Trace:
junit.framework.AssertionFailedError: Timeout occurred. Please note the time in the report does not reflect the time until the timeout.



ZooKeeper_branch35_solaris - Build # 144 - Still Failing

Posted by Apache Jenkins Server <je...@builds.apache.org>.
See https://builds.apache.org/job/ZooKeeper_branch35_solaris/144/

###################################################################################
########################## LAST 60 LINES OF THE CONSOLE ###########################
[...truncated 348037 lines...]
    [junit] 2016-06-23 17:20:31,906 [myid:] - INFO  [main:JMXEnv@146] - ensureOnly:[]
    [junit] 2016-06-23 17:20:31,907 [myid:] - INFO  [main:ClientBase@460] - STARTING server
    [junit] 2016-06-23 17:20:31,907 [myid:] - INFO  [main:ClientBase@380] - CREATING server instance 127.0.0.1:11222
    [junit] 2016-06-23 17:20:31,908 [myid:] - INFO  [main:NIOServerCnxnFactory@673] - Configuring NIO connection handler with 10s sessionless connection timeout, 2 selector thread(s), 16 worker threads, and 64 kB direct buffers.
    [junit] 2016-06-23 17:20:31,909 [myid:] - INFO  [main:NIOServerCnxnFactory@686] - binding to port 0.0.0.0/0.0.0.0:11222
    [junit] 2016-06-23 17:20:31,909 [myid:] - INFO  [main:ClientBase@355] - STARTING server instance 127.0.0.1:11222
    [junit] 2016-06-23 17:20:31,910 [myid:] - INFO  [main:ZooKeeperServer@858] - minSessionTimeout set to 6000
    [junit] 2016-06-23 17:20:31,910 [myid:] - INFO  [main:ZooKeeperServer@867] - maxSessionTimeout set to 60000
    [junit] 2016-06-23 17:20:31,910 [myid:] - INFO  [main:ZooKeeperServer@156] - Created server with tickTime 3000 minSessionTimeout 6000 maxSessionTimeout 60000 datadir /zonestorage/hudson_solaris/home/hudson/hudson-slave/workspace/ZooKeeper_branch35_solaris/branch-3.5/build/test/tmp/test2188931779971945687.junit.dir/version-2 snapdir /zonestorage/hudson_solaris/home/hudson/hudson-slave/workspace/ZooKeeper_branch35_solaris/branch-3.5/build/test/tmp/test2188931779971945687.junit.dir/version-2
    [junit] 2016-06-23 17:20:31,911 [myid:] - INFO  [main:FileSnap@83] - Reading snapshot /zonestorage/hudson_solaris/home/hudson/hudson-slave/workspace/ZooKeeper_branch35_solaris/branch-3.5/build/test/tmp/test2188931779971945687.junit.dir/version-2/snapshot.b
    [junit] 2016-06-23 17:20:31,913 [myid:] - INFO  [main:FileTxnSnapLog@298] - Snapshotting: 0xb to /zonestorage/hudson_solaris/home/hudson/hudson-slave/workspace/ZooKeeper_branch35_solaris/branch-3.5/build/test/tmp/test2188931779971945687.junit.dir/version-2/snapshot.b
    [junit] 2016-06-23 17:20:31,914 [myid:] - INFO  [main:FourLetterWordMain@85] - connecting to 127.0.0.1 11222
    [junit] 2016-06-23 17:20:31,915 [myid:] - INFO  [NIOServerCxnFactory.AcceptThread:0.0.0.0/0.0.0.0:11222:NIOServerCnxnFactory$AcceptThread@296] - Accepted socket connection from /127.0.0.1:36598
    [junit] 2016-06-23 17:20:31,915 [myid:] - INFO  [NIOWorkerThread-1:NIOServerCnxn@485] - Processing stat command from /127.0.0.1:36598
    [junit] 2016-06-23 17:20:31,916 [myid:] - INFO  [NIOWorkerThread-1:StatCommand@49] - Stat command output
    [junit] 2016-06-23 17:20:31,916 [myid:] - INFO  [NIOWorkerThread-1:NIOServerCnxn@607] - Closed socket connection for client /127.0.0.1:36598 (no session established for client)
    [junit] 2016-06-23 17:20:31,916 [myid:] - INFO  [main:JMXEnv@228] - ensureParent:[InMemoryDataTree, StandaloneServer_port]
    [junit] 2016-06-23 17:20:31,918 [myid:] - INFO  [main:JMXEnv@245] - expect:InMemoryDataTree
    [junit] 2016-06-23 17:20:31,918 [myid:] - INFO  [main:JMXEnv@249] - found:InMemoryDataTree org.apache.ZooKeeperService:name0=StandaloneServer_port11222,name1=InMemoryDataTree
    [junit] 2016-06-23 17:20:31,918 [myid:] - INFO  [main:JMXEnv@245] - expect:StandaloneServer_port
    [junit] 2016-06-23 17:20:31,918 [myid:] - INFO  [main:JMXEnv@249] - found:StandaloneServer_port org.apache.ZooKeeperService:name0=StandaloneServer_port11222
    [junit] 2016-06-23 17:20:31,918 [myid:] - INFO  [main:JUnit4ZKTestRunner$LoggedInvokeMethod@82] - Memory used 17737
    [junit] 2016-06-23 17:20:31,919 [myid:] - INFO  [main:JUnit4ZKTestRunner$LoggedInvokeMethod@87] - Number of threads 24
    [junit] 2016-06-23 17:20:31,919 [myid:] - INFO  [main:JUnit4ZKTestRunner$LoggedInvokeMethod@102] - FINISHED TEST METHOD testQuota
    [junit] 2016-06-23 17:20:31,919 [myid:] - INFO  [main:ClientBase@537] - tearDown starting
    [junit] 2016-06-23 17:20:31,992 [myid:] - INFO  [main:ZooKeeper@1313] - Session: 0x121fb43a9db0000 closed
    [junit] 2016-06-23 17:20:31,992 [myid:] - INFO  [main-EventThread:ClientCnxn$EventThread@513] - EventThread shut down for session: 0x121fb43a9db0000
    [junit] 2016-06-23 17:20:31,992 [myid:] - INFO  [main:ClientBase@507] - STOPPING server
    [junit] 2016-06-23 17:20:31,993 [myid:] - INFO  [NIOServerCxnFactory.AcceptThread:0.0.0.0/0.0.0.0:11222:NIOServerCnxnFactory$AcceptThread@219] - accept thread exitted run method
    [junit] 2016-06-23 17:20:31,993 [myid:] - INFO  [NIOServerCxnFactory.SelectorThread-1:NIOServerCnxnFactory$SelectorThread@420] - selector thread exitted run method
    [junit] 2016-06-23 17:20:31,993 [myid:] - INFO  [NIOServerCxnFactory.SelectorThread-0:NIOServerCnxnFactory$SelectorThread@420] - selector thread exitted run method
    [junit] 2016-06-23 17:20:31,993 [myid:] - INFO  [ConnnectionExpirer:NIOServerCnxnFactory$ConnectionExpirerThread@583] - ConnnectionExpirerThread interrupted
    [junit] 2016-06-23 17:20:31,993 [myid:] - INFO  [main:ZooKeeperServer@498] - shutting down
    [junit] 2016-06-23 17:20:31,994 [myid:] - INFO  [main:SessionTrackerImpl@232] - Shutting down
    [junit] 2016-06-23 17:20:31,994 [myid:] - INFO  [main:PrepRequestProcessor@965] - Shutting down
    [junit] 2016-06-23 17:20:31,994 [myid:] - INFO  [main:SyncRequestProcessor@191] - Shutting down
    [junit] 2016-06-23 17:20:31,994 [myid:] - INFO  [ProcessThread(sid:0 cport:11222)::PrepRequestProcessor@154] - PrepRequestProcessor exited loop!
    [junit] 2016-06-23 17:20:31,994 [myid:] - INFO  [SyncThread:0:SyncRequestProcessor@169] - SyncRequestProcessor exited!
    [junit] 2016-06-23 17:20:31,994 [myid:] - INFO  [main:FinalRequestProcessor@479] - shutdown of request processor complete
    [junit] 2016-06-23 17:20:31,995 [myid:] - INFO  [main:MBeanRegistry@128] - Unregister MBean [org.apache.ZooKeeperService:name0=StandaloneServer_port11222,name1=InMemoryDataTree]
    [junit] 2016-06-23 17:20:31,995 [myid:] - INFO  [main:MBeanRegistry@128] - Unregister MBean [org.apache.ZooKeeperService:name0=StandaloneServer_port11222]
    [junit] 2016-06-23 17:20:31,995 [myid:] - INFO  [main:FourLetterWordMain@85] - connecting to 127.0.0.1 11222
    [junit] 2016-06-23 17:20:31,996 [myid:] - INFO  [main:JMXEnv@146] - ensureOnly:[]
    [junit] 2016-06-23 17:20:32,065 [myid:] - INFO  [main:ClientBase@562] - fdcount after test is: 56 at start it was 39
    [junit] 2016-06-23 17:20:32,065 [myid:] - INFO  [main:ClientBase@564] - sleeping for 20 secs
    [junit] 2016-06-23 17:20:32,067 [myid:] - INFO  [main:ZKTestCase$1@65] - SUCCEEDED testQuota
    [junit] 2016-06-23 17:20:32,067 [myid:] - INFO  [main:ZKTestCase$1@60] - FINISHED testQuota
    [junit] Tests run: 1, Failures: 0, Errors: 0, Time elapsed: 5.103 sec

BUILD FAILED
/zonestorage/hudson_solaris/home/hudson/hudson-slave/workspace/ZooKeeper_branch35_solaris/branch-3.5/build.xml:1233: Tests failed!

Total time: 68 minutes 56 seconds
Build step 'Invoke Ant' marked build as failure
[locks-and-latches] Releasing all the locks
[locks-and-latches] All the locks released
Recording test results
Email was triggered for: Failure - Any
Sending email for trigger: Failure - Any



###################################################################################
############################## FAILED TESTS (if any) ##############################
1 tests failed.
FAILED:  org.apache.zookeeper.test.AsyncHammerTest.testHammer

Error Message:
null

Stack Trace:
junit.framework.AssertionFailedError
	at org.apache.zookeeper.test.AsyncHammerTest.testHammer(AsyncHammerTest.java:186)
	at org.apache.zookeeper.JUnit4ZKTestRunner$LoggedInvokeMethod.evaluate(JUnit4ZKTestRunner.java:79)



ZooKeeper_branch35_solaris - Build # 143 - Still Failing

Posted by Apache Jenkins Server <je...@builds.apache.org>.
See https://builds.apache.org/job/ZooKeeper_branch35_solaris/143/

###################################################################################
########################## LAST 60 LINES OF THE CONSOLE ###########################
[...truncated 348892 lines...]
    [junit] 2016-06-22 17:19:37,320 [myid:] - INFO  [main:JMXEnv@146] - ensureOnly:[]
    [junit] 2016-06-22 17:19:37,321 [myid:] - INFO  [main:ClientBase@460] - STARTING server
    [junit] 2016-06-22 17:19:37,321 [myid:] - INFO  [main:ClientBase@380] - CREATING server instance 127.0.0.1:11222
    [junit] 2016-06-22 17:19:37,321 [myid:] - INFO  [main:NIOServerCnxnFactory@673] - Configuring NIO connection handler with 10s sessionless connection timeout, 2 selector thread(s), 16 worker threads, and 64 kB direct buffers.
    [junit] 2016-06-22 17:19:37,322 [myid:] - INFO  [main:NIOServerCnxnFactory@686] - binding to port 0.0.0.0/0.0.0.0:11222
    [junit] 2016-06-22 17:19:37,323 [myid:] - INFO  [main:ClientBase@355] - STARTING server instance 127.0.0.1:11222
    [junit] 2016-06-22 17:19:37,323 [myid:] - INFO  [main:ZooKeeperServer@858] - minSessionTimeout set to 6000
    [junit] 2016-06-22 17:19:37,323 [myid:] - INFO  [main:ZooKeeperServer@867] - maxSessionTimeout set to 60000
    [junit] 2016-06-22 17:19:37,323 [myid:] - INFO  [main:ZooKeeperServer@156] - Created server with tickTime 3000 minSessionTimeout 6000 maxSessionTimeout 60000 datadir /zonestorage/hudson_solaris/home/hudson/hudson-slave/workspace/ZooKeeper_branch35_solaris/branch-3.5/build/test/tmp/test6741542793110953205.junit.dir/version-2 snapdir /zonestorage/hudson_solaris/home/hudson/hudson-slave/workspace/ZooKeeper_branch35_solaris/branch-3.5/build/test/tmp/test6741542793110953205.junit.dir/version-2
    [junit] 2016-06-22 17:19:37,324 [myid:] - INFO  [main:FileSnap@83] - Reading snapshot /zonestorage/hudson_solaris/home/hudson/hudson-slave/workspace/ZooKeeper_branch35_solaris/branch-3.5/build/test/tmp/test6741542793110953205.junit.dir/version-2/snapshot.b
    [junit] 2016-06-22 17:19:37,326 [myid:] - INFO  [main:FileTxnSnapLog@298] - Snapshotting: 0xb to /zonestorage/hudson_solaris/home/hudson/hudson-slave/workspace/ZooKeeper_branch35_solaris/branch-3.5/build/test/tmp/test6741542793110953205.junit.dir/version-2/snapshot.b
    [junit] 2016-06-22 17:19:37,328 [myid:] - INFO  [main:FourLetterWordMain@85] - connecting to 127.0.0.1 11222
    [junit] 2016-06-22 17:19:37,328 [myid:] - INFO  [NIOServerCxnFactory.AcceptThread:0.0.0.0/0.0.0.0:11222:NIOServerCnxnFactory$AcceptThread@296] - Accepted socket connection from /127.0.0.1:36040
    [junit] 2016-06-22 17:19:37,329 [myid:] - INFO  [NIOWorkerThread-1:NIOServerCnxn@485] - Processing stat command from /127.0.0.1:36040
    [junit] 2016-06-22 17:19:37,329 [myid:] - INFO  [NIOWorkerThread-1:StatCommand@49] - Stat command output
    [junit] 2016-06-22 17:19:37,329 [myid:] - INFO  [NIOWorkerThread-1:NIOServerCnxn@607] - Closed socket connection for client /127.0.0.1:36040 (no session established for client)
    [junit] 2016-06-22 17:19:37,329 [myid:] - INFO  [main:JMXEnv@228] - ensureParent:[InMemoryDataTree, StandaloneServer_port]
    [junit] 2016-06-22 17:19:37,331 [myid:] - INFO  [main:JMXEnv@245] - expect:InMemoryDataTree
    [junit] 2016-06-22 17:19:37,331 [myid:] - INFO  [main:JMXEnv@249] - found:InMemoryDataTree org.apache.ZooKeeperService:name0=StandaloneServer_port11222,name1=InMemoryDataTree
    [junit] 2016-06-22 17:19:37,331 [myid:] - INFO  [main:JMXEnv@245] - expect:StandaloneServer_port
    [junit] 2016-06-22 17:19:37,331 [myid:] - INFO  [main:JMXEnv@249] - found:StandaloneServer_port org.apache.ZooKeeperService:name0=StandaloneServer_port11222
    [junit] 2016-06-22 17:19:37,332 [myid:] - INFO  [main:JUnit4ZKTestRunner$LoggedInvokeMethod@82] - Memory used 17737
    [junit] 2016-06-22 17:19:37,332 [myid:] - INFO  [main:JUnit4ZKTestRunner$LoggedInvokeMethod@87] - Number of threads 24
    [junit] 2016-06-22 17:19:37,332 [myid:] - INFO  [main:JUnit4ZKTestRunner$LoggedInvokeMethod@102] - FINISHED TEST METHOD testQuota
    [junit] 2016-06-22 17:19:37,332 [myid:] - INFO  [main:ClientBase@537] - tearDown starting
    [junit] 2016-06-22 17:19:37,412 [myid:] - INFO  [main:ZooKeeper@1313] - Session: 0x121f61c849f0000 closed
    [junit] 2016-06-22 17:19:37,412 [myid:] - INFO  [main-EventThread:ClientCnxn$EventThread@513] - EventThread shut down for session: 0x121f61c849f0000
    [junit] 2016-06-22 17:19:37,412 [myid:] - INFO  [main:ClientBase@507] - STOPPING server
    [junit] 2016-06-22 17:19:37,413 [myid:] - INFO  [ConnnectionExpirer:NIOServerCnxnFactory$ConnectionExpirerThread@583] - ConnnectionExpirerThread interrupted
    [junit] 2016-06-22 17:19:37,413 [myid:] - INFO  [NIOServerCxnFactory.SelectorThread-0:NIOServerCnxnFactory$SelectorThread@420] - selector thread exitted run method
    [junit] 2016-06-22 17:19:37,413 [myid:] - INFO  [NIOServerCxnFactory.SelectorThread-1:NIOServerCnxnFactory$SelectorThread@420] - selector thread exitted run method
    [junit] 2016-06-22 17:19:37,413 [myid:] - INFO  [NIOServerCxnFactory.AcceptThread:0.0.0.0/0.0.0.0:11222:NIOServerCnxnFactory$AcceptThread@219] - accept thread exitted run method
    [junit] 2016-06-22 17:19:37,414 [myid:] - INFO  [main:ZooKeeperServer@498] - shutting down
    [junit] 2016-06-22 17:19:37,414 [myid:] - INFO  [main:SessionTrackerImpl@232] - Shutting down
    [junit] 2016-06-22 17:19:37,414 [myid:] - INFO  [main:PrepRequestProcessor@965] - Shutting down
    [junit] 2016-06-22 17:19:37,414 [myid:] - INFO  [main:SyncRequestProcessor@191] - Shutting down
    [junit] 2016-06-22 17:19:37,414 [myid:] - INFO  [ProcessThread(sid:0 cport:11222)::PrepRequestProcessor@154] - PrepRequestProcessor exited loop!
    [junit] 2016-06-22 17:19:37,415 [myid:] - INFO  [SyncThread:0:SyncRequestProcessor@169] - SyncRequestProcessor exited!
    [junit] 2016-06-22 17:19:37,415 [myid:] - INFO  [main:FinalRequestProcessor@479] - shutdown of request processor complete
    [junit] 2016-06-22 17:19:37,415 [myid:] - INFO  [main:MBeanRegistry@128] - Unregister MBean [org.apache.ZooKeeperService:name0=StandaloneServer_port11222,name1=InMemoryDataTree]
    [junit] 2016-06-22 17:19:37,415 [myid:] - INFO  [main:MBeanRegistry@128] - Unregister MBean [org.apache.ZooKeeperService:name0=StandaloneServer_port11222]
    [junit] 2016-06-22 17:19:37,416 [myid:] - INFO  [main:FourLetterWordMain@85] - connecting to 127.0.0.1 11222
    [junit] 2016-06-22 17:19:37,416 [myid:] - INFO  [main:JMXEnv@146] - ensureOnly:[]
    [junit] 2016-06-22 17:19:37,421 [myid:] - INFO  [main:ClientBase@562] - fdcount after test is: 56 at start it was 39
    [junit] 2016-06-22 17:19:37,421 [myid:] - INFO  [main:ClientBase@564] - sleeping for 20 secs
    [junit] 2016-06-22 17:19:37,422 [myid:] - INFO  [main:ZKTestCase$1@65] - SUCCEEDED testQuota
    [junit] 2016-06-22 17:19:37,422 [myid:] - INFO  [main:ZKTestCase$1@60] - FINISHED testQuota
    [junit] Tests run: 1, Failures: 0, Errors: 0, Time elapsed: 0.815 sec

BUILD FAILED
/zonestorage/hudson_solaris/home/hudson/hudson-slave/workspace/ZooKeeper_branch35_solaris/branch-3.5/build.xml:1233: Tests failed!

Total time: 67 minutes 15 seconds
Build step 'Invoke Ant' marked build as failure
[locks-and-latches] Releasing all the locks
[locks-and-latches] All the locks released
Recording test results
Email was triggered for: Failure - Any
Sending email for trigger: Failure - Any



###################################################################################
############################## FAILED TESTS (if any) ##############################
2 tests failed.
FAILED:  org.apache.zookeeper.test.SSLTest.testSecureQuorumServer

Error Message:
waiting for server 0 being up

Stack Trace:
junit.framework.AssertionFailedError: waiting for server 0 being up
	at org.apache.zookeeper.test.SSLTest.testSecureQuorumServer(SSLTest.java:100)
	at org.apache.zookeeper.JUnit4ZKTestRunner$LoggedInvokeMethod.evaluate(JUnit4ZKTestRunner.java:79)


FAILED:  org.apache.zookeeper.test.SSLTest.testSecureStandaloneServer

Error Message:
Timeout connecting to ZK server secure port

Stack Trace:
junit.framework.AssertionFailedError: Timeout connecting to ZK server secure port
	at org.apache.zookeeper.test.SSLTest.testSecureStandaloneServer(SSLTest.java:153)
	at org.apache.zookeeper.JUnit4ZKTestRunner$LoggedInvokeMethod.evaluate(JUnit4ZKTestRunner.java:79)



ZooKeeper_branch35_solaris - Build # 142 - Still Failing

Posted by Apache Jenkins Server <je...@builds.apache.org>.
See https://builds.apache.org/job/ZooKeeper_branch35_solaris/142/

###################################################################################
########################## LAST 60 LINES OF THE CONSOLE ###########################
[...truncated 345873 lines...]
    [junit] 2016-06-21 17:27:23,718 [myid:] - INFO  [main:JMXEnv@146] - ensureOnly:[]
    [junit] 2016-06-21 17:27:23,719 [myid:] - INFO  [main:ClientBase@460] - STARTING server
    [junit] 2016-06-21 17:27:23,720 [myid:] - INFO  [main:ClientBase@380] - CREATING server instance 127.0.0.1:11222
    [junit] 2016-06-21 17:27:23,720 [myid:] - INFO  [main:NIOServerCnxnFactory@673] - Configuring NIO connection handler with 10s sessionless connection timeout, 2 selector thread(s), 16 worker threads, and 64 kB direct buffers.
    [junit] 2016-06-21 17:27:23,721 [myid:] - INFO  [main:NIOServerCnxnFactory@686] - binding to port 0.0.0.0/0.0.0.0:11222
    [junit] 2016-06-21 17:27:23,722 [myid:] - INFO  [main:ClientBase@355] - STARTING server instance 127.0.0.1:11222
    [junit] 2016-06-21 17:27:23,722 [myid:] - INFO  [main:ZooKeeperServer@858] - minSessionTimeout set to 6000
    [junit] 2016-06-21 17:27:23,722 [myid:] - INFO  [main:ZooKeeperServer@867] - maxSessionTimeout set to 60000
    [junit] 2016-06-21 17:27:23,722 [myid:] - INFO  [main:ZooKeeperServer@156] - Created server with tickTime 3000 minSessionTimeout 6000 maxSessionTimeout 60000 datadir /zonestorage/hudson_solaris/home/hudson/hudson-slave/workspace/ZooKeeper_branch35_solaris/branch-3.5/build/test/tmp/test6715426245296041654.junit.dir/version-2 snapdir /zonestorage/hudson_solaris/home/hudson/hudson-slave/workspace/ZooKeeper_branch35_solaris/branch-3.5/build/test/tmp/test6715426245296041654.junit.dir/version-2
    [junit] 2016-06-21 17:27:23,723 [myid:] - INFO  [main:FileSnap@83] - Reading snapshot /zonestorage/hudson_solaris/home/hudson/hudson-slave/workspace/ZooKeeper_branch35_solaris/branch-3.5/build/test/tmp/test6715426245296041654.junit.dir/version-2/snapshot.b
    [junit] 2016-06-21 17:27:23,726 [myid:] - INFO  [main:FileTxnSnapLog@298] - Snapshotting: 0xb to /zonestorage/hudson_solaris/home/hudson/hudson-slave/workspace/ZooKeeper_branch35_solaris/branch-3.5/build/test/tmp/test6715426245296041654.junit.dir/version-2/snapshot.b
    [junit] 2016-06-21 17:27:23,727 [myid:] - INFO  [main:FourLetterWordMain@85] - connecting to 127.0.0.1 11222
    [junit] 2016-06-21 17:27:23,728 [myid:] - INFO  [NIOServerCxnFactory.AcceptThread:0.0.0.0/0.0.0.0:11222:NIOServerCnxnFactory$AcceptThread@296] - Accepted socket connection from /127.0.0.1:63536
    [junit] 2016-06-21 17:27:23,729 [myid:] - INFO  [NIOWorkerThread-1:NIOServerCnxn@485] - Processing stat command from /127.0.0.1:63536
    [junit] 2016-06-21 17:27:23,729 [myid:] - INFO  [NIOWorkerThread-1:StatCommand@49] - Stat command output
    [junit] 2016-06-21 17:27:23,730 [myid:] - INFO  [NIOWorkerThread-1:NIOServerCnxn@607] - Closed socket connection for client /127.0.0.1:63536 (no session established for client)
    [junit] 2016-06-21 17:27:23,730 [myid:] - INFO  [main:JMXEnv@228] - ensureParent:[InMemoryDataTree, StandaloneServer_port]
    [junit] 2016-06-21 17:27:23,732 [myid:] - INFO  [main:JMXEnv@245] - expect:InMemoryDataTree
    [junit] 2016-06-21 17:27:23,732 [myid:] - INFO  [main:JMXEnv@249] - found:InMemoryDataTree org.apache.ZooKeeperService:name0=StandaloneServer_port11222,name1=InMemoryDataTree
    [junit] 2016-06-21 17:27:23,732 [myid:] - INFO  [main:JMXEnv@245] - expect:StandaloneServer_port
    [junit] 2016-06-21 17:27:23,732 [myid:] - INFO  [main:JMXEnv@249] - found:StandaloneServer_port org.apache.ZooKeeperService:name0=StandaloneServer_port11222
    [junit] 2016-06-21 17:27:23,733 [myid:] - INFO  [main:JUnit4ZKTestRunner$LoggedInvokeMethod@82] - Memory used 17734
    [junit] 2016-06-21 17:27:23,733 [myid:] - INFO  [main:JUnit4ZKTestRunner$LoggedInvokeMethod@87] - Number of threads 24
    [junit] 2016-06-21 17:27:23,733 [myid:] - INFO  [main:JUnit4ZKTestRunner$LoggedInvokeMethod@102] - FINISHED TEST METHOD testQuota
    [junit] 2016-06-21 17:27:23,733 [myid:] - INFO  [main:ClientBase@537] - tearDown starting
    [junit] 2016-06-21 17:27:24,401 [myid:] - INFO  [main:ZooKeeper@1313] - Session: 0x121f0fd454e0000 closed
    [junit] 2016-06-21 17:27:24,401 [myid:] - INFO  [main-EventThread:ClientCnxn$EventThread@513] - EventThread shut down for session: 0x121f0fd454e0000
    [junit] 2016-06-21 17:27:24,401 [myid:] - INFO  [main:ClientBase@507] - STOPPING server
    [junit] 2016-06-21 17:27:24,402 [myid:] - INFO  [ConnnectionExpirer:NIOServerCnxnFactory$ConnectionExpirerThread@583] - ConnnectionExpirerThread interrupted
    [junit] 2016-06-21 17:27:24,402 [myid:] - INFO  [NIOServerCxnFactory.SelectorThread-1:NIOServerCnxnFactory$SelectorThread@420] - selector thread exitted run method
    [junit] 2016-06-21 17:27:24,402 [myid:] - INFO  [NIOServerCxnFactory.AcceptThread:0.0.0.0/0.0.0.0:11222:NIOServerCnxnFactory$AcceptThread@219] - accept thread exitted run method
    [junit] 2016-06-21 17:27:24,402 [myid:] - INFO  [NIOServerCxnFactory.SelectorThread-0:NIOServerCnxnFactory$SelectorThread@420] - selector thread exitted run method
    [junit] 2016-06-21 17:27:24,403 [myid:] - INFO  [main:ZooKeeperServer@498] - shutting down
    [junit] 2016-06-21 17:27:24,403 [myid:] - INFO  [main:SessionTrackerImpl@232] - Shutting down
    [junit] 2016-06-21 17:27:24,403 [myid:] - INFO  [main:PrepRequestProcessor@965] - Shutting down
    [junit] 2016-06-21 17:27:24,404 [myid:] - INFO  [main:SyncRequestProcessor@191] - Shutting down
    [junit] 2016-06-21 17:27:24,404 [myid:] - INFO  [ProcessThread(sid:0 cport:11222)::PrepRequestProcessor@154] - PrepRequestProcessor exited loop!
    [junit] 2016-06-21 17:27:24,404 [myid:] - INFO  [SyncThread:0:SyncRequestProcessor@169] - SyncRequestProcessor exited!
    [junit] 2016-06-21 17:27:24,404 [myid:] - INFO  [main:FinalRequestProcessor@479] - shutdown of request processor complete
    [junit] 2016-06-21 17:27:24,404 [myid:] - INFO  [main:MBeanRegistry@128] - Unregister MBean [org.apache.ZooKeeperService:name0=StandaloneServer_port11222,name1=InMemoryDataTree]
    [junit] 2016-06-21 17:27:24,405 [myid:] - INFO  [main:MBeanRegistry@128] - Unregister MBean [org.apache.ZooKeeperService:name0=StandaloneServer_port11222]
    [junit] 2016-06-21 17:27:24,405 [myid:] - INFO  [main:FourLetterWordMain@85] - connecting to 127.0.0.1 11222
    [junit] 2016-06-21 17:27:24,405 [myid:] - INFO  [main:JMXEnv@146] - ensureOnly:[]
    [junit] 2016-06-21 17:27:24,423 [myid:] - INFO  [main:ClientBase@562] - fdcount after test is: 56 at start it was 39
    [junit] 2016-06-21 17:27:24,423 [myid:] - INFO  [main:ClientBase@564] - sleeping for 20 secs
    [junit] 2016-06-21 17:27:24,425 [myid:] - INFO  [main:ZKTestCase$1@65] - SUCCEEDED testQuota
    [junit] 2016-06-21 17:27:24,425 [myid:] - INFO  [main:ZKTestCase$1@60] - FINISHED testQuota
    [junit] Tests run: 1, Failures: 0, Errors: 0, Time elapsed: 1.774 sec

BUILD FAILED
/zonestorage/hudson_solaris/home/hudson/hudson-slave/workspace/ZooKeeper_branch35_solaris/branch-3.5/build.xml:1233: Tests failed!

Total time: 74 minutes 19 seconds
Build step 'Invoke Ant' marked build as failure
[locks-and-latches] Releasing all the locks
[locks-and-latches] All the locks released
Recording test results
Email was triggered for: Failure - Any
Sending email for trigger: Failure - Any



###################################################################################
############################## FAILED TESTS (if any) ##############################
1 tests failed.
FAILED:  org.apache.zookeeper.server.admin.JettyAdminServerTest.testQuorum

Error Message:
Timeout occurred. Please note the time in the report does not reflect the time until the timeout.

Stack Trace:
junit.framework.AssertionFailedError: Timeout occurred. Please note the time in the report does not reflect the time until the timeout.