You are viewing a plain text version of this content. The canonical link for it is here.
Posted to builds@hbase.apache.org by Apache Jenkins Server <je...@builds.apache.org> on 2017/07/26 00:36:23 UTC

Build failed in Jenkins: HBase-1.2-IT » IntegrationTestAcidGuarantees,JDK 1.8 (latest),Hadoop #905

See <https://builds.apache.org/job/HBase-1.2-IT/it.test=IntegrationTestAcidGuarantees,jdk=JDK%201.8%20(latest),label=Hadoop/905/display/redirect?page=changes>

Changes:

[appy] HBASE-18247 Hbck to fix the case that replica region shows as key in the

------------------------------------------
[...truncated 799.06 KB...]
test_row_2/A:col42/1501029233371/Put/vlen=10/seqid=0 val= \xFBf5 \x02iG\xB7\xD9\xA3
test_row_2/A:col43/1501029233371/Put/vlen=10/seqid=0 val= \xFBf5 \x02iG\xB7\xD9\xA3
test_row_2/A:col44/1501029233371/Put/vlen=10/seqid=0 val= \xFBf5 \x02iG\xB7\xD9\xA3
test_row_2/A:col45/1501029233371/Put/vlen=10/seqid=0 val= \xFBf5 \x02iG\xB7\xD9\xA3
test_row_2/A:col46/1501029233371/Put/vlen=10/seqid=0 val= \xFBf5 \x02iG\xB7\xD9\xA3
test_row_2/A:col47/1501029233371/Put/vlen=10/seqid=0 val= \xFBf5 \x02iG\xB7\xD9\xA3
test_row_2/A:col48/1501029233371/Put/vlen=10/seqid=0 val= \xFBf5 \x02iG\xB7\xD9\xA3
test_row_2/A:col49/1501029233371/Put/vlen=10/seqid=0 val= \xFBf5 \x02iG\xB7\xD9\xA3
test_row_2/A:col5/1501029233371/Put/vlen=10/seqid=0 val= \xFBf5 \x02iG\xB7\xD9\xA3
test_row_2/A:col6/1501029233371/Put/vlen=10/seqid=0 val= \xFBf5 \x02iG\xB7\xD9\xA3
test_row_2/A:col7/1501029233371/Put/vlen=10/seqid=0 val= \xFBf5 \x02iG\xB7\xD9\xA3
test_row_2/A:col8/1501029233371/Put/vlen=10/seqid=0 val= \xFBf5 \x02iG\xB7\xD9\xA3
test_row_2/A:col9/1501029233371/Put/vlen=10/seqid=0 val= \xFBf5 \x02iG\xB7\xD9\xA3
test_row_2/B:col0/1501029233371/Put/vlen=10/seqid=0 val= \xFBf5 \x02iG\xB7\xD9\xA3
test_row_2/B:col1/1501029233371/Put/vlen=10/seqid=0 val= \xFBf5 \x02iG\xB7\xD9\xA3
test_row_2/B:col10/1501029233371/Put/vlen=10/seqid=0 val= \xFBf5 \x02iG\xB7\xD9\xA3
test_row_2/B:col11/1501029233371/Put/vlen=10/seqid=0 val= \xFBf5 \x02iG\xB7\xD9\xA3
test_row_2/B:col12/1501029233371/Put/vlen=10/seqid=0 val= \xFBf5 \x02iG\xB7\xD9\xA3
test_row_2/B:col13/1501029233371/Put/vlen=10/seqid=0 val= \xFBf5 \x02iG\xB7\xD9\xA3
test_row_2/B:col14/1501029233371/Put/vlen=10/seqid=0 val= \xFBf5 \x02iG\xB7\xD9\xA3
test_row_2/B:col15/1501029233371/Put/vlen=10/seqid=0 val= \xFBf5 \x02iG\xB7\xD9\xA3
test_row_2/B:col16/1501029233371/Put/vlen=10/seqid=0 val= \xFBf5 \x02iG\xB7\xD9\xA3
test_row_2/B:col17/1501029233371/Put/vlen=10/seqid=0 val= \xFBf5 \x02iG\xB7\xD9\xA3
test_row_2/B:col18/1501029233371/Put/vlen=10/seqid=0 val= \xFBf5 \x02iG\xB7\xD9\xA3
test_row_2/B:col19/1501029233371/Put/vlen=10/seqid=0 val= \xFBf5 \x02iG\xB7\xD9\xA3
test_row_2/B:col2/1501029233371/Put/vlen=10/seqid=0 val= \xFBf5 \x02iG\xB7\xD9\xA3
test_row_2/B:col20/1501029233371/Put/vlen=10/seqid=0 val= \xFBf5 \x02iG\xB7\xD9\xA3
test_row_2/B:col21/1501029233371/Put/vlen=10/seqid=0 val= \xFBf5 \x02iG\xB7\xD9\xA3
test_row_2/B:col22/1501029233371/Put/vlen=10/seqid=0 val= \xFBf5 \x02iG\xB7\xD9\xA3
test_row_2/B:col23/1501029233371/Put/vlen=10/seqid=0 val= \xFBf5 \x02iG\xB7\xD9\xA3
test_row_2/B:col24/1501029233371/Put/vlen=10/seqid=0 val= \xFBf5 \x02iG\xB7\xD9\xA3
test_row_2/B:col25/1501029233371/Put/vlen=10/seqid=0 val= \xFBf5 \x02iG\xB7\xD9\xA3
test_row_2/B:col26/1501029233371/Put/vlen=10/seqid=0 val= \xFBf5 \x02iG\xB7\xD9\xA3
test_row_2/B:col27/1501029233371/Put/vlen=10/seqid=0 val= \xFBf5 \x02iG\xB7\xD9\xA3
test_row_2/B:col28/1501029233371/Put/vlen=10/seqid=0 val= \xFBf5 \x02iG\xB7\xD9\xA3
test_row_2/B:col29/1501029233371/Put/vlen=10/seqid=0 val= \xFBf5 \x02iG\xB7\xD9\xA3
test_row_2/B:col3/1501029233371/Put/vlen=10/seqid=0 val= \xFBf5 \x02iG\xB7\xD9\xA3
test_row_2/B:col30/1501029233371/Put/vlen=10/seqid=0 val= \xFBf5 \x02iG\xB7\xD9\xA3
test_row_2/B:col31/1501029233371/Put/vlen=10/seqid=0 val= \xFBf5 \x02iG\xB7\xD9\xA3
test_row_2/B:col32/1501029233371/Put/vlen=10/seqid=0 val= \xFBf5 \x02iG\xB7\xD9\xA3
test_row_2/B:col33/1501029233371/Put/vlen=10/seqid=0 val= \xFBf5 \x02iG\xB7\xD9\xA3
test_row_2/B:col34/1501029233371/Put/vlen=10/seqid=0 val= \xFBf5 \x02iG\xB7\xD9\xA3
test_row_2/B:col35/1501029233371/Put/vlen=10/seqid=0 val= \xFBf5 \x02iG\xB7\xD9\xA3
test_row_2/B:col36/1501029233371/Put/vlen=10/seqid=0 val= \xFBf5 \x02iG\xB7\xD9\xA3
test_row_2/B:col37/1501029233371/Put/vlen=10/seqid=0 val= \xFBf5 \x02iG\xB7\xD9\xA3
test_row_2/B:col38/1501029233371/Put/vlen=10/seqid=0 val= \xFBf5 \x02iG\xB7\xD9\xA3
test_row_2/B:col39/1501029233371/Put/vlen=10/seqid=0 val= \xFBf5 \x02iG\xB7\xD9\xA3
test_row_2/B:col4/1501029233371/Put/vlen=10/seqid=0 val= \xFBf5 \x02iG\xB7\xD9\xA3
test_row_2/B:col40/1501029233371/Put/vlen=10/seqid=0 val= \xFBf5 \x02iG\xB7\xD9\xA3
test_row_2/B:col41/1501029233371/Put/vlen=10/seqid=0 val= \xFBf5 \x02iG\xB7\xD9\xA3
test_row_2/B:col42/1501029233371/Put/vlen=10/seqid=0 val= \xFBf5 \x02iG\xB7\xD9\xA3
test_row_2/B:col43/1501029233371/Put/vlen=10/seqid=0 val= \xFBf5 \x02iG\xB7\xD9\xA3
test_row_2/B:col44/1501029233371/Put/vlen=10/seqid=0 val= \xFBf5 \x02iG\xB7\xD9\xA3
test_row_2/B:col45/1501029233371/Put/vlen=10/seqid=0 val= \xFBf5 \x02iG\xB7\xD9\xA3
test_row_2/B:col46/1501029233371/Put/vlen=10/seqid=0 val= \xFBf5 \x02iG\xB7\xD9\xA3
test_row_2/B:col47/1501029233371/Put/vlen=10/seqid=0 val= \xFBf5 \x02iG\xB7\xD9\xA3
test_row_2/B:col48/1501029233371/Put/vlen=10/seqid=0 val= \xFBf5 \x02iG\xB7\xD9\xA3
test_row_2/B:col49/1501029233371/Put/vlen=10/seqid=0 val= \xFBf5 \x02iG\xB7\xD9\xA3
test_row_2/B:col5/1501029233371/Put/vlen=10/seqid=0 val= \xFBf5 \x02iG\xB7\xD9\xA3
test_row_2/B:col6/1501029233371/Put/vlen=10/seqid=0 val= \xFBf5 \x02iG\xB7\xD9\xA3
test_row_2/B:col7/1501029233371/Put/vlen=10/seqid=0 val= \xFBf5 \x02iG\xB7\xD9\xA3
test_row_2/B:col8/1501029233371/Put/vlen=10/seqid=0 val= \xFBf5 \x02iG\xB7\xD9\xA3
test_row_2/B:col9/1501029233371/Put/vlen=10/seqid=0 val= \xFBf5 \x02iG\xB7\xD9\xA3
test_row_2/C:col0/1501029233371/Put/vlen=10/seqid=0 val= \xFA\xC9'H\xAAi\x13\x81[\xC2
test_row_2/C:col1/1501029233371/Put/vlen=10/seqid=0 val= \xFBf5 \x02iG\xB7\xD9\xA3
test_row_2/C:col10/1501029233371/Put/vlen=10/seqid=0 val= \xFBf5 \x02iG\xB7\xD9\xA3
test_row_2/C:col11/1501029233371/Put/vlen=10/seqid=0 val= \xFBf5 \x02iG\xB7\xD9\xA3
test_row_2/C:col12/1501029233371/Put/vlen=10/seqid=0 val= \xFBf5 \x02iG\xB7\xD9\xA3
test_row_2/C:col13/1501029233371/Put/vlen=10/seqid=0 val= \xFBf5 \x02iG\xB7\xD9\xA3
test_row_2/C:col14/1501029233371/Put/vlen=10/seqid=0 val= \xFBf5 \x02iG\xB7\xD9\xA3
test_row_2/C:col15/1501029233371/Put/vlen=10/seqid=0 val= \xFBf5 \x02iG\xB7\xD9\xA3
test_row_2/C:col16/1501029233371/Put/vlen=10/seqid=0 val= \xFBf5 \x02iG\xB7\xD9\xA3
test_row_2/C:col17/1501029233371/Put/vlen=10/seqid=0 val= \xFBf5 \x02iG\xB7\xD9\xA3
test_row_2/C:col18/1501029233371/Put/vlen=10/seqid=0 val= \xFBf5 \x02iG\xB7\xD9\xA3
test_row_2/C:col19/1501029233371/Put/vlen=10/seqid=0 val= \xFBf5 \x02iG\xB7\xD9\xA3
test_row_2/C:col2/1501029233371/Put/vlen=10/seqid=0 val= \xFBf5 \x02iG\xB7\xD9\xA3
test_row_2/C:col20/1501029233371/Put/vlen=10/seqid=0 val= \xFBf5 \x02iG\xB7\xD9\xA3
test_row_2/C:col21/1501029233371/Put/vlen=10/seqid=0 val= \xFBf5 \x02iG\xB7\xD9\xA3
test_row_2/C:col22/1501029233371/Put/vlen=10/seqid=0 val= \xFBf5 \x02iG\xB7\xD9\xA3
test_row_2/C:col23/1501029233371/Put/vlen=10/seqid=0 val= \xFBf5 \x02iG\xB7\xD9\xA3
test_row_2/C:col24/1501029233371/Put/vlen=10/seqid=0 val= \xFBf5 \x02iG\xB7\xD9\xA3
test_row_2/C:col25/1501029233371/Put/vlen=10/seqid=0 val= \xFBf5 \x02iG\xB7\xD9\xA3
test_row_2/C:col26/1501029233371/Put/vlen=10/seqid=0 val= \xFBf5 \x02iG\xB7\xD9\xA3
test_row_2/C:col27/1501029233371/Put/vlen=10/seqid=0 val= \xFBf5 \x02iG\xB7\xD9\xA3
test_row_2/C:col28/1501029233371/Put/vlen=10/seqid=0 val= \xFBf5 \x02iG\xB7\xD9\xA3
test_row_2/C:col29/1501029233371/Put/vlen=10/seqid=0 val= \xFBf5 \x02iG\xB7\xD9\xA3
test_row_2/C:col3/1501029233371/Put/vlen=10/seqid=0 val= \xFBf5 \x02iG\xB7\xD9\xA3
test_row_2/C:col30/1501029233371/Put/vlen=10/seqid=0 val= \xFBf5 \x02iG\xB7\xD9\xA3
test_row_2/C:col31/1501029233371/Put/vlen=10/seqid=0 val= \xFBf5 \x02iG\xB7\xD9\xA3
test_row_2/C:col32/1501029233371/Put/vlen=10/seqid=0 val= \xFBf5 \x02iG\xB7\xD9\xA3
test_row_2/C:col33/1501029233371/Put/vlen=10/seqid=0 val= \xFBf5 \x02iG\xB7\xD9\xA3
test_row_2/C:col34/1501029233371/Put/vlen=10/seqid=0 val= \xFBf5 \x02iG\xB7\xD9\xA3
test_row_2/C:col35/1501029233371/Put/vlen=10/seqid=0 val= \xFBf5 \x02iG\xB7\xD9\xA3
test_row_2/C:col36/1501029233371/Put/vlen=10/seqid=0 val= \xFBf5 \x02iG\xB7\xD9\xA3
test_row_2/C:col37/1501029233371/Put/vlen=10/seqid=0 val= \xFBf5 \x02iG\xB7\xD9\xA3
test_row_2/C:col38/1501029233371/Put/vlen=10/seqid=0 val= \xFBf5 \x02iG\xB7\xD9\xA3
test_row_2/C:col39/1501029233371/Put/vlen=10/seqid=0 val= \xFBf5 \x02iG\xB7\xD9\xA3
test_row_2/C:col4/1501029233371/Put/vlen=10/seqid=0 val= \xFBf5 \x02iG\xB7\xD9\xA3
test_row_2/C:col40/1501029233371/Put/vlen=10/seqid=0 val= \xFBf5 \x02iG\xB7\xD9\xA3
test_row_2/C:col41/1501029233371/Put/vlen=10/seqid=0 val= \xFBf5 \x02iG\xB7\xD9\xA3
test_row_2/C:col42/1501029233371/Put/vlen=10/seqid=0 val= \xFBf5 \x02iG\xB7\xD9\xA3
test_row_2/C:col43/1501029233371/Put/vlen=10/seqid=0 val= \xFBf5 \x02iG\xB7\xD9\xA3
test_row_2/C:col44/1501029233371/Put/vlen=10/seqid=0 val= \xFBf5 \x02iG\xB7\xD9\xA3
test_row_2/C:col45/1501029233371/Put/vlen=10/seqid=0 val= \xFBf5 \x02iG\xB7\xD9\xA3
test_row_2/C:col46/1501029233371/Put/vlen=10/seqid=0 val= \xFBf5 \x02iG\xB7\xD9\xA3
test_row_2/C:col47/1501029233371/Put/vlen=10/seqid=0 val= \xFBf5 \x02iG\xB7\xD9\xA3
test_row_2/C:col48/1501029233371/Put/vlen=10/seqid=0 val= \xFBf5 \x02iG\xB7\xD9\xA3
test_row_2/C:col49/1501029233371/Put/vlen=10/seqid=0 val= \xFBf5 \x02iG\xB7\xD9\xA3
test_row_2/C:col5/1501029233371/Put/vlen=10/seqid=0 val= \xFBf5 \x02iG\xB7\xD9\xA3
test_row_2/C:col6/1501029233371/Put/vlen=10/seqid=0 val= \xFBf5 \x02iG\xB7\xD9\xA3
test_row_2/C:col7/1501029233371/Put/vlen=10/seqid=0 val= \xFBf5 \x02iG\xB7\xD9\xA3
test_row_2/C:col8/1501029233371/Put/vlen=10/seqid=0 val= \xFBf5 \x02iG\xB7\xD9\xA3
test_row_2/C:col9/1501029233371/Put/vlen=10/seqid=0 val= \xFBf5 \x02iG\xB7\xD9\xA3

	at org.apache.hadoop.hbase.TestAcidGuarantees$AtomicScanReader.gotFailure(TestAcidGuarantees.java:245)
	at org.apache.hadoop.hbase.TestAcidGuarantees$AtomicScanReader.doAnAction(TestAcidGuarantees.java:224)
	at org.apache.hadoop.hbase.MultithreadedTestUtil$RepeatingTestThread.doWork(MultithreadedTestUtil.java:147)
	at org.apache.hadoop.hbase.MultithreadedTestUtil$TestThread.run(MultithreadedTestUtil.java:123)


Results :

Tests in error: 
  IntegrationTestAcidGuarantees.testScanAtomicity:101 » Runtime Deferred

Tests run: 3, Failures: 0, Errors: 1, Skipped: 0

[WARNING] File encoding has not been set, using platform encoding ISO-8859-1, i.e. build is platform dependent! The file encoding for reports output files should be provided by the POM property ${project.reporting.outputEncoding}.
[INFO] 
[INFO] --- maven-failsafe-plugin:2.18.1:verify (verify) @ hbase-it ---
[INFO] Failsafe report directory: <https://builds.apache.org/job/HBase-1.2-IT/it.test=IntegrationTestAcidGuarantees,jdk=JDK%201.8%20(latest),label=Hadoop/ws/hbase-it/target/failsafe-reports>
[WARNING] File encoding has not been set, using platform encoding ISO-8859-1, i.e. build is platform dependent! The file encoding for reports output files should be provided by the POM property ${project.reporting.outputEncoding}.
[INFO] ------------------------------------------------------------------------
[INFO] Reactor Summary:
[INFO] 
[INFO] Apache HBase ...................................... SUCCESS [1:52.586s]
[INFO] Apache HBase - Checkstyle ......................... SUCCESS [7.682s]
[INFO] Apache HBase - Resource Bundle .................... SUCCESS [0.219s]
[INFO] Apache HBase - Annotations ........................ SUCCESS [1.099s]
[INFO] Apache HBase - Protocol ........................... SUCCESS [17.967s]
[INFO] Apache HBase - Common ............................. SUCCESS [1:55.315s]
[INFO] Apache HBase - Procedure .......................... SUCCESS [1.103s]
[INFO] Apache HBase - Client ............................. SUCCESS [17.998s]
[INFO] Apache HBase - Hadoop Compatibility ............... SUCCESS [3.033s]
[INFO] Apache HBase - Hadoop Two Compatibility ........... SUCCESS [3.785s]
[INFO] Apache HBase - Prefix Tree ........................ SUCCESS [1.030s]
[INFO] Apache HBase - Server ............................. SUCCESS [1:47.300s]
[INFO] Apache HBase - Testing Util ....................... SUCCESS [3.484s]
[INFO] Apache HBase - Thrift ............................. SUCCESS [10.654s]
[INFO] Apache HBase - Rest ............................... SUCCESS [2.958s]
[INFO] Apache HBase - Shell .............................. SUCCESS [14.219s]
[INFO] Apache HBase - Integration Tests .................. FAILURE [9:57.657s]
[INFO] Apache HBase - Examples ........................... SKIPPED
[INFO] Apache HBase - External Block Cache ............... SKIPPED
[INFO] Apache HBase - Assembly ........................... SKIPPED
[INFO] Apache HBase - Shaded ............................. SKIPPED
[INFO] Apache HBase - Shaded - Client .................... SKIPPED
[INFO] Apache HBase - Shaded - Server .................... SKIPPED
[INFO] ------------------------------------------------------------------------
[INFO] BUILD FAILURE
[INFO] ------------------------------------------------------------------------
[INFO] Total time: 17:30.807s
[INFO] Finished at: Wed Jul 26 00:36:17 UTC 2017
[INFO] Final Memory: 163M/2108M
[INFO] ------------------------------------------------------------------------
[ERROR] Failed to execute goal org.apache.maven.plugins:maven-failsafe-plugin:2.18.1:verify (verify) on project hbase-it: There are test failures.
[ERROR] 
[ERROR] Please refer to <https://builds.apache.org/job/HBase-1.2-IT/it.test=IntegrationTestAcidGuarantees,jdk=JDK%201.8%20(latest),label=Hadoop/ws/hbase-it/target/failsafe-reports> for the individual test results.
[ERROR] -> [Help 1]
[ERROR] 
[ERROR] To see the full stack trace of the errors, re-run Maven with the -e switch.
[ERROR] Re-run Maven using the -X switch to enable full debug logging.
[ERROR] 
[ERROR] For more information about the errors and possible solutions, please read the following articles:
[ERROR] [Help 1] http://cwiki.apache.org/confluence/display/MAVEN/MojoFailureException
[ERROR] 
[ERROR] After correcting the problems, you can resume the build with the command
[ERROR]   mvn <goals> -rf :hbase-it
Build step 'Invoke top-level Maven targets' marked build as failure
Performing Post build task...
Match found for :.* : True
Logical operation result is TRUE
Running script  : # Post-build task script. TODO: Check this in and have all builds reference check-in.
pwd && ls
# NOTE!!!! The below code has been copied and pasted from ./dev-tools/run-test.sh
# Do not change here without syncing there and vice-versa.
ZOMBIE_TESTS_COUNT=`jps -v | grep surefirebooter | grep -e '-Dhbase.test' | wc -l`
if [[ $ZOMBIE_TESTS_COUNT != 0 ]] ; then
 echo "Suspicious java process found - waiting 30s to see if there are just slow to stop"
 sleep 30
 ZOMBIE_TESTS_COUNT=`jps -v | grep surefirebooter | grep -e '-Dhbase.test' | wc -l`
 if [[ $ZOMBIE_TESTS_COUNT != 0 ]] ; then
   echo " {color:red}There appear to be $ZOMBIE_TESTS_COUNT zombie tests{color}, they should have been killed by surefire but survived"
   jps -v | grep surefirebooter | grep -e '-Dhbase.test'
   jps -v | grep surefirebooter | grep -e '-Dhbase.test' | cut -d ' ' -f 1 | xargs -n 1 jstack
   # Exit with error
   exit 1
 else
   echo "We're ok: there is no zombie test, but some tests took some time to stop"
 fi
else
  echo "We're ok: there is no zombie test"
fi
[0407dd4a] $ /bin/bash -xe /tmp/jenkins4047996949115637713.sh
+ pwd
<https://builds.apache.org/job/HBase-1.2-IT/it.test=IntegrationTestAcidGuarantees,jdk=JDK%201.8%20(latest),label=Hadoop/ws/>
+ ls
bin
CHANGES.txt
conf
dev-support
hbase-annotations
hbase-assembly
hbase-checkstyle
hbase-client
hbase-common
hbase-examples
hbase-external-blockcache
hbase-hadoop2-compat
hbase-hadoop-compat
hbase-it
hbase-native-client
hbase-prefix-tree
hbase-procedure
hbase-protocol
hbase-resource-bundle
hbase-rest
hbase-server
hbase-shaded
hbase-shell
hbase-testing-util
hbase-thrift
LICENSE.txt
NOTICE.txt
pom.xml
README.txt
src
target
++ jps -v
++ grep surefirebooter
++ grep -e -Dhbase.test
++ wc -l
+ ZOMBIE_TESTS_COUNT=0
+ [[ 0 != 0 ]]
+ echo 'We'\''re ok: there is no zombie test'
We're ok: there is no zombie test
POST BUILD TASK : SUCCESS
END OF POST BUILD TASK : 0
Archiving artifacts

Jenkins build is back to normal : HBase-1.2-IT » IntegrationTestAcidGuarantees,JDK 1.8 (latest),Hadoop #906

Posted by Apache Jenkins Server <je...@builds.apache.org>.
See <https://builds.apache.org/job/HBase-1.2-IT/it.test=IntegrationTestAcidGuarantees,jdk=JDK%201.8%20(latest),label=Hadoop/906/display/redirect?page=changes>