You are viewing a plain text version of this content. The canonical link for it is here.
Posted to builds@beam.apache.org by Apache Jenkins Server <je...@builds.apache.org> on 2023/04/25 08:30:52 UTC
Build failed in Jenkins: beam_Publish_Beam_SDK_Snapshots #5245
See <https://ci-beam.apache.org/job/beam_Publish_Beam_SDK_Snapshots/5245/display/redirect>
Changes:
------------------------------------------
[...truncated 2.46 MB...]
#16 1.581 google-crc32c==1.5.0
#16 1.581 google-pasta==0.2.0
#16 1.581 google-resumable-media==2.4.1
#16 1.581 googleapis-common-protos==1.59.0
#16 1.581 greenlet==2.0.2
#16 1.581 grpc-google-iam-v1==0.12.6
#16 1.581 grpcio==1.53.0
#16 1.581 grpcio-status==1.53.0
#16 1.581 guppy3==3.1.2
#16 1.581 h5py==3.8.0
#16 1.581 hdfs==2.7.0
#16 1.581 httplib2==0.21.0
#16 1.581 hypothesis==6.70.2
#16 1.581 idna==3.4
#16 1.581 importlib-metadata==6.1.0
#16 1.581 iniconfig==2.0.0
#16 1.581 jax==0.4.8
#16 1.581 joblib==1.2.0
#16 1.581 keras==2.12.0
#16 1.581 libclang==16.0.0
#16 1.581 Markdown==3.4.3
#16 1.581 MarkupSafe==2.1.2
#16 1.581 ml-dtypes==0.0.4
#16 1.581 mmh3==3.1.0
#16 1.581 mock==5.0.1
#16 1.581 nltk==3.8.1
#16 1.581 nose==1.3.7
#16 1.581 numpy==1.23.5
#16 1.581 oauth2client==4.1.3
#16 1.581 oauthlib==3.2.2
#16 1.581 objsize==0.6.1
#16 1.581 opt-einsum==3.3.0
#16 1.581 orjson==3.8.9
#16 1.581 overrides==6.5.0
#16 1.581 packaging==23.0
#16 1.581 pandas==1.5.3
#16 1.581 parameterized==0.8.1
#16 1.581 pip==23.1.1
#16 1.581 pluggy==1.0.0
#16 1.581 proto-plus==1.22.2
#16 1.581 protobuf==4.22.1
#16 1.581 psycopg2-binary==2.9.6
#16 1.581 pyarrow==11.0.0
#16 1.581 pyasn1==0.4.8
#16 1.581 pyasn1-modules==0.2.8
#16 1.581 pycparser==2.21
#16 1.581 pydot==1.4.2
#16 1.581 PyHamcrest==1.10.1
#16 1.581 pymongo==4.3.3
#16 1.581 PyMySQL==1.0.3
#16 1.581 pyparsing==3.0.9
#16 1.581 pytest==7.2.2
#16 1.581 pytest-timeout==2.1.0
#16 1.581 pytest-xdist==3.2.1
#16 1.581 python-dateutil==2.8.2
#16 1.581 python-snappy==0.6.1
#16 1.581 pytz==2023.3
#16 1.581 PyYAML==6.0
#16 1.581 regex==2023.3.23
#16 1.581 requests==2.28.2
#16 1.581 requests-mock==1.10.0
#16 1.581 requests-oauthlib==1.3.1
#16 1.581 rsa==4.9
#16 1.581 scikit-learn==1.2.2
#16 1.581 scipy==1.10.1
#16 1.581 setuptools==67.7.2
#16 1.581 six==1.16.0
#16 1.581 sortedcontainers==2.4.0
#16 1.581 soupsieve==2.4
#16 1.581 SQLAlchemy==1.4.47
#16 1.581 sqlparse==0.4.3
#16 1.581 tenacity==8.2.2
#16 1.581 tensorboard==2.12.1
#16 1.581 tensorboard-data-server==0.7.0
#16 1.581 tensorboard-plugin-wit==1.8.1
#16 1.581 tensorflow==2.12.0
#16 1.581 tensorflow-estimator==2.12.0
#16 1.581 tensorflow-io-gcs-filesystem==0.32.0
#16 1.581 termcolor==2.2.0
#16 1.581 testcontainers==3.7.1
#16 1.581 threadpoolctl==3.1.0
#16 1.581 tomli==2.0.1
#16 1.581 tqdm==4.65.0
#16 1.581 typing_extensions==4.5.0
#16 1.581 urllib3==1.26.15
#16 1.581 websocket-client==1.5.1
#16 1.581 Werkzeug==2.2.3
#16 1.581 wheel==0.40.0
#16 1.581 wrapt==1.14.1
#16 1.581 zipp==3.15.0
#16 1.581 zstandard==0.20.0
#16 DONE 1.8s
#17 [beam 13/16] COPY target/LICENSE /opt/apache/beam/
#17 DONE 0.0s
#18 [beam 14/16] COPY target/LICENSE.python /opt/apache/beam/
#18 DONE 0.0s
#19 [beam 15/16] COPY target/NOTICE /opt/apache/beam/
#19 DONE 0.1s
#20 [beam 16/16] COPY target/launcher/linux_amd64/boot /opt/apache/beam/
#20 DONE 0.1s
#21 [third_party_licenses 1/4] COPY target/license_scripts /tmp/license_scripts/
#21 DONE 0.1s
#22 [third_party_licenses 2/4] COPY target/go-licenses/* /opt/apache/beam/third_party_licenses/golang/
#22 DONE 0.1s
#23 [third_party_licenses 3/4] COPY target/license_scripts /tmp/license_scripts/
#23 DONE 0.1s
#24 [third_party_licenses 4/4] RUN if [ "true" = "true" ] ; then pip install 'pip-licenses<5' pyyaml tenacity && python /tmp/license_scripts/pull_licenses_py.py ; fi
#24 1.473 Collecting pip-licenses<5
#24 1.542 Downloading pip_licenses-4.3.0-py3-none-any.whl (19 kB)
#24 1.557 Requirement already satisfied: pyyaml in /usr/local/lib/python3.9/site-packages (6.0)
#24 1.558 Requirement already satisfied: tenacity in /usr/local/lib/python3.9/site-packages (8.2.2)
#24 1.638 Collecting prettytable>=2.3.0 (from pip-licenses<5)
#24 1.656 Downloading prettytable-3.7.0-py3-none-any.whl (27 kB)
#24 1.737 Collecting wcwidth (from prettytable>=2.3.0->pip-licenses<5)
#24 1.755 Downloading wcwidth-0.2.6-py2.py3-none-any.whl (29 kB)
> Task :sdks:python:container:py38:docker
#27 exporting layers 23.1s done
#27 writing image sha256:9d22a49367f5b0ff395ce379a0afefa99f68e96d56c322ece5bc67adafa0ce0d 0.1s done
#27 naming to gcr.io/apache-beam-testing/beam-sdk/beam_python3.8_sdk:2.48.0.dev done
#27 DONE 23.2s
> Task :sdks:python:container:py310:docker
#27 exporting layers 23.1s done
#27 writing image sha256:3ae76543558e8c3ec6c7c26cad67c5d6bc305a1fc3d094d2615f624477acf7a0
#27 writing image sha256:3ae76543558e8c3ec6c7c26cad67c5d6bc305a1fc3d094d2615f624477acf7a0 0.0s done
#27 naming to gcr.io/apache-beam-testing/beam-sdk/beam_python3.10_sdk:2.48.0.dev 0.0s done
#27 DONE 23.2s
> Task :sdks:python:container:py38:dockerTag2.48.0-SNAPSHOT
> Task :sdks:python:container:py310:dockerTag2.48.0-SNAPSHOT
> Task :sdks:python:container:py311:docker
#27 exporting layers 23.5s done
#27 writing image sha256:6f7b5e7d9239c70b61604432125bb5ac104ee4c911491af8d5a26525044b4d13 done
#27 naming to gcr.io/apache-beam-testing/beam-sdk/beam_python3.11_sdk:2.48.0.dev done
#27 DONE 23.5s
> Task :sdks:python:container:py311:dockerTag2.48.0-SNAPSHOT
> Task :sdks:python:container:py39:docker
#24 3.355 Installing collected packages: wcwidth, prettytable, pip-licenses
#24 3.602 Successfully installed pip-licenses-4.3.0 prettytable-3.7.0 wcwidth-0.2.6
#24 3.603 WARNING: Running pip as the 'root' user can result in broken permissions and conflicting behaviour with the system package manager. It is recommended to use a virtual environment instead: https://pip.pypa.io/warnings/venv
#24 10.35 INFO:root:Successfully pulled licenses for 133 dependencies
#24 10.35 Skip pulling license for bs4
#24 DONE 10.5s
#25 [stage-2 1/2] COPY --from=third_party_licenses /opt/apache/beam/third_party_licenses /opt/apache/beam/third_party_licenses
#25 DONE 0.1s
#26 [stage-2 2/2] RUN if [ "true" != "true" ] ; then rm -rf /opt/apache/beam/third_party_licenses ; fi
#26 DONE 0.4s
#27 exporting to image
#27 exporting layers
> Task :sdks:python:container:py37:dockerPush2.48.0-SNAPSHOT
> Task :sdks:python:container:py39:docker
#27 exporting layers 17.8s done
#27 writing image sha256:96ee28c1fafbfea1485d4b125463c0add438313a63ebd33145178167150967c3 done
#27 naming to gcr.io/apache-beam-testing/beam-sdk/beam_python3.9_sdk:2.48.0.dev done
#27 DONE 17.9s
> Task :sdks:python:container:py39:dockerTag2.48.0-SNAPSHOT
> Task :sdks:python:container:py38:dockerPush2.48.0-SNAPSHOT
> Task :sdks:python:container:py310:dockerPush2.48.0-SNAPSHOT
> Task :sdks:python:container:py311:dockerPush2.48.0-SNAPSHOT
> Task :sdks:python:container:py39:dockerPush2.48.0-SNAPSHOT
> Task :sdks:python:container:py37:dockerTag85d4276016a1e4388cc9dd431e8f0684eb09fd95
> Task :sdks:python:container:py37:dockerPush85d4276016a1e4388cc9dd431e8f0684eb09fd95
> Task :sdks:python:container:py38:dockerTag85d4276016a1e4388cc9dd431e8f0684eb09fd95
> Task :sdks:python:container:py37:dockerTagLatest
> Task :sdks:python:container:py38:dockerPush85d4276016a1e4388cc9dd431e8f0684eb09fd95
> Task :sdks:python:container:py38:dockerTagLatest
> Task :sdks:python:container:py37:dockerPushLatest
> Task :sdks:python:container:py37:dockerTagsPush
> Task :sdks:python:container:py38:dockerPushLatest
> Task :sdks:python:container:py38:dockerTagsPush
> Task :sdks:python:container:py310:dockerTag85d4276016a1e4388cc9dd431e8f0684eb09fd95
> Task :sdks:python:container:py310:dockerPush85d4276016a1e4388cc9dd431e8f0684eb09fd95
> Task :sdks:python:container:py310:dockerTagLatest
> Task :sdks:python:container:py310:dockerPushLatest
> Task :sdks:python:container:py310:dockerTagsPush
> Task :sdks:python:container:py311:dockerTag85d4276016a1e4388cc9dd431e8f0684eb09fd95
> Task :sdks:python:container:py311:dockerPush85d4276016a1e4388cc9dd431e8f0684eb09fd95
> Task :sdks:python:container:py311:dockerTagLatest
> Task :sdks:python:container:py311:dockerPushLatest
> Task :sdks:python:container:py311:dockerTagsPush
> Task :sdks:python:container:py39:dockerTag85d4276016a1e4388cc9dd431e8f0684eb09fd95
> Task :sdks:python:container:py39:dockerPush85d4276016a1e4388cc9dd431e8f0684eb09fd95
> Task :sdks:python:container:py39:dockerTagLatest
> Task :sdks:python:container:py39:dockerPushLatest
> Task :sdks:python:container:py39:dockerTagsPush
FAILURE: Build failed with an exception.
* What went wrong:
Execution failed for task ':sdks:java:container:java8:docker'.
> Process 'command 'docker'' finished with non-zero exit value 1
* Try:
> Run with --stacktrace option to get the stack trace.
> Run with --info or --debug option to get more log output.
* Get more help at https://help.gradle.org
Deprecated Gradle features were used in this build, making it incompatible with Gradle 8.0.
You can use '--warning-mode all' to show the individual deprecation warnings and determine if they come from your own scripts or plugins.
See https://docs.gradle.org/7.5.1/userguide/command_line_interface.html#sec:command_line_warnings
Execution optimizations have been disabled for 3 invalid unit(s) of work during this build to ensure correctness.
Please consult deprecation warnings for more details.
BUILD FAILED in 17m 20s
200 actionable tasks: 163 executed, 23 from cache, 14 up-to-date
Build scan background action failed.
java.lang.IllegalArgumentException: com.gradle.enterprise.gradleplugin.internal.extension.a is not an interface
at java.lang.reflect.Proxy$ProxyClassFactory.apply(Proxy.java:590)
at java.lang.reflect.Proxy$ProxyClassFactory.apply(Proxy.java:557)
at java.lang.reflect.WeakCache$Factory.get(WeakCache.java:230)
at java.lang.reflect.WeakCache.get(WeakCache.java:127)
at java.lang.reflect.Proxy.getProxyClass0(Proxy.java:419)
at java.lang.reflect.Proxy.newProxyInstance(Proxy.java:719)
at com.gradle.ProxyFactory$ProxyingInvocationHandler.createLocalProxy(ProxyFactory.java:64)
at com.gradle.ProxyFactory$ProxyingInvocationHandler.lambda$adaptActionArg$1(ProxyFactory.java:59)
at com.gradle.enterprise.gradleplugin.internal.extension.b$3.run(SourceFile:100)
at java.util.concurrent.Executors$RunnableAdapter.call(Executors.java:511)
at java.util.concurrent.FutureTask.run(FutureTask.java:266)
at java.util.concurrent.ThreadPoolExecutor.runWorker(ThreadPoolExecutor.java:1149)
at java.util.concurrent.ThreadPoolExecutor$Worker.run(ThreadPoolExecutor.java:624)
at java.lang.Thread.run(Thread.java:750)
Publishing build scan...
https://gradle.com/s/sskcctzorovei
Build step 'Invoke Gradle script' changed build result to FAILURE
Build step 'Invoke Gradle script' marked build as failure
---------------------------------------------------------------------
To unsubscribe, e-mail: builds-unsubscribe@beam.apache.org
For additional commands, e-mail: builds-help@beam.apache.org
Jenkins build is back to normal : beam_Publish_Beam_SDK_Snapshots #5247
Posted by Apache Jenkins Server <je...@builds.apache.org>.
See <https://ci-beam.apache.org/job/beam_Publish_Beam_SDK_Snapshots/5247/display/redirect>
---------------------------------------------------------------------
To unsubscribe, e-mail: builds-unsubscribe@beam.apache.org
For additional commands, e-mail: builds-help@beam.apache.org
Build failed in Jenkins: beam_Publish_Beam_SDK_Snapshots #5246
Posted by Apache Jenkins Server <je...@builds.apache.org>.
See <https://ci-beam.apache.org/job/beam_Publish_Beam_SDK_Snapshots/5246/display/redirect?page=changes>
Changes:
[noreply] [AWS2] Bump AWS v2 SDK (closes #26323) (#26380)
------------------------------------------
[...truncated 2.22 MB...]
#16 1.304 freezegun==1.2.2
#16 1.304 future==0.18.3
#16 1.304 gast==0.4.0
#16 1.304 google-api-core==2.11.0
#16 1.304 google-apitools==0.5.31
#16 1.304 google-auth==2.17.1
#16 1.304 google-auth-httplib2==0.1.0
#16 1.304 google-auth-oauthlib==1.0.0
#16 1.304 google-cloud-bigquery==3.9.0
#16 1.304 google-cloud-bigquery-storage==2.19.1
#16 1.304 google-cloud-bigtable==2.17.0
#16 1.304 google-cloud-core==2.3.2
#16 1.304 google-cloud-datastore==2.15.1
#16 1.304 google-cloud-dlp==3.12.1
#16 1.304 google-cloud-language==2.9.1
#16 1.304 google-cloud-pubsub==2.15.2
#16 1.304 google-cloud-pubsublite==1.8.1
#16 1.304 google-cloud-recommendations-ai==0.10.3
#16 1.304 google-cloud-spanner==3.30.0
#16 1.304 google-cloud-videointelligence==2.11.1
#16 1.304 google-cloud-vision==3.4.1
#16 1.304 google-crc32c==1.5.0
#16 1.304 google-pasta==0.2.0
#16 1.304 google-resumable-media==2.4.1
#16 1.304 googleapis-common-protos==1.59.0
#16 1.304 greenlet==2.0.2
#16 1.304 grpc-google-iam-v1==0.12.6
#16 1.304 grpcio==1.53.0
#16 1.304 grpcio-status==1.53.0
#16 1.304 guppy3==3.1.2
#16 1.304 h5py==3.8.0
#16 1.304 hdfs==2.7.0
#16 1.304 httplib2==0.21.0
#16 1.304 hypothesis==6.70.2
#16 1.304 idna==3.4
#16 1.304 importlib-metadata==6.1.0
#16 1.304 iniconfig==2.0.0
#16 1.304 jax==0.4.8
#16 1.304 joblib==1.2.0
#16 1.304 keras==2.12.0
#16 1.304 libclang==16.0.0
#16 1.304 Markdown==3.4.3
#16 1.304 MarkupSafe==2.1.2
#16 1.304 ml-dtypes==0.0.4
#16 1.304 mmh3==3.1.0
#16 1.304 mock==5.0.1
#16 1.304 nltk==3.8.1
#16 1.304 nose==1.3.7
#16 1.304 numpy==1.23.5
#16 1.304 oauth2client==4.1.3
#16 1.304 oauthlib==3.2.2
#16 1.304 objsize==0.6.1
#16 1.304 opt-einsum==3.3.0
#16 1.304 orjson==3.8.9
#16 1.304 overrides==6.5.0
#16 1.304 packaging==23.0
#16 1.304 pandas==1.5.3
#16 1.304 parameterized==0.8.1
#16 1.304 pip==23.1.1
#16 1.304 pluggy==1.0.0
#16 1.304 proto-plus==1.22.2
#16 1.304 protobuf==4.22.1
#16 1.304 psycopg2-binary==2.9.6
#16 1.304 pyarrow==11.0.0
#16 1.304 pyasn1==0.4.8
#16 1.304 pyasn1-modules==0.2.8
#16 1.304 pycparser==2.21
#16 1.304 pydot==1.4.2
#16 1.304 PyHamcrest==1.10.1
#16 1.304 pymongo==4.3.3
#16 1.304 PyMySQL==1.0.3
#16 1.304 pyparsing==3.0.9
#16 1.304 pytest==7.2.2
#16 1.304 pytest-timeout==2.1.0
#16 1.304 pytest-xdist==3.2.1
#16 1.304 python-dateutil==2.8.2
#16 1.304 python-snappy==0.6.1
#16 1.304 pytz==2023.3
#16 1.304 PyYAML==6.0
#16 1.304 regex==2023.3.23
#16 1.304 requests==2.28.2
#16 1.304 requests-mock==1.10.0
#16 1.304 requests-oauthlib==1.3.1
#16 1.304 rsa==4.9
#16 1.304 scikit-learn==1.2.2
#16 1.304 scipy==1.10.1
#16 1.304 setuptools==67.7.2
#16 1.304 six==1.16.0
#16 1.304 sortedcontainers==2.4.0
#16 1.304 soupsieve==2.4
#16 1.304 SQLAlchemy==1.4.47
#16 1.304 sqlparse==0.4.3
#16 1.304 tenacity==8.2.2
#16 1.304 tensorboard==2.12.1
#16 1.304 tensorboard-data-server==0.7.0
#16 1.304 tensorboard-plugin-wit==1.8.1
#16 1.304 tensorflow==2.12.0
#16 1.304 tensorflow-estimator==2.12.0
#16 1.304 tensorflow-io-gcs-filesystem==0.32.0
#16 1.304 termcolor==2.2.0
#16 1.304 testcontainers==3.7.1
#16 1.304 threadpoolctl==3.1.0
#16 1.304 tomli==2.0.1
#16 1.304 tqdm==4.65.0
#16 1.304 typing_extensions==4.5.0
#16 1.304 urllib3==1.26.15
#16 1.304 websocket-client==1.5.1
#16 1.304 Werkzeug==2.2.3
#16 1.304 wheel==0.40.0
#16 1.304 wrapt==1.14.1
#16 1.304 zipp==3.15.0
#16 1.304 zstandard==0.20.0
#16 DONE 1.5s
#17 [beam 13/16] COPY target/LICENSE /opt/apache/beam/
#17 DONE 0.1s
#18 [beam 14/16] COPY target/LICENSE.python /opt/apache/beam/
#18 DONE 0.2s
#19 [beam 15/16] COPY target/NOTICE /opt/apache/beam/
#19 DONE 0.1s
#20 [beam 16/16] COPY target/launcher/linux_amd64/boot /opt/apache/beam/
#20 DONE 0.2s
#21 [third_party_licenses 1/4] COPY target/license_scripts /tmp/license_scripts/
#21 DONE 0.1s
#22 [third_party_licenses 2/4] COPY target/go-licenses/* /opt/apache/beam/third_party_licenses/golang/
#22 DONE 0.1s
#23 [third_party_licenses 3/4] COPY target/license_scripts /tmp/license_scripts/
#23 DONE 0.1s
#24 [third_party_licenses 4/4] RUN if [ "true" = "true" ] ; then pip install 'pip-licenses<5' pyyaml tenacity && python /tmp/license_scripts/pull_licenses_py.py ; fi
#24 1.120 ERROR: Could not find a version that satisfies the requirement pip-licenses<5 (from versions: none)
#24 1.121 ERROR: No matching distribution found for pip-licenses<5
#24 ERROR: executor failed running [/bin/sh -c if [ "$pull_licenses" = "true" ] ; then pip install 'pip-licenses<5' pyyaml tenacity && python /tmp/license_scripts/pull_licenses_py.py ; fi]: exit code: 1
------
> [third_party_licenses 4/4] RUN if [ "true" = "true" ] ; then pip install 'pip-licenses<5' pyyaml tenacity && python /tmp/license_scripts/pull_licenses_py.py ; fi:
#24 1.120 ERROR: Could not find a version that satisfies the requirement pip-licenses<5 (from versions: none)
#24 1.121 ERROR: No matching distribution found for pip-licenses<5
------
ERROR: failed to solve: executor failed running [/bin/sh -c if [ "$pull_licenses" = "true" ] ; then pip install 'pip-licenses<5' pyyaml tenacity && python /tmp/license_scripts/pull_licenses_py.py ; fi]: exit code: 1
> Task :sdks:python:container:py38:docker FAILED
#24 1.273 ERROR: Could not find a version that satisfies the requirement pip-licenses<5 (from versions: none)
#24 1.274 ERROR: No matching distribution found for pip-licenses<5
#24 ERROR: executor failed running [/bin/sh -c if [ "$pull_licenses" = "true" ] ; then pip install 'pip-licenses<5' pyyaml tenacity && python /tmp/license_scripts/pull_licenses_py.py ; fi]: exit code: 1
------
> [third_party_licenses 4/4] RUN if [ "true" = "true" ] ; then pip install 'pip-licenses<5' pyyaml tenacity && python /tmp/license_scripts/pull_licenses_py.py ; fi:
#24 1.273 ERROR: Could not find a version that satisfies the requirement pip-licenses<5 (from versions: none)
#24 1.274 ERROR: No matching distribution found for pip-licenses<5
------
ERROR: failed to solve: executor failed running [/bin/sh -c if [ "$pull_licenses" = "true" ] ; then pip install 'pip-licenses<5' pyyaml tenacity && python /tmp/license_scripts/pull_licenses_py.py ; fi]: exit code: 1
FAILURE: Build completed with 5 failures.
1: Task failed with an exception.
-----------
* What went wrong:
Execution failed for task ':sdks:python:container:py311:docker'.
> Process 'command 'docker'' finished with non-zero exit value 1
* Try:
> Run with --stacktrace option to get the stack trace.
> Run with --info or --debug option to get more log output.
==============================================================================
2: Task failed with an exception.
-----------
* What went wrong:
Execution failed for task ':sdks:python:container:py37:docker'.
> Process 'command 'docker'' finished with non-zero exit value 1
* Try:
> Run with --stacktrace option to get the stack trace.
> Run with --info or --debug option to get more log output.
==============================================================================
3: Task failed with an exception.
-----------
* What went wrong:
Execution failed for task ':sdks:python:container:py310:docker'.
> Process 'command 'docker'' finished with non-zero exit value 1
* Try:
> Run with --stacktrace option to get the stack trace.
> Run with --info or --debug option to get more log output.
==============================================================================
4: Task failed with an exception.
-----------
* What went wrong:
Execution failed for task ':sdks:python:container:py39:docker'.
> Process 'command 'docker'' finished with non-zero exit value 1
* Try:
> Run with --stacktrace option to get the stack trace.
> Run with --info or --debug option to get more log output.
==============================================================================
5: Task failed with an exception.
-----------
* What went wrong:
Execution failed for task ':sdks:python:container:py38:docker'.
> Process 'command 'docker'' finished with non-zero exit value 1
* Try:
> Run with --stacktrace option to get the stack trace.
> Run with --info or --debug option to get more log output.
==============================================================================
* Get more help at https://help.gradle.org
Deprecated Gradle features were used in this build, making it incompatible with Gradle 8.0.
You can use '--warning-mode all' to show the individual deprecation warnings and determine if they come from your own scripts or plugins.
See https://docs.gradle.org/7.5.1/userguide/command_line_interface.html#sec:command_line_warnings
Execution optimizations have been disabled for 3 invalid unit(s) of work during this build to ensure correctness.
Please consult deprecation warnings for more details.
BUILD FAILED in 12m 30s
176 actionable tasks: 140 executed, 22 from cache, 14 up-to-date
Build scan background action failed.
java.lang.IllegalArgumentException: com.gradle.enterprise.gradleplugin.internal.extension.a is not an interface
at java.lang.reflect.Proxy$ProxyClassFactory.apply(Proxy.java:590)
at java.lang.reflect.Proxy$ProxyClassFactory.apply(Proxy.java:557)
at java.lang.reflect.WeakCache$Factory.get(WeakCache.java:230)
at java.lang.reflect.WeakCache.get(WeakCache.java:127)
at java.lang.reflect.Proxy.getProxyClass0(Proxy.java:419)
at java.lang.reflect.Proxy.newProxyInstance(Proxy.java:719)
at com.gradle.ProxyFactory$ProxyingInvocationHandler.createLocalProxy(ProxyFactory.java:64)
at com.gradle.ProxyFactory$ProxyingInvocationHandler.lambda$adaptActionArg$1(ProxyFactory.java:59)
at com.gradle.enterprise.gradleplugin.internal.extension.b$3.run(SourceFile:100)
at java.util.concurrent.Executors$RunnableAdapter.call(Executors.java:511)
at java.util.concurrent.FutureTask.run(FutureTask.java:266)
at java.util.concurrent.ThreadPoolExecutor.runWorker(ThreadPoolExecutor.java:1149)
at java.util.concurrent.ThreadPoolExecutor$Worker.run(ThreadPoolExecutor.java:624)
at java.lang.Thread.run(Thread.java:750)
Publishing build scan...
https://gradle.com/s/5k7usxjobyonm
Build step 'Invoke Gradle script' changed build result to FAILURE
Build step 'Invoke Gradle script' marked build as failure
---------------------------------------------------------------------
To unsubscribe, e-mail: builds-unsubscribe@beam.apache.org
For additional commands, e-mail: builds-help@beam.apache.org