You are viewing a plain text version of this content. The canonical link for it is here.
Posted to dev@oozie.apache.org by Apache Jenkins Server <je...@builds.apache.org> on 2018/01/29 17:32:51 UTC

Failed: OOZIE-1717 PreCommit Build #358

Jira: https://issues.apache.org/jira/browse/OOZIE-1717
Build: https://builds.apache.org/job/PreCommit-OOZIE-Build/358/

###################################################################################
########################## LAST 100 LINES OF THE CONSOLE ###########################
[...truncated 1.73 MB...]
 +1 There are no new bugs found in [sharelib/distcp].
 +1 There are no new bugs found in [sharelib/hive].
 +1 There are no new bugs found in [sharelib/spark].
 +1 There are no new bugs found in [sharelib/streaming].
 +1 There are no new bugs found in [sharelib/sqoop].
 +1 There are no new bugs found in [examples].
 +1 There are no new bugs found in [client].
 -1 There are [7] new bugs found below threshold in [tools] that must be fixed, listing only the first [5] ones.
 You can find the FindBugs diff here (look for the red and orange ones): tools/findbugs-new.html
 The top [5] most important FindBugs errors are:
 At OozieDBCLI.java:[line 756]: Found reliance on default encoding in org.apache.oozie.tools.OozieDBCLI.ddlTweaksFor50(String, boolean): new java.io.FileWriter(String, boolean)
 At OozieDBCLI.java:[line 725]: Found reliance on default encoding in org.apache.oozie.tools.OozieDBCLI.ddlTweaksForPre50(String, boolean, String): new java.io.FileWriter(String, boolean)
 Obligation to clean up resource created at OozieDBCLI.java:[line 734] is not discharged: org.apache.oozie.tools.OozieDBCLI.ddlTweaksForPre50(String, boolean, String) may fail to clean up java.sql.Statement
 Path continues at OozieDBCLI.java:[line 741]: Path continues at OozieDBCLI.java:[line 735]
 Path continues at OozieDBCLI.java:[line 743]: Path continues at OozieDBCLI.java:[line 742]
 +1 There are no new bugs found in [server].
 +1 There are no new bugs found in [core].
+1 BACKWARDS_COMPATIBILITY
    +1 the patch does not change any JPA Entity/Colum/Basic/Lob/Transient annotations
    +1 the patch does not modify JPA files
-1 TESTS
    Tests run: 2088
    Tests failed: 21
    Tests errors: 18

    The patch failed the following testcases:

testOozieSharelibCLICreate(org.apache.oozie.tools.TestOozieSharelibCLI)
testOozieSharelibCLICreateConcurrent(org.apache.oozie.tools.TestOozieSharelibCLI)
testPartitionDependency(org.apache.oozie.service.TestPartitionDependencyManagerService)
testConnectionContext(org.apache.oozie.service.TestJMSAccessorService)
testCoordActionRecoveryServiceForWaitingRegisterPartition(org.apache.oozie.service.TestRecoveryService)
testPartitionDependency(org.apache.oozie.service.TestPartitionDependencyManagerEhcache)
testCoordinatorActionSelectors(org.apache.oozie.jms.TestJMSJobEventListener)
testCoordinatorActionSelectorsNegative(org.apache.oozie.jms.TestJMSJobEventListener)
testWorkflowJobSelectors(org.apache.oozie.jms.TestJMSJobEventListener)
testOnCoordinatorJobSuccessEvent(org.apache.oozie.jms.TestJMSJobEventListener)
testOnWorkflowJobSuspendEvent(org.apache.oozie.jms.TestJMSJobEventListener)
testWorkflowJobSelectorsAnd(org.apache.oozie.jms.TestJMSJobEventListener)
testOnCoordinatorJobFailureEvent(org.apache.oozie.jms.TestJMSJobEventListener)
testConnectionDrop(org.apache.oozie.jms.TestJMSJobEventListener)
testWorkflowJobSelectorsNegative(org.apache.oozie.jms.TestJMSJobEventListener)
testWorkflowJobSelectorsOr(org.apache.oozie.jms.TestJMSJobEventListener)
testOnWorkflowJobSuccessEvent(org.apache.oozie.jms.TestJMSJobEventListener)
testOnCoordinatorActionWaitingEvent(org.apache.oozie.jms.TestJMSJobEventListener)
testOnWorkflowJobFailureEvent(org.apache.oozie.jms.TestJMSJobEventListener)
testOnCoordinatorActionStartEvent(org.apache.oozie.jms.TestJMSJobEventListener)
testOnWorkflowJobStartedEvent(org.apache.oozie.jms.TestJMSJobEventListener)

    Tests failing with errors:
testImportTablesOverflowBatchSize(org.apache.oozie.tools.TestDBLoadDump)
testImportToNonExistingTablesSucceedsOnHsqldb(org.apache.oozie.tools.TestDBLoadDump)
testImportInvalidDataLeavesTablesEmpty(org.apache.oozie.tools.TestDBLoadDump)
testImportToNonEmptyTablesCausesPrematureExit(org.apache.oozie.tools.TestDBLoadDump)
testImportedDBIsExportedCorrectly(org.apache.oozie.tools.TestDBLoadDump)
testThreadLocalSession(org.apache.oozie.jms.TestDefaultConnectionContext)
testDropEventTypeMessage(org.apache.oozie.jms.TestHCatMessageHandler)
testCacheUpdateByMessage(org.apache.oozie.jms.TestHCatMessageHandler)
testConnectionRetryExceptionListener(org.apache.oozie.service.TestJMSAccessorService)
testConnectionRetry(org.apache.oozie.service.TestJMSAccessorService)
testOnSLADurationMetEvent(org.apache.oozie.jms.TestJMSSLAEventListener)
testOnSLAStartMetEvent(org.apache.oozie.jms.TestJMSSLAEventListener)
testSLAJobSelectorsNegative(org.apache.oozie.jms.TestJMSSLAEventListener)
testOnSLAEndMetEvent(org.apache.oozie.jms.TestJMSSLAEventListener)
testOnSLAStartMissEvent(org.apache.oozie.jms.TestJMSSLAEventListener)
testSLAJobSelectors(org.apache.oozie.jms.TestJMSSLAEventListener)
testOnSLAEndMissEvent(org.apache.oozie.jms.TestJMSSLAEventListener)
testOnSLADurationMissEvent(org.apache.oozie.jms.TestJMSSLAEventListener)

    Tests failed at first run:
TestJavaActionExecutor#testCredentialsSkip
TestHiveActionExecutor#testHiveAction
    For the complete list of flaky tests, see TEST-SUMMARY-FULL files.
+1 DISTRO
    +1 distro tarball builds with the patch 

----------------------------
-1 Overall result, please check the reported -1(s)

 There is at least one warning, please check

The full output of the test-patch run is available at

 https://builds.apache.org/job/PreCommit-OOZIE-Build/358/

Adding comment to JIRA
  % Total    % Received % Xferd  Average Speed   Time    Time     Time  Current
                                 Dload  Upload   Total   Spent    Left  Speed
  0     0    0     0    0     0      0      0 --:--:-- --:--:-- --:--:--     0{"self":"https://issues.apache.org/jira/rest/api/2/issue/12697804/comment/16343682","id":"16343682","author":{"self":"https://issues.apache.org/jira/rest/api/2/user?username=hadoopqa","name":"hadoopqa","key":"hadoopqa","emailAddress":"blackhole at hadoop dot apache dot org","avatarUrls":{"48x48":"https://issues.apache.org/jira/secure/useravatar?ownerId=hadoopqa&avatarId=10393","24x24":"https://issues.apache.org/jira/secure/useravatar?size=small&ownerId=hadoopqa&avatarId=10393","16x16":"https://issues.apache.org/jira/secure/useravatar?size=xsmall&ownerId=hadoopqa&avatarId=10393","32x32":"https://issues.apache.org/jira/secure/useravatar?size=medium&ownerId=hadoopqa&avatarId=10393"},"displayName":"Hadoop QA","active":true,"timeZone":"Etc/UTC"},"body":"\nTesting JIRA OOZIE-1717\n\nCleaning local git workspace\n\n----------------------------\n\n{color:green}+1 PATCH_APPLIES{color}\n{color:green}+1 CLEAN{color}\n{color:red}-1 RAW_PATCH_ANALYSIS{color}\n.    {color:green}+1{color} the patch does not introduce any @author tags\n.    {color:green}+1{color} the patch does not introduce any tabs\n.    {color:green}+1{color} the patch does not introduce any trailing spaces\n.    {color:green}+1{color} the patch does not introduce any line longer than 132\n.    {color:red}-1{color} the patch does not add/modify any testcase\n{color:green}+1 RAT{color}\n.    {color:green}+1{color} the patch does not seem to introduce new RAT warnings\n{color:green}+1 JAVADOC{color}\n.    {color:green}+1{color} the patch does not seem to introduce new Javadoc warnings\n.    {color:red}WARNING{color}: the current HEAD has 100 Javadoc warning(s)\n{color:green}+1 COMPILE{color}\n.    {color:green}+1{color} HEAD compiles\n.    {color:green}+1{color} patch compiles\n.    {color:green}+1{color} the patch does not seem to introduce new javac warnings\n{color:red}-1{color} There are [7] new bugs found below threshold in total that must be fixed.\n. {color:green}+1{color} There are no new bugs found in [docs].\n. {color:green}+1{color} There are no new bugs found in [sharelib/pig].\n. {color:green}+1{color} There are no new bugs found in [sharelib/oozie].\n. {color:green}+1{color} There are no new bugs found in [sharelib/hcatalog].\n. {color:green}+1{color} There are no new bugs found in [sharelib/hive2].\n. {color:green}+1{color} There are no new bugs found in [sharelib/distcp].\n. {color:green}+1{color} There are no new bugs found in [sharelib/hive].\n. {color:green}+1{color} There are no new bugs found in [sharelib/spark].\n. {color:green}+1{color} There are no new bugs found in [sharelib/streaming].\n. {color:green}+1{color} There are no new bugs found in [sharelib/sqoop].\n. {color:green}+1{color} There are no new bugs found in [examples].\n. {color:green}+1{color} There are no new bugs found in [client].\n. {color:red}-1{color} There are [7] new bugs found below threshold in [tools] that must be fixed, listing only the first [5] ones.\n. You can find the FindBugs diff here (look for the red and orange ones): tools/findbugs-new.html\n. The top [5] most important FindBugs errors are:\n. At OozieDBCLI.java:[line 756]: Found reliance on default encoding in org.apache.oozie.tools.OozieDBCLI.ddlTweaksFor50(String, boolean): new java.io.FileWriter(String, boolean)\n. At OozieDBCLI.java:[line 725]: Found reliance on default encoding in org.apache.oozie.tools.OozieDBCLI.ddlTweaksForPre50(String, boolean, String): new java.io.FileWriter(String, boolean)\n. Obligation to clean up resource created at OozieDBCLI.java:[line 734] is not discharged: org.apache.oozie.tools.OozieDBCLI.ddlTweaksForPre50(String, boolean, String) may fail to clean up java.sql.Statement\n. Path continues at OozieDBCLI.java:[line 741]: Path continues at OozieDBCLI.java:[line 735]\n. Path continues at OozieDBCLI.java:[line 743]: Path continues at OozieDBCLI.java:[line 742]\n. {color:green}+1{color} There are no new bugs found in [server].\n. {color:green}+1{color} There are no new bugs found in [core].\n{color:green}+1 BACKWARDS_COMPATIBILITY{color}\n.    {color:green}+1{color} the patch does not change any JPA Entity/Colum/Basic/Lob/Transient annotations\n.    {color:green}+1{color} the patch does not modify JPA files\n{color:red}-1 TESTS{color}\n.    Tests run: 2088\n.    Tests failed: 21\n.    Tests errors: 18\n\n.    The patch failed the following testcases:\n\ntestOozieSharelibCLICreate(org.apache.oozie.tools.TestOozieSharelibCLI)\ntestOozieSharelibCLICreateConcurrent(org.apache.oozie.tools.TestOozieSharelibCLI)\ntestPartitionDependency(org.apache.oozie.service.TestPartitionDependencyManagerService)\ntestConnectionContext(org.apache.oozie.service.TestJMSAccessorService)\ntestCoordActionRecoveryServiceForWaitingRegisterPartition(org.apache.oozie.service.TestRecoveryService)\ntestPartitionDependency(org.apache.oozie.service.TestPartitionDependencyManagerEhcache)\ntestCoordinatorActionSelectors(org.apache.oozie.jms.TestJMSJobEventListener)\ntestCoordinatorActionSelectorsNegative(org.apache.oozie.jms.TestJMSJobEventListener)\ntestWorkflowJobSelectors(org.apache.oozie.jms.TestJMSJobEventListener)\ntestOnCoordinatorJobSuccessEvent(org.apache.oozie.jms.TestJMSJobEventListener)\ntestOnWorkflowJobSuspendEvent(org.apache.oozie.jms.TestJMSJobEventListener)\ntestWorkflowJobSelectorsAnd(org.apache.oozie.jms.TestJMSJobEventListener)\ntestOnCoordinatorJobFailureEvent(org.apache.oozie.jms.TestJMSJobEventListener)\ntestConnectionDrop(org.apache.oozie.jms.TestJMSJobEventListener)\ntestWorkflowJobSelectorsNegative(org.apache.oozie.jms.TestJMSJobEventListener)\ntestWorkflowJobSelectorsOr(org.apache.oozie.jms.TestJMSJobEventListener)\ntestOnWorkflowJobSuccessEvent(org.apache.oozie.jms.TestJMSJobEventListener)\ntestOnCoordinatorActionWaitingEvent(org.apache.oozie.jms.TestJMSJobEventListener)\ntestOnWorkflowJobFailureEvent(org.apache.oozie.jms.TestJMSJobEventListener)\ntestOnCoordinatorActionStartEvent(org.apache.oozie.jms.TestJMSJobEventListener)\ntestOnWorkflowJobStartedEvent(org.apache.oozie.jms.TestJMSJobEventListener)\n\n.    Tests failing with errors:\ntestImportTablesOverflowBatchSize(org.apache.oozie.tools.TestDBLoadDump)\ntestImportToNonExistingTablesSucceedsOnHsqldb(org.apache.oozie.tools.TestDBLoadDump)\ntestImportInvalidDataLeavesTablesEmpty(org.apache.oozie.tools.TestDBLoadDump)\ntestImportToNonEmptyTablesCausesPrematureExit(org.apache.oozie.tools.TestDBLoadDump)\ntestImportedDBIsExportedCorrectly(org.apache.oozie.tools.TestDBLoadDump)\ntestThreadLocalSession(org.apache.oozie.jms.TestDefaultConnectionContext)\ntestDropEventTypeMessage(org.apache.oozie.jms.TestHCatMessageHandler)\ntestCacheUpdateByMessage(org.apache.oozie.jms.TestHCatMessageHandler)\ntestConnectionRetryExceptionListener(org.apache.oozie.service.TestJMSAccessorService)\ntestConnectionRetry(org.apache.oozie.service.TestJMSAccessorService)\ntestOnSLADurationMetEvent(org.apache.oozie.jms.TestJMSSLAEventListener)\ntestOnSLAStartMetEvent(org.apache.oozie.jms.TestJMSSLAEventListener)\ntestSLAJobSelectorsNegative(org.apache.oozie.jms.TestJMSSLAEventListener)\ntestOnSLAEndMetEvent(org.apache.oozie.jms.TestJMSSLAEventListener)\ntestOnSLAStartMissEvent(org.apache.oozie.jms.TestJMSSLAEventListener)\ntestSLAJobSelectors(org.apache.oozie.jms.TestJMSSLAEventListener)\ntestOnSLAEndMissEvent(org.apache.oozie.jms.TestJMSSLAEventListener)\ntestOnSLADurationMissEvent(org.apache.oozie.jms.TestJMSSLAEventListener)\n\n.    {color:orange}Tests failed at first run:{color}\nTestJavaActionExecutor#testCredentialsSkip\nTestHiveActionExecutor#testHiveAction\n.    For the complete list of flaky tests, see TEST-SUMMARY-FULL files.\n{color:green}+1 DISTRO{color}\n.    {color:green}+1{color} distro tarball builds with the patch \n\n----------------------------\n{color:red}*-1 Overall result, please check the reported -1(s)*{color}\n\n{color:red}. There is at least one warning, please check{color}\n\nThe full output of the test-patch run is available at\n\n. https://builds.apache.org/job/PreCommit-OOZIE-Build/358/\n\n","updateAuthor":{"self":"https://issues.apache.org/jira/rest/api/2/user?username=hadoopqa","name":"hadoopqa","key":"hadoopqa","emailAddress":"blackhole at hadoop dot ap100 16040    0  8764  100  7276   9521   7905 --:--:-- --:--:-- --:--:--  9526
ache dot org","avatarUrls":{"48x48":"https://issues.apache.org/jira/secure/useravatar?ownerId=hadoopqa&avatarId=10393","24x24":"https://issues.apache.org/jira/secure/useravatar?size=small&ownerId=hadoopqa&avatarId=10393","16x16":"https://issues.apache.org/jira/secure/useravatar?size=xsmall&ownerId=hadoopqa&avatarId=10393","32x32":"https://issues.apache.org/jira/secure/useravatar?size=medium&ownerId=hadoopqa&avatarId=10393"},"displayName":"Hadoop QA","active":true,"timeZone":"Etc/UTC"},"created":"2018-01-29T17:32:41.349+0000","updated":"2018-01-29T17:32:41.349+0000"}
test-patch exit code: 1

Build step 'Execute shell' marked build as failure
[description-setter] Description set: OOZIE-1717
Archiving artifacts
[Fast Archiver] Compressed 4.16 MB of artifacts by 25.5% relative to #346
Recording test results
Email was triggered for: Failure - Any
Sending email for trigger: Failure - Any



###################################################################################
############################## FAILED TESTS (if any) ##############################
39 tests failed.
FAILED:  org.apache.oozie.jms.TestDefaultConnectionContext.testThreadLocalSession

Error Message:
null

Stack Trace:
java.lang.NullPointerException
	at org.apache.oozie.jms.TestDefaultConnectionContext.testThreadLocalSession(TestDefaultConnectionContext.java:74)


FAILED:  org.apache.oozie.jms.TestHCatMessageHandler.testDropEventTypeMessage

Error Message:
Could not create Transport. Reason: javax.management.InstanceAlreadyExistsException: org.apache.activemq:type=Broker,brokerName=localhost

Stack Trace:
javax.jms.JMSException: Could not create Transport. Reason: javax.management.InstanceAlreadyExistsException: org.apache.activemq:type=Broker,brokerName=localhost
	at org.apache.oozie.jms.TestHCatMessageHandler.setUp(TestHCatMessageHandler.java:70)
Caused by: javax.management.InstanceAlreadyExistsException: org.apache.activemq:type=Broker,brokerName=localhost
	at org.apache.oozie.jms.TestHCatMessageHandler.setUp(TestHCatMessageHandler.java:70)


FAILED:  org.apache.oozie.jms.TestHCatMessageHandler.testCacheUpdateByMessage

Error Message:
Could not create Transport. Reason: javax.management.InstanceAlreadyExistsException: org.apache.activemq:type=Broker,brokerName=localhost

Stack Trace:
javax.jms.JMSException: Could not create Transport. Reason: javax.management.InstanceAlreadyExistsException: org.apache.activemq:type=Broker,brokerName=localhost
	at org.apache.oozie.jms.TestHCatMessageHandler.setUp(TestHCatMessageHandler.java:70)
Caused by: javax.management.InstanceAlreadyExistsException: org.apache.activemq:type=Broker,brokerName=localhost
	at org.apache.oozie.jms.TestHCatMessageHandler.setUp(TestHCatMessageHandler.java:70)


FAILED:  org.apache.oozie.jms.TestJMSJobEventListener.testCoordinatorActionSelectors

Error Message:
null

Stack Trace:
junit.framework.AssertionFailedError
	at org.apache.oozie.jms.TestJMSJobEventListener.testCoordinatorActionSelectors(TestJMSJobEventListener.java:544)


FAILED:  org.apache.oozie.jms.TestJMSJobEventListener.testCoordinatorActionSelectorsNegative

Error Message:
null

Stack Trace:
junit.framework.AssertionFailedError
	at org.apache.oozie.jms.TestJMSJobEventListener.testCoordinatorActionSelectorsNegative(TestJMSJobEventListener.java:568)


FAILED:  org.apache.oozie.jms.TestJMSJobEventListener.testWorkflowJobSelectors

Error Message:
null

Stack Trace:
junit.framework.AssertionFailedError
	at org.apache.oozie.jms.TestJMSJobEventListener.testWorkflowJobSelectors(TestJMSJobEventListener.java:239)


FAILED:  org.apache.oozie.jms.TestJMSJobEventListener.testOnCoordinatorJobSuccessEvent

Error Message:
null

Stack Trace:
junit.framework.AssertionFailedError
	at org.apache.oozie.jms.TestJMSJobEventListener.testOnCoordinatorJobSuccessEvent(TestJMSJobEventListener.java:477)


FAILED:  org.apache.oozie.jms.TestJMSJobEventListener.testOnWorkflowJobSuspendEvent

Error Message:
null

Stack Trace:
junit.framework.AssertionFailedError
	at org.apache.oozie.jms.TestJMSJobEventListener.testOnWorkflowJobSuspendEvent(TestJMSJobEventListener.java:214)


FAILED:  org.apache.oozie.jms.TestJMSJobEventListener.testWorkflowJobSelectorsAnd

Error Message:
null

Stack Trace:
junit.framework.AssertionFailedError
	at org.apache.oozie.jms.TestJMSJobEventListener.testWorkflowJobSelectorsAnd(TestJMSJobEventListener.java:316)


FAILED:  org.apache.oozie.jms.TestJMSJobEventListener.testOnCoordinatorJobFailureEvent

Error Message:
null

Stack Trace:
junit.framework.AssertionFailedError
	at org.apache.oozie.jms.TestJMSJobEventListener.testOnCoordinatorJobFailureEvent(TestJMSJobEventListener.java:517)


FAILED:  org.apache.oozie.jms.TestJMSJobEventListener.testConnectionDrop

Error Message:
org.apache.activemq:type=Broker,brokerName=localhost

Stack Trace:
junit.framework.AssertionFailedError: org.apache.activemq:type=Broker,brokerName=localhost
	at org.apache.oozie.jms.TestJMSJobEventListener.testConnectionDrop(TestJMSJobEventListener.java:365)


FAILED:  org.apache.oozie.jms.TestJMSJobEventListener.testWorkflowJobSelectorsNegative

Error Message:
null

Stack Trace:
junit.framework.AssertionFailedError
	at org.apache.oozie.jms.TestJMSJobEventListener.testWorkflowJobSelectorsNegative(TestJMSJobEventListener.java:262)


FAILED:  org.apache.oozie.jms.TestJMSJobEventListener.testWorkflowJobSelectorsOr

Error Message:
null

Stack Trace:
junit.framework.AssertionFailedError
	at org.apache.oozie.jms.TestJMSJobEventListener.testWorkflowJobSelectorsOr(TestJMSJobEventListener.java:289)


FAILED:  org.apache.oozie.jms.TestJMSJobEventListener.testOnWorkflowJobSuccessEvent

Error Message:
null

Stack Trace:
junit.framework.AssertionFailedError
	at org.apache.oozie.jms.TestJMSJobEventListener.testOnWorkflowJobSuccessEvent(TestJMSJobEventListener.java:143)


FAILED:  org.apache.oozie.jms.TestJMSJobEventListener.testOnCoordinatorActionWaitingEvent

Error Message:
null

Stack Trace:
junit.framework.AssertionFailedError
	at org.apache.oozie.jms.TestJMSJobEventListener.testOnCoordinatorActionWaitingEvent(TestJMSJobEventListener.java:403)


FAILED:  org.apache.oozie.jms.TestJMSJobEventListener.testOnWorkflowJobFailureEvent

Error Message:
null

Stack Trace:
junit.framework.AssertionFailedError
	at org.apache.oozie.jms.TestJMSJobEventListener.testOnWorkflowJobFailureEvent(TestJMSJobEventListener.java:180)


FAILED:  org.apache.oozie.jms.TestJMSJobEventListener.testOnCoordinatorActionStartEvent

Error Message:
null

Stack Trace:
junit.framework.AssertionFailedError
	at org.apache.oozie.jms.TestJMSJobEventListener.testOnCoordinatorActionStartEvent(TestJMSJobEventListener.java:439)


FAILED:  org.apache.oozie.jms.TestJMSJobEventListener.testOnWorkflowJobStartedEvent

Error Message:
null

Stack Trace:
junit.framework.AssertionFailedError
	at org.apache.oozie.jms.TestJMSJobEventListener.testOnWorkflowJobStartedEvent(TestJMSJobEventListener.java:108)


FAILED:  org.apache.oozie.jms.TestJMSSLAEventListener.testOnSLADurationMetEvent

Error Message:
null

Stack Trace:
java.lang.NullPointerException
	at org.apache.oozie.jms.TestJMSSLAEventListener.testOnSLADurationMetEvent(TestJMSSLAEventListener.java:382)


FAILED:  org.apache.oozie.jms.TestJMSSLAEventListener.testOnSLAStartMetEvent

Error Message:
null

Stack Trace:
java.lang.NullPointerException
	at org.apache.oozie.jms.TestJMSSLAEventListener.testOnSLAStartMetEvent(TestJMSSLAEventListener.java:292)


FAILED:  org.apache.oozie.jms.TestJMSSLAEventListener.testSLAJobSelectorsNegative

Error Message:
null

Stack Trace:
java.lang.NullPointerException
	at org.apache.oozie.jms.TestJMSSLAEventListener.testSLAJobSelectorsNegative(TestJMSSLAEventListener.java:261)


FAILED:  org.apache.oozie.jms.TestJMSSLAEventListener.testOnSLAEndMetEvent

Error Message:
null

Stack Trace:
java.lang.NullPointerException
	at org.apache.oozie.jms.TestJMSSLAEventListener.testOnSLAEndMetEvent(TestJMSSLAEventListener.java:332)


FAILED:  org.apache.oozie.jms.TestJMSSLAEventListener.testOnSLAStartMissEvent

Error Message:
null

Stack Trace:
java.lang.NullPointerException
	at org.apache.oozie.jms.TestJMSSLAEventListener.testOnSLAStartMissEvent(TestJMSSLAEventListener.java:103)


FAILED:  org.apache.oozie.jms.TestJMSSLAEventListener.testSLAJobSelectors

Error Message:
null

Stack Trace:
java.lang.NullPointerException
	at org.apache.oozie.jms.TestJMSSLAEventListener.testSLAJobSelectors(TestJMSSLAEventListener.java:231)


FAILED:  org.apache.oozie.jms.TestJMSSLAEventListener.testOnSLAEndMissEvent

Error Message:
null

Stack Trace:
java.lang.NullPointerException
	at org.apache.oozie.jms.TestJMSSLAEventListener.testOnSLAEndMissEvent(TestJMSSLAEventListener.java:143)


FAILED:  org.apache.oozie.jms.TestJMSSLAEventListener.testOnSLADurationMissEvent

Error Message:
null

Stack Trace:
java.lang.NullPointerException
	at org.apache.oozie.jms.TestJMSSLAEventListener.testOnSLADurationMissEvent(TestJMSSLAEventListener.java:191)


FAILED:  org.apache.oozie.service.TestJMSAccessorService.testConnectionRetryExceptionListener

Error Message:
null

Stack Trace:
junit.framework.AssertionFailedError
	at org.apache.oozie.service.TestJMSAccessorService.testConnectionRetryExceptionListener(TestJMSAccessorService.java:236)


FAILED:  org.apache.oozie.service.TestJMSAccessorService.testConnectionRetry

Error Message:
org.apache.activemq:type=Broker,brokerName=localhost

Stack Trace:
javax.management.InstanceAlreadyExistsException: org.apache.activemq:type=Broker,brokerName=localhost
	at org.apache.oozie.service.TestJMSAccessorService.testConnectionRetry(TestJMSAccessorService.java:181)


FAILED:  org.apache.oozie.service.TestJMSAccessorService.testConnectionContext

Error Message:
Unexpected exception javax.jms.JMSException: Could not create Transport. Reason: javax.management.InstanceAlreadyExistsException: org.apache.activemq:type=Broker,brokerName=localhost

Stack Trace:
junit.framework.AssertionFailedError: Unexpected exception javax.jms.JMSException: Could not create Transport. Reason: javax.management.InstanceAlreadyExistsException: org.apache.activemq:type=Broker,brokerName=localhost
	at org.apache.oozie.service.TestJMSAccessorService.testConnectionContext(TestJMSAccessorService.java:150)


FAILED:  org.apache.oozie.service.TestPartitionDependencyManagerEhcache.testPartitionDependency

Error Message:
null

Stack Trace:
junit.framework.AssertionFailedError
	at org.apache.oozie.service.TestPartitionDependencyManagerEhcache.testPartitionDependency(TestPartitionDependencyManagerEhcache.java:47)


FAILED:  org.apache.oozie.service.TestPartitionDependencyManagerService.testPartitionDependency

Error Message:
null

Stack Trace:
junit.framework.AssertionFailedError
	at org.apache.oozie.service.TestPartitionDependencyManagerService.testPartitionDependency(TestPartitionDependencyManagerService.java:95)


FAILED:  org.apache.oozie.service.TestRecoveryService.testCoordActionRecoveryServiceForWaitingRegisterPartition

Error Message:
null

Stack Trace:
junit.framework.AssertionFailedError
	at org.apache.oozie.service.TestRecoveryService.testCoordActionRecoveryServiceForWaitingRegisterPartition(TestRecoveryService.java:505)


FAILED:  org.apache.oozie.tools.TestDBLoadDump.testImportTablesOverflowBatchSize

Error Message:
null

Stack Trace:
java.lang.NullPointerException
	at org.apache.oozie.tools.TestDBLoadDump.setUp(TestDBLoadDump.java:64)


FAILED:  org.apache.oozie.tools.TestDBLoadDump.testImportToNonExistingTablesSucceedsOnHsqldb

Error Message:
null

Stack Trace:
java.lang.NullPointerException
	at org.apache.oozie.tools.TestDBLoadDump.setUp(TestDBLoadDump.java:64)


FAILED:  org.apache.oozie.tools.TestDBLoadDump.testImportInvalidDataLeavesTablesEmpty

Error Message:
null

Stack Trace:
java.lang.NullPointerException
	at org.apache.oozie.tools.TestDBLoadDump.setUp(TestDBLoadDump.java:64)


FAILED:  org.apache.oozie.tools.TestDBLoadDump.testImportToNonEmptyTablesCausesPrematureExit

Error Message:
null

Stack Trace:
java.lang.NullPointerException
	at org.apache.oozie.tools.TestDBLoadDump.setUp(TestDBLoadDump.java:64)


FAILED:  org.apache.oozie.tools.TestDBLoadDump.testImportedDBIsExportedCorrectly

Error Message:
null

Stack Trace:
java.lang.NullPointerException
	at org.apache.oozie.tools.TestDBLoadDump.setUp(TestDBLoadDump.java:64)


FAILED:  org.apache.oozie.tools.TestOozieSharelibCLI.testOozieSharelibCLICreate

Error Message:
expected:<0> but was:<1>

Stack Trace:
junit.framework.AssertionFailedError: expected:<0> but was:<1>
	at org.apache.oozie.tools.TestOozieSharelibCLI.testOozieSharelibCLICreate(TestOozieSharelibCLI.java:109)


FAILED:  org.apache.oozie.tools.TestOozieSharelibCLI.testOozieSharelibCLICreateConcurrent

Error Message:
expected:<0> but was:<1>

Stack Trace:
junit.framework.AssertionFailedError: expected:<0> but was:<1>
	at org.apache.oozie.tools.TestOozieSharelibCLI.testOozieSharelibCLICreateConcurrent(TestOozieSharelibCLI.java:138)

Success: OOZIE-3172 PreCommit Build #363

Posted by Apache Jenkins Server <je...@builds.apache.org>.
Jira: https://issues.apache.org/jira/browse/OOZIE-3172
Build: https://builds.apache.org/job/PreCommit-OOZIE-Build/363/

###################################################################################
########################## LAST 100 LINES OF THE CONSOLE ###########################
[...truncated 1.58 MB...]
[DEBUG] There are no new bugs found in [sharelib/oozie].
[TRACE] New XMLLib present, calling 'xmllint --xpath' to get bug instance counts
[DEBUG] There are no new bugs found in [sharelib/hcatalog].
[TRACE] New XMLLib present, calling 'xmllint --xpath' to get bug instance counts
[DEBUG] There are no new bugs found in [sharelib/streaming].
[TRACE] New XMLLib present, calling 'xmllint --xpath' to get bug instance counts
[DEBUG] There are no new bugs found in [sharelib/hive].
[TRACE] New XMLLib present, calling 'xmllint --xpath' to get bug instance counts
[DEBUG] There are no new bugs found in [sharelib/sqoop].
[TRACE] New XMLLib present, calling 'xmllint --xpath' to get bug instance counts
[DEBUG] There are no new bugs found in [sharelib/spark].
[TRACE] New XMLLib present, calling 'xmllint --xpath' to get bug instance counts
[DEBUG] There are no new bugs found in [sharelib/hive2].
[TRACE] New XMLLib present, calling 'xmllint --xpath' to get bug instance counts
[DEBUG] There are no new bugs found in [sharelib/pig].
[INFO] There are no new bugs found totally].
[TRACE] FindBugs diffs checked and reports created
[TRACE] Summary file size is 2186 bytes
[TRACE] Full summary file size is 1248 bytes
[TRACE] File [/home/jenkins/jenkins-slave/workspace/PreCommit-OOZIE-Build/test-patch/tmp/FINDBUGS_DIFF/diff/findbugs-diff-0.1.0-all.jar] removed
[TRACE] File [/home/jenkins/jenkins-slave/workspace/PreCommit-OOZIE-Build/test-patch/tmp/FINDBUGS_DIFF/diff/findbugs-diff-0.1.0-all.jar.md5sum] removed
  Running test-patch task BACKWARDS_COMPATIBILITY
  Running test-patch task TESTS
  Running test-patch task DISTRO


Testing JIRA OOZIE-3172

Cleaning local git workspace

----------------------------

+1 PATCH_APPLIES
+1 CLEAN
+1 RAW_PATCH_ANALYSIS
    +1 the patch does not introduce any @author tags
    +1 the patch does not introduce any tabs
    +1 the patch does not introduce any trailing spaces
    +1 the patch does not introduce any line longer than 132
    +1 the patch adds/modifies 2 testcase(s)
+1 RAT
    +1 the patch does not seem to introduce new RAT warnings
+1 JAVADOC
    +1 the patch does not seem to introduce new Javadoc warnings
    WARNING: the current HEAD has 100 Javadoc warning(s)
+1 COMPILE
    +1 HEAD compiles
    +1 patch compiles
    +1 the patch does not seem to introduce new javac warnings
+1 There are no new bugs found in total.
 +1 There are no new bugs found in [docs].
 +1 There are no new bugs found in [examples].
 +1 There are no new bugs found in [tools].
 +1 There are no new bugs found in [core].
 +1 There are no new bugs found in [server].
 +1 There are no new bugs found in [client].
 +1 There are no new bugs found in [sharelib/distcp].
 +1 There are no new bugs found in [sharelib/oozie].
 +1 There are no new bugs found in [sharelib/hcatalog].
 +1 There are no new bugs found in [sharelib/streaming].
 +1 There are no new bugs found in [sharelib/hive].
 +1 There are no new bugs found in [sharelib/sqoop].
 +1 There are no new bugs found in [sharelib/spark].
 +1 There are no new bugs found in [sharelib/hive2].
 +1 There are no new bugs found in [sharelib/pig].
+1 BACKWARDS_COMPATIBILITY
    +1 the patch does not change any JPA Entity/Colum/Basic/Lob/Transient annotations
    +1 the patch does not modify JPA files
+1 TESTS
    Tests run: 2088
    Tests failed at first run:
TestJavaActionExecutor#testCredentialsSkip
TestCoordActionInputCheckXCommandNonUTC>TestCoordActionInputCheckXCommand#testNone
    For the complete list of flaky tests, see TEST-SUMMARY-FULL files.
+1 DISTRO
    +1 distro tarball builds with the patch 

----------------------------
+1 Overall result, good!, no -1s

 There is at least one warning, please check

The full output of the test-patch run is available at

 https://builds.apache.org/job/PreCommit-OOZIE-Build/363/

Adding comment to JIRA
  % Total    % Received % Xferd  Average Speed   Time    Time     Time  Current
                                 Dload  Upload   Total   Spent    Left  Speed
  0     0    0     0    0     0      0      0 --:--:-- --:--:-- --:--:--     0{"self":"https://issues.apache.org/jira/rest/api/2/issue/13134446/comment/16345600","id":"16345600","author":{"self":"https://issues.apache.org/jira/rest/api/2/user?username=hadoopqa","name":"hadoopqa","key":"hadoopqa","emailAddress":"blackhole at hadoop dot apache dot org","avatarUrls":{"48x48":"https://issues.apache.org/jira/secure/useravatar?ownerId=hadoopqa&avatarId=10393","24x24":"https://issues.apache.org/jira/secure/useravatar?size=small&ownerId=hadoopqa&avatarId=10393","16x16":"https://issues.apache.org/jira/secure/useravatar?size=xsmall&ownerId=hadoopqa&avatarId=10393","32x32":"https://issues.apache.org/jira/secure/useravatar?size=medium&ownerId=hadoopqa&avatarId=10393"},"displayName":"Hadoop QA","active":true,"timeZone":"Etc/UTC"},"body":"\nTesting JIRA OOZIE-3172\n\nCleaning local git workspace\n\n----------------------------\n\n{color:green}+1 PATCH_APPLIES{color}\n{color:green}+1 CLEAN{color}\n{color:green}+1 RAW_PATCH_ANALYSIS{color}\n.    {color:green}+1{color} the patch does not introduce any @author tags\n.    {color:green}+1{color} the patch does not introduce any tabs\n.    {color:green}+1{color} the patch does not introduce any trailing spaces\n.    {color:green}+1{color} the patch does not introduce any line longer than 132\n.    {color:green}+1{color} the patch adds/modifies 2 testcase(s)\n{color:green}+1 RAT{color}\n.    {color:green}+1{color} the patch does not seem to introduce new RAT warnings\n{color:green}+1 JAVADOC{color}\n.    {color:green}+1{color} the patch does not seem to introduce new Javadoc warnings\n.    {color:red}WARNING{color}: the current HEAD has 100 Javadoc warning(s)\n{color:green}+1 COMPILE{color}\n.    {color:green}+1{color} HEAD compiles\n.    {color:green}+1{color} patch compiles\n.    {color:green}+1{color} the patch does not seem to introduce new javac warnings\n{color:green}+1{color} There are no new bugs found in total.\n. {color:green}+1{color} There are no new bugs found in [docs].\n. {color:green}+1{color} There are no new bugs found in [examples].\n. {color:green}+1{color} There are no new bugs found in [tools].\n. {color:green}+1{color} There are no new bugs found in [core].\n. {color:green}+1{color} There are no new bugs found in [server].\n. {color:green}+1{color} There are no new bugs found in [client].\n. {color:green}+1{color} There are no new bugs found in [sharelib/distcp].\n. {color:green}+1{color} There are no new bugs found in [sharelib/oozie].\n. {color:green}+1{color} There are no new bugs found in [sharelib/hcatalog].\n. {color:green}+1{color} There are no new bugs found in [sharelib/streaming].\n. {color:green}+1{color} There are no new bugs found in [sharelib/hive].\n. {color:green}+1{color} There are no new bugs found in [sharelib/sqoop].\n. {color:green}+1{color} There are no new bugs found in [sharelib/spark].\n. {color:green}+1{color} There are no new bugs found in [sharelib/hive2].\n. {color:green}+1{color} There are no new bugs found in [sharelib/pig].\n{color:green}+1 BACKWARDS_COMPATIBILITY{color}\n.    {color:green}+1{color} the patch does not change any JPA Entity/Colum/Basic/Lob/Transient annotations\n.    {color:green}+1{color} the patch does not modify JPA files\n{color:green}+1 TESTS{color}\n.    Tests run: 2088\n.    {color:orange}Tests failed at first run:{color}\nTestJavaActionExecutor#testCredentialsSkip\nTestCoordActionInputCheckXCommandNonUTC>TestCoordActionInputCheckXCommand#testNone\n.    For the complete list of flaky tests, see TEST-SUMMARY-FULL files.\n{color:green}+1 DISTRO{color}\n.    {color:green}+1{color} distro tarball builds with the patch \n\n----------------------------\n{color:green}*+1 Overall result, good!, no -1s*{color}\n\n{color:red}. There is at least one warning, please check{color}\n\nThe full output of the test-patch run is available at\n\n. https://builds.apache.org/job/PreCommit-OOZIE-Build/363/\n\n","updateAuthor":{"self":"https://issues.apache.org/jira/rest/api/2/user?username=hadoopqa","name":"hadoopqa","key":"hadoopqa","emailAddress":"blackhole at hadoop dot apache dot org","avatarUrls":{"48x48":"htt100  7768    0  4628  100  3140   8282   5619 --:--:-- --:--:-- --:--:--  8293
ps://issues.apache.org/jira/secure/useravatar?ownerId=hadoopqa&avatarId=10393","24x24":"https://issues.apache.org/jira/secure/useravatar?size=small&ownerId=hadoopqa&avatarId=10393","16x16":"https://issues.apache.org/jira/secure/useravatar?size=xsmall&ownerId=hadoopqa&avatarId=10393","32x32":"https://issues.apache.org/jira/secure/useravatar?size=medium&ownerId=hadoopqa&avatarId=10393"},"displayName":"Hadoop QA","active":true,"timeZone":"Etc/UTC"},"created":"2018-01-30T18:48:53.189+0000","updated":"2018-01-30T18:48:53.189+0000"}
test-patch exit code: 0

[description-setter] Description set: OOZIE-3172
Archiving artifacts
[Fast Archiver] Compressed 2.30 MB of artifacts by 47.5% relative to #346
Recording test results
Email was triggered for: Success
Sending email for trigger: Success



###################################################################################
############################## FAILED TESTS (if any) ##############################
All tests passed

Failed: OOZIE-3061 PreCommit Build #362

Posted by Apache Jenkins Server <je...@builds.apache.org>.
Jira: https://issues.apache.org/jira/browse/OOZIE-3061
Build: https://builds.apache.org/job/PreCommit-OOZIE-Build/362/

###################################################################################
########################## LAST 100 LINES OF THE CONSOLE ###########################
[...truncated 1.58 MB...]
[DEBUG] There are no new bugs found in [tools].
[TRACE] New XMLLib present, calling 'xmllint --xpath' to get bug instance counts
[DEBUG] There are no new bugs found in [server].
[INFO] There are no new bugs found totally].
[TRACE] FindBugs diffs checked and reports created
[TRACE] Summary file size is 2187 bytes
[TRACE] Full summary file size is 1248 bytes
[TRACE] File [/home/jenkins/jenkins-slave/workspace/PreCommit-OOZIE-Build/test-patch/tmp/FINDBUGS_DIFF/diff/findbugs-diff-0.1.0-all.jar] removed
[TRACE] File [/home/jenkins/jenkins-slave/workspace/PreCommit-OOZIE-Build/test-patch/tmp/FINDBUGS_DIFF/diff/findbugs-diff-0.1.0-all.jar.md5sum] removed
  Running test-patch task BACKWARDS_COMPATIBILITY
  Running test-patch task TESTS
  Running test-patch task DISTRO


Testing JIRA OOZIE-3061

Cleaning local git workspace

----------------------------

+1 PATCH_APPLIES
+1 CLEAN
-1 RAW_PATCH_ANALYSIS
    +1 the patch does not introduce any @author tags
    +1 the patch does not introduce any tabs
    +1 the patch does not introduce any trailing spaces
    +1 the patch does not introduce any line longer than 132
    -1 the patch does not add/modify any testcase
+1 RAT
    +1 the patch does not seem to introduce new RAT warnings
+1 JAVADOC
    +1 the patch does not seem to introduce new Javadoc warnings
    WARNING: the current HEAD has 100 Javadoc warning(s)
+1 COMPILE
    +1 HEAD compiles
    +1 patch compiles
    +1 the patch does not seem to introduce new javac warnings
+1 There are no new bugs found in total.
 +1 There are no new bugs found in [docs].
 +1 There are no new bugs found in [sharelib/distcp].
 +1 There are no new bugs found in [sharelib/hive].
 +1 There are no new bugs found in [sharelib/spark].
 +1 There are no new bugs found in [sharelib/hive2].
 +1 There are no new bugs found in [sharelib/hcatalog].
 +1 There are no new bugs found in [sharelib/streaming].
 +1 There are no new bugs found in [sharelib/pig].
 +1 There are no new bugs found in [sharelib/sqoop].
 +1 There are no new bugs found in [sharelib/oozie].
 +1 There are no new bugs found in [examples].
 +1 There are no new bugs found in [client].
 +1 There are no new bugs found in [core].
 +1 There are no new bugs found in [tools].
 +1 There are no new bugs found in [server].
+1 BACKWARDS_COMPATIBILITY
    +1 the patch does not change any JPA Entity/Colum/Basic/Lob/Transient annotations
    +1 the patch does not modify JPA files
-1 TESTS
    Tests run: 2088
    Tests failed: 3
    Tests errors: 1

    The patch failed the following testcases:

testPartitionDependency(org.apache.oozie.service.TestPartitionDependencyManagerService)
testCoordActionRecoveryServiceForWaitingRegisterPartition(org.apache.oozie.service.TestRecoveryService)
testPartitionDependency(org.apache.oozie.service.TestPartitionDependencyManagerEhcache)

    Tests failing with errors:
testConnectionRetry(org.apache.oozie.service.TestJMSAccessorService)

    Tests failed at first run:
TestJavaActionExecutor#testCredentialsSkip
    For the complete list of flaky tests, see TEST-SUMMARY-FULL files.
+1 DISTRO
    +1 distro tarball builds with the patch 

----------------------------
-1 Overall result, please check the reported -1(s)

 There is at least one warning, please check

The full output of the test-patch run is available at

 https://builds.apache.org/job/PreCommit-OOZIE-Build/362/

Adding comment to JIRA
  % Total    % Received % Xferd  Average Speed   Time    Time     Time  Current
                                 Dload  Upload   Total   Spent    Left  Speed
  0     0    0     0    0     0      0      0 --:--:-- --:--:-- --:--:--     0  0  3557    0     0    0     0      0      0 --:--:-- --:--:-- --:--:--     0{"self":"https://issues.apache.org/jira/rest/api/2/issue/13103093/comment/16345200","id":"16345200","author":{"self":"https://issues.apache.org/jira/rest/api/2/user?username=hadoopqa","name":"hadoopqa","key":"hadoopqa","emailAddress":"blackhole at hadoop dot apache dot org","avatarUrls":{"48x48":"https://issues.apache.org/jira/secure/useravatar?ownerId=hadoopqa&avatarId=10393","24x24":"https://issues.apache.org/jira/secure/useravatar?size=small&ownerId=hadoopqa&avatarId=10393","16x16":"https://issues.apache.org/jira/secure/useravatar?size=xsmall&ownerId=hadoopqa&avatarId=10393","32x32":"https://issues.apache.org/jira/secure/useravatar?size=medium&ownerId=hadoopqa&avatarId=10393"},"displayName":"Hadoop QA","active":true,"timeZone":"Etc/UTC"},"body":"\nTesting JIRA OOZIE-3061\n\nCleaning local git workspace\n\n----------------------------\n\n{color:green}+1 PATCH_APPLIES{color}\n{color:green}+1 CLEAN{color}\n{color:red}-1 RAW_PATCH_ANALYSIS{color}\n.    {color:green}+1{color} the patch does not introduce any @author tags\n.    {color:green}+1{color} the patch does not introduce any tabs\n.    {color:green}+1{color} the patch does not introduce any trailing spaces\n.    {color:green}+1{color} the patch does not introduce any line longer than 132\n.    {color:red}-1{color} the patch does not add/modify any testcase\n{color:green}+1 RAT{color}\n.    {color:green}+1{color} the patch does not seem to introduce new RAT warnings\n{color:green}+1 JAVADOC{color}\n.    {color:green}+1{color} the patch does not seem to introduce new Javadoc warnings\n.    {color:red}WARNING{color}: the current HEAD has 100 Javadoc warning(s)\n{color:green}+1 COMPILE{color}\n.    {color:green}+1{color} HEAD compiles\n.    {color:green}+1{color} patch compiles\n.    {color:green}+1{color} the patch does not seem to introduce new javac warnings\n{color:green}+1{color} There are no new bugs found in total.\n. {color:green}+1{color} There are no new bugs found in [docs].\n. {color:green}+1{color} There are no new bugs found in [sharelib/distcp].\n. {color:green}+1{color} There are no new bugs found in [sharelib/hive].\n. {color:green}+1{color} There are no new bugs found in [sharelib/spark].\n. {color:green}+1{color} There are no new bugs found in [sharelib/hive2].\n. {color:green}+1{color} There are no new bugs found in [sharelib/hcatalog].\n. {color:green}+1{color} There are no new bugs found in [sharelib/streaming].\n. {color:green}+1{color} There are no new bugs found in [sharelib/pig].\n. {color:green}+1{color} There are no new bugs found in [sharelib/sqoop].\n. {color:green}+1{color} There are no new bugs found in [sharelib/oozie].\n. {color:green}+1{color} There are no new bugs found in [examples].\n. {color:green}+1{color} There are no new bugs found in [client].\n. {color:green}+1{color} There are no new bugs found in [core].\n. {color:green}+1{color} There are no new bugs found in [tools].\n. {color:green}+1{color} There are no new bugs found in [server].\n{color:green}+1 BACKWARDS_COMPATIBILITY{color}\n.    {color:green}+1{color} the patch does not change any JPA Entity/Colum/Basic/Lob/Transient annotations\n.    {color:green}+1{color} the patch does not modify JPA files\n{color:red}-1 TESTS{color}\n.    Tests run: 2088\n.    Tests failed: 3\n.    Tests errors: 1\n\n.    The patch failed the following testcases:\n\ntestPartitionDependency(org.apache.oozie.service.TestPartitionDependencyManagerService)\ntestCoordActionRecoveryServiceForWaitingRegisterPartition(org.apache.oozie.service.TestRecoveryService)\ntestPartitionDependency(org.apache.oozie.service.TestPartitionDependencyManagerEhcache)\n\n.    Tests failing with errors:\ntestConnectionRetry(org.apache.oozie.service.TestJMSAccessorService)\n\n.    {color:orange}Tests failed at first run:{color}\nTestJavaActionExecutor#testCredentialsSkip\n.    For the complete list of flaky tests, see TEST-SUMMARY-FULL files.\n{color:green}+1 DISTRO{color}\n.    {color:green}+1{color} distro tarball builds with the patch \n\n----------------------------\n{color:red}*-1 Overall result, please check the repo100  8602    0  5045  100  3557   6309   4448 --:--:-- --:--:-- --:--:--  6306
rted -1(s)*{color}\n\n{color:red}. There is at least one warning, please check{color}\n\nThe full output of the test-patch run is available at\n\n. https://builds.apache.org/job/PreCommit-OOZIE-Build/362/\n\n","updateAuthor":{"self":"https://issues.apache.org/jira/rest/api/2/user?username=hadoopqa","name":"hadoopqa","key":"hadoopqa","emailAddress":"blackhole at hadoop dot apache dot org","avatarUrls":{"48x48":"https://issues.apache.org/jira/secure/useravatar?ownerId=hadoopqa&avatarId=10393","24x24":"https://issues.apache.org/jira/secure/useravatar?size=small&ownerId=hadoopqa&avatarId=10393","16x16":"https://issues.apache.org/jira/secure/useravatar?size=xsmall&ownerId=hadoopqa&avatarId=10393","32x32":"https://issues.apache.org/jira/secure/useravatar?size=medium&ownerId=hadoopqa&avatarId=10393"},"displayName":"Hadoop QA","active":true,"timeZone":"Etc/UTC"},"created":"2018-01-30T15:15:03.205+0000","updated":"2018-01-30T15:15:03.205+0000"}
test-patch exit code: 1

Build step 'Execute shell' marked build as failure
[description-setter] Description set: OOZIE-3061
Archiving artifacts
[Fast Archiver] Compressed 2.29 MB of artifacts by 36.9% relative to #346
Recording test results
Email was triggered for: Failure - Any
Sending email for trigger: Failure - Any



###################################################################################
############################## FAILED TESTS (if any) ##############################
4 tests failed.
FAILED:  org.apache.oozie.service.TestJMSAccessorService.testConnectionRetry

Error Message:
null

Stack Trace:
junit.framework.AssertionFailedError
	at org.apache.oozie.service.TestJMSAccessorService.testConnectionRetry(TestJMSAccessorService.java:183)


FAILED:  org.apache.oozie.service.TestPartitionDependencyManagerEhcache.testPartitionDependency

Error Message:
null

Stack Trace:
junit.framework.AssertionFailedError
	at org.apache.oozie.service.TestPartitionDependencyManagerEhcache.testPartitionDependency(TestPartitionDependencyManagerEhcache.java:47)


FAILED:  org.apache.oozie.service.TestPartitionDependencyManagerService.testPartitionDependency

Error Message:
null

Stack Trace:
junit.framework.AssertionFailedError
	at org.apache.oozie.service.TestPartitionDependencyManagerService.testPartitionDependency(TestPartitionDependencyManagerService.java:95)


FAILED:  org.apache.oozie.service.TestRecoveryService.testCoordActionRecoveryServiceForWaitingRegisterPartition

Error Message:
null

Stack Trace:
junit.framework.AssertionFailedError
	at org.apache.oozie.service.TestRecoveryService.testCoordActionRecoveryServiceForWaitingRegisterPartition(TestRecoveryService.java:505)

Failed: OOZIE-3061 PreCommit Build #361

Posted by Apache Jenkins Server <je...@builds.apache.org>.
Jira: https://issues.apache.org/jira/browse/OOZIE-3061
Build: https://builds.apache.org/job/PreCommit-OOZIE-Build/361/

###################################################################################
########################## LAST 100 LINES OF THE CONSOLE ###########################
[...truncated 1.58 MB...]
[DEBUG] There are no new bugs found in [examples].
[TRACE] New XMLLib present, calling 'xmllint --xpath' to get bug instance counts
[DEBUG] There are no new bugs found in [docs].
[TRACE] New XMLLib present, calling 'xmllint --xpath' to get bug instance counts
[DEBUG] There are no new bugs found in [server].
[INFO] There are no new bugs found totally].
[TRACE] FindBugs diffs checked and reports created
[TRACE] Summary file size is 2187 bytes
[TRACE] Full summary file size is 1248 bytes
[TRACE] File [/home/jenkins/jenkins-slave/workspace/PreCommit-OOZIE-Build/test-patch/tmp/FINDBUGS_DIFF/diff/findbugs-diff-0.1.0-all.jar] removed
[TRACE] File [/home/jenkins/jenkins-slave/workspace/PreCommit-OOZIE-Build/test-patch/tmp/FINDBUGS_DIFF/diff/findbugs-diff-0.1.0-all.jar.md5sum] removed
  Running test-patch task BACKWARDS_COMPATIBILITY
  Running test-patch task TESTS
  Running test-patch task DISTRO


Testing JIRA OOZIE-3061

Cleaning local git workspace

----------------------------

+1 PATCH_APPLIES
+1 CLEAN
-1 RAW_PATCH_ANALYSIS
    +1 the patch does not introduce any @author tags
    +1 the patch does not introduce any tabs
    +1 the patch does not introduce any trailing spaces
    +1 the patch does not introduce any line longer than 132
    -1 the patch does not add/modify any testcase
+1 RAT
    +1 the patch does not seem to introduce new RAT warnings
+1 JAVADOC
    +1 the patch does not seem to introduce new Javadoc warnings
    WARNING: the current HEAD has 100 Javadoc warning(s)
+1 COMPILE
    +1 HEAD compiles
    +1 patch compiles
    +1 the patch does not seem to introduce new javac warnings
+1 There are no new bugs found in total.
 +1 There are no new bugs found in [core].
 +1 There are no new bugs found in [tools].
 +1 There are no new bugs found in [sharelib/hive2].
 +1 There are no new bugs found in [sharelib/distcp].
 +1 There are no new bugs found in [sharelib/hcatalog].
 +1 There are no new bugs found in [sharelib/streaming].
 +1 There are no new bugs found in [sharelib/sqoop].
 +1 There are no new bugs found in [sharelib/oozie].
 +1 There are no new bugs found in [sharelib/pig].
 +1 There are no new bugs found in [sharelib/hive].
 +1 There are no new bugs found in [sharelib/spark].
 +1 There are no new bugs found in [client].
 +1 There are no new bugs found in [examples].
 +1 There are no new bugs found in [docs].
 +1 There are no new bugs found in [server].
+1 BACKWARDS_COMPATIBILITY
    +1 the patch does not change any JPA Entity/Colum/Basic/Lob/Transient annotations
    +1 the patch does not modify JPA files
-1 TESTS
    Tests run: 2088
    Tests failed: 1
    Tests errors: 0

    The patch failed the following testcases:

testHiveAction(org.apache.oozie.action.hadoop.TestHiveActionExecutor)

    Tests failing with errors:


    Tests failed at first run:
TestJavaActionExecutor#testCredentialsSkip
    For the complete list of flaky tests, see TEST-SUMMARY-FULL files.
+1 DISTRO
    +1 distro tarball builds with the patch 

----------------------------
-1 Overall result, please check the reported -1(s)

 There is at least one warning, please check

The full output of the test-patch run is available at

 https://builds.apache.org/job/PreCommit-OOZIE-Build/361/

Adding comment to JIRA
  % Total    % Received % Xferd  Average Speed   Time    Time     Time  Current
                                 Dload  Upload   Total   Spent    Left  Speed
  0     0    0     0    0     0      0      0 --:--:-- --:--:-- --:--:--     0  0     0    0     0    0     0      0      0 --:--:-- --:--:-- --:--:--     0{"self":"https://issues.apache.org/jira/rest/api/2/issue/13103093/comment/16344970","id":"16344970","author":{"self":"https://issues.apache.org/jira/rest/api/2/user?username=hadoopqa","name":"hadoopqa","key":"hadoopqa","emailAddress":"blackhole at hadoop dot apache dot org","avatarUrls":{"48x48":"https://issues.apache.org/jira/secure/useravatar?ownerId=hadoopqa&avatarId=10393","24x24":"https://issues.apache.org/jira/secure/useravatar?size=small&ownerId=hadoopqa&avatarId=10393","16x16":"https://issues.apache.org/jira/secure/useravatar?size=xsmall&ownerId=hadoopqa&avatarId=10393","32x32":"https://issues.apache.org/jira/secure/useravatar?size=medium&ownerId=hadoopqa&avatarId=10393"},"displayName":"Hadoop QA","active":true,"timeZone":"Etc/UTC"},"body":"\nTesting JIRA OOZIE-3061\n\nCleaning local git workspace\n\n----------------------------\n\n{color:green}+1 PATCH_APPLIES{color}\n{color:green}+1 CLEAN{color}\n{color:red}-1 RAW_PATCH_ANALYSIS{color}\n.    {color:green}+1{color} the patch does not introduce any @author tags\n.    {color:green}+1{color} the patch does not introduce any tabs\n.    {color:green}+1{color} the patch does not introduce any trailing spaces\n.    {color:green}+1{color} the patch does not introduce any line longer than 132\n.    {color:red}-1{color} the patch does not add/modify any testcase\n{color:green}+1 RAT{color}\n.    {color:green}+1{color} the patch does not seem to introduce new RAT warnings\n{color:green}+1 JAVADOC{color}\n.    {color:green}+1{color} the patch does not seem to introduce new Javadoc warnings\n.    {color:red}WARNING{color}: the current HEAD has 100 Javadoc warning(s)\n{color:green}+1 COMPILE{color}\n.    {color:green}+1{color} HEAD compiles\n.    {color:green}+1{color} patch compiles\n.    {color:green}+1{color} the patch does not seem to introduce new javac warnings\n{color:green}+1{color} There are no new bugs found in total.\n. {color:green}+1{color} There are no new bugs found in [core].\n. {color:green}+1{color} There are no new bugs found in [tools].\n. {color:green}+1{color} There are no new bugs found in [sharelib/hive2].\n. {color:green}+1{color} There are no new bugs found in [sharelib/distcp].\n. {color:green}+1{color} There are no new bugs found in [sharelib/hcatalog].\n. {color:green}+1{color} There are no new bugs found in [sharelib/streaming].\n. {color:green}+1{color} There are no new bugs found in [sharelib/sqoop].\n. {color:green}+1{color} There are no new bugs found in [sharelib/oozie].\n. {color:green}+1{color} There are no new bugs found in [sharelib/pig].\n. {color:green}+1{color} There are no new bugs found in [sharelib/hive].\n. {color:green}+1{color} There are no new bugs found in [sharelib/spark].\n. {color:green}+1{color} There are no new bugs found in [client].\n. {color:green}+1{color} There are no new bugs found in [examples].\n. {color:green}+1{color} There are no new bugs found in [docs].\n. {color:green}+1{color} There are no new bugs found in [server].\n{color:green}+1 BACKWARDS_COMPATIBILITY{color}\n.    {color:green}+1{color} the patch does not change any JPA Entity/Colum/Basic/Lob/Transient annotations\n.    {color:green}+1{color} the patch does not modify JPA files\n{color:red}-1 TESTS{color}\n.    Tests run: 2088\n.    Tests failed: 1\n.    Tests errors: 0\n\n.    The patch failed the following testcases:\n\ntestHiveAction(org.apache.oozie.action.hadoop.TestHiveActionExecutor)\n\n.    Tests failing with errors:\n\n\n.    {color:orange}Tests failed at first run:{color}\nTestJavaActionExecutor#testCredentialsSkip\n.    For the complete list of flaky tests, see TEST-SUMMARY-FULL files.\n{color:green}+1 DISTRO{color}\n.    {color:green}+1{color} distro tarball builds with the patch \n\n----------------------------\n{color:red}*-1 Overall result, please check the reported -1(s)*{color}\n\n{color:red}. There is at least one warning, please check{color}\n\nThe full output of the test-patch run is available at\n\n. https://builds.apache.org/job/PreCommit-OOZIE-Build/361/\n\n","updateAuthor":{"self":"https://issues.apache.org/jira/rest/api/2/user100  8042    0  4765  100  3277   5817   4000 --:--:-- --:--:-- --:--:--  5810
?username=hadoopqa","name":"hadoopqa","key":"hadoopqa","emailAddress":"blackhole at hadoop dot apache dot org","avatarUrls":{"48x48":"https://issues.apache.org/jira/secure/useravatar?ownerId=hadoopqa&avatarId=10393","24x24":"https://issues.apache.org/jira/secure/useravatar?size=small&ownerId=hadoopqa&avatarId=10393","16x16":"https://issues.apache.org/jira/secure/useravatar?size=xsmall&ownerId=hadoopqa&avatarId=10393","32x32":"https://issues.apache.org/jira/secure/useravatar?size=medium&ownerId=hadoopqa&avatarId=10393"},"displayName":"Hadoop QA","active":true,"timeZone":"Etc/UTC"},"created":"2018-01-30T12:23:02.934+0000","updated":"2018-01-30T12:23:02.934+0000"}
test-patch exit code: 1

Build step 'Execute shell' marked build as failure
[description-setter] Description set: OOZIE-3061
Archiving artifacts
[Fast Archiver] Compressed 2.28 MB of artifacts by 60.2% relative to #346
Recording test results
Email was triggered for: Failure - Any
Sending email for trigger: Failure - Any



###################################################################################
############################## FAILED TESTS (if any) ##############################
1 tests failed.
FAILED:  org.apache.oozie.action.hadoop.TestHiveActionExecutor.testHiveAction

Error Message:
YARN App state for app application_1517313753902_0003 expected:<FINISHED> but was:<RUNNING>

Stack Trace:
junit.framework.AssertionFailedError: YARN App state for app application_1517313753902_0003 expected:<FINISHED> but was:<RUNNING>
	at org.apache.oozie.action.hadoop.TestHiveActionExecutor.testHiveAction(TestHiveActionExecutor.java:158)

Failed: OOZIE-3168 PreCommit Build #360

Posted by Apache Jenkins Server <je...@builds.apache.org>.
Jira: https://issues.apache.org/jira/browse/OOZIE-3168
Build: https://builds.apache.org/job/PreCommit-OOZIE-Build/360/

###################################################################################
########################## LAST 100 LINES OF THE CONSOLE ###########################
[...truncated 1.58 MB...]
[DEBUG] There are no new bugs found in [tools].
[TRACE] New XMLLib present, calling 'xmllint --xpath' to get bug instance counts
[DEBUG] There are no new bugs found in [server].
[INFO] There are no new bugs found totally].
[TRACE] FindBugs diffs checked and reports created
[TRACE] Summary file size is 2187 bytes
[TRACE] Full summary file size is 1248 bytes
[TRACE] File [/home/jenkins/jenkins-slave/workspace/PreCommit-OOZIE-Build/test-patch/tmp/FINDBUGS_DIFF/diff/findbugs-diff-0.1.0-all.jar] removed
[TRACE] File [/home/jenkins/jenkins-slave/workspace/PreCommit-OOZIE-Build/test-patch/tmp/FINDBUGS_DIFF/diff/findbugs-diff-0.1.0-all.jar.md5sum] removed
  Running test-patch task BACKWARDS_COMPATIBILITY
  Running test-patch task TESTS
  Running test-patch task DISTRO


Testing JIRA OOZIE-3168

Cleaning local git workspace

----------------------------

+1 PATCH_APPLIES
+1 CLEAN
-1 RAW_PATCH_ANALYSIS
    +1 the patch does not introduce any @author tags
    +1 the patch does not introduce any tabs
    +1 the patch does not introduce any trailing spaces
    +1 the patch does not introduce any line longer than 132
    -1 the patch does not add/modify any testcase
+1 RAT
    +1 the patch does not seem to introduce new RAT warnings
+1 JAVADOC
    +1 the patch does not seem to introduce new Javadoc warnings
    WARNING: the current HEAD has 100 Javadoc warning(s)
+1 COMPILE
    +1 HEAD compiles
    +1 patch compiles
    +1 the patch does not seem to introduce new javac warnings
+1 There are no new bugs found in total.
 +1 There are no new bugs found in [docs].
 +1 There are no new bugs found in [sharelib/distcp].
 +1 There are no new bugs found in [sharelib/hive].
 +1 There are no new bugs found in [sharelib/spark].
 +1 There are no new bugs found in [sharelib/hive2].
 +1 There are no new bugs found in [sharelib/hcatalog].
 +1 There are no new bugs found in [sharelib/streaming].
 +1 There are no new bugs found in [sharelib/pig].
 +1 There are no new bugs found in [sharelib/sqoop].
 +1 There are no new bugs found in [sharelib/oozie].
 +1 There are no new bugs found in [examples].
 +1 There are no new bugs found in [client].
 +1 There are no new bugs found in [core].
 +1 There are no new bugs found in [tools].
 +1 There are no new bugs found in [server].
+1 BACKWARDS_COMPATIBILITY
    +1 the patch does not change any JPA Entity/Colum/Basic/Lob/Transient annotations
    +1 the patch does not modify JPA files
-1 TESTS
    Tests run: 2088
    Tests failed: 3
    Tests errors: 1

    The patch failed the following testcases:

testPartitionDependency(org.apache.oozie.service.TestPartitionDependencyManagerService)
testCoordActionRecoveryServiceForWaitingRegisterPartition(org.apache.oozie.service.TestRecoveryService)
testPartitionDependency(org.apache.oozie.service.TestPartitionDependencyManagerEhcache)

    Tests failing with errors:
testConnectionRetry(org.apache.oozie.service.TestJMSAccessorService)

    Tests failed at first run:
TestJavaActionExecutor#testCredentialsSkip
    For the complete list of flaky tests, see TEST-SUMMARY-FULL files.
+1 DISTRO
    +1 distro tarball builds with the patch 

----------------------------
-1 Overall result, please check the reported -1(s)

 There is at least one warning, please check

The full output of the test-patch run is available at

 https://builds.apache.org/job/PreCommit-OOZIE-Build/360/

Adding comment to JIRA
  % Total    % Received % Xferd  Average Speed   Time    Time     Time  Current
                                 Dload  Upload   Total   Spent    Left  Speed
  0     0    0     0    0     0      0      0 --:--:-- --:--:-- --:--:--     0  0     0    0     0    0     0      0      0 --:--:-- --:--:-- --:--:--     0{"self":"https://issues.apache.org/jira/rest/api/2/issue/13133337/comment/16344933","id":"16344933","author":{"self":"https://issues.apache.org/jira/rest/api/2/user?username=hadoopqa","name":"hadoopqa","key":"hadoopqa","emailAddress":"blackhole at hadoop dot apache dot org","avatarUrls":{"48x48":"https://issues.apache.org/jira/secure/useravatar?ownerId=hadoopqa&avatarId=10393","24x24":"https://issues.apache.org/jira/secure/useravatar?size=small&ownerId=hadoopqa&avatarId=10393","16x16":"https://issues.apache.org/jira/secure/useravatar?size=xsmall&ownerId=hadoopqa&avatarId=10393","32x32":"https://issues.apache.org/jira/secure/useravatar?size=medium&ownerId=hadoopqa&avatarId=10393"},"displayName":"Hadoop QA","active":true,"timeZone":"Etc/UTC"},"body":"\nTesting JIRA OOZIE-3168\n\nCleaning local git workspace\n\n----------------------------\n\n{color:green}+1 PATCH_APPLIES{color}\n{color:green}+1 CLEAN{color}\n{color:red}-1 RAW_PATCH_ANALYSIS{color}\n.    {color:green}+1{color} the patch does not introduce any @author tags\n.    {color:green}+1{color} the patch does not introduce any tabs\n.    {color:green}+1{color} the patch does not introduce any trailing spaces\n.    {color:green}+1{color} the patch does not introduce any line longer than 132\n.    {color:red}-1{color} the patch does not add/modify any testcase\n{color:green}+1 RAT{color}\n.    {color:green}+1{color} the patch does not seem to introduce new RAT warnings\n{color:green}+1 JAVADOC{color}\n.    {color:green}+1{color} the patch does not seem to introduce new Javadoc warnings\n.    {color:red}WARNING{color}: the current HEAD has 100 Javadoc warning(s)\n{color:green}+1 COMPILE{color}\n.    {color:green}+1{color} HEAD compiles\n.    {color:green}+1{color} patch compiles\n.    {color:green}+1{color} the patch does not seem to introduce new javac warnings\n{color:green}+1{color} There are no new bugs found in total.\n. {color:green}+1{color} There are no new bugs found in [docs].\n. {color:green}+1{color} There are no new bugs found in [sharelib/distcp].\n. {color:green}+1{color} There are no new bugs found in [sharelib/hive].\n. {color:green}+1{color} There are no new bugs found in [sharelib/spark].\n. {color:green}+1{color} There are no new bugs found in [sharelib/hive2].\n. {color:green}+1{color} There are no new bugs found in [sharelib/hcatalog].\n. {color:green}+1{color} There are no new bugs found in [sharelib/streaming].\n. {color:green}+1{color} There are no new bugs found in [sharelib/pig].\n. {color:green}+1{color} There are no new bugs found in [sharelib/sqoop].\n. {color:green}+1{color} There are no new bugs found in [sharelib/oozie].\n. {color:green}+1{color} There are no new bugs found in [examples].\n. {color:green}+1{color} There are no new bugs found in [client].\n. {color:green}+1{color} There are no new bugs found in [core].\n. {color:green}+1{color} There are no new bugs found in [tools].\n. {color:green}+1{color} There are no new bugs found in [server].\n{color:green}+1 BACKWARDS_COMPATIBILITY{color}\n.    {color:green}+1{color} the patch does not change any JPA Entity/Colum/Basic/Lob/Transient annotations\n.    {color:green}+1{color} the patch does not modify JPA files\n{color:red}-1 TESTS{color}\n.    Tests run: 2088\n.    Tests failed: 3\n.    Tests errors: 1\n\n.    The patch failed the following testcases:\n\ntestPartitionDependency(org.apache.oozie.service.TestPartitionDependencyManagerService)\ntestCoordActionRecoveryServiceForWaitingRegisterPartition(org.apache.oozie.service.TestRecoveryService)\ntestPartitionDependency(org.apache.oozie.service.TestPartitionDependencyManagerEhcache)\n\n.    Tests failing with errors:\ntestConnectionRetry(org.apache.oozie.service.TestJMSAccessorService)\n\n.    {color:orange}Tests failed at first run:{color}\nTestJavaActionExecutor#testCredentialsSkip\n.    For the complete list of flaky tests, see TEST-SUMMARY-FULL files.\n{color:green}+1 DISTRO{color}\n.    {color:green}+1{color} distro tarball builds with the patch \n\n----------------------------\n{color:red}*-1 Overall result, please check the repo100  8602    0  5045  100  3557   6275   4424 --:--:-- --:--:-- --:--:--  6274
rted -1(s)*{color}\n\n{color:red}. There is at least one warning, please check{color}\n\nThe full output of the test-patch run is available at\n\n. https://builds.apache.org/job/PreCommit-OOZIE-Build/360/\n\n","updateAuthor":{"self":"https://issues.apache.org/jira/rest/api/2/user?username=hadoopqa","name":"hadoopqa","key":"hadoopqa","emailAddress":"blackhole at hadoop dot apache dot org","avatarUrls":{"48x48":"https://issues.apache.org/jira/secure/useravatar?ownerId=hadoopqa&avatarId=10393","24x24":"https://issues.apache.org/jira/secure/useravatar?size=small&ownerId=hadoopqa&avatarId=10393","16x16":"https://issues.apache.org/jira/secure/useravatar?size=xsmall&ownerId=hadoopqa&avatarId=10393","32x32":"https://issues.apache.org/jira/secure/useravatar?size=medium&ownerId=hadoopqa&avatarId=10393"},"displayName":"Hadoop QA","active":true,"timeZone":"Etc/UTC"},"created":"2018-01-30T11:44:54.428+0000","updated":"2018-01-30T11:44:54.428+0000"}
test-patch exit code: 1

Build step 'Execute shell' marked build as failure
[description-setter] Description set: OOZIE-3168
Archiving artifacts
[Fast Archiver] Compressed 2.29 MB of artifacts by 49.2% relative to #346
Recording test results
Email was triggered for: Failure - Any
Sending email for trigger: Failure - Any



###################################################################################
############################## FAILED TESTS (if any) ##############################
4 tests failed.
FAILED:  org.apache.oozie.service.TestPartitionDependencyManagerService.testPartitionDependency

Error Message:
null

Stack Trace:
junit.framework.AssertionFailedError
	at org.apache.oozie.service.TestPartitionDependencyManagerService.testPartitionDependency(TestPartitionDependencyManagerService.java:95)


FAILED:  org.apache.oozie.service.TestJMSAccessorService.testConnectionRetry

Error Message:
null

Stack Trace:
junit.framework.AssertionFailedError
	at org.apache.oozie.service.TestJMSAccessorService.testConnectionRetry(TestJMSAccessorService.java:183)


FAILED:  org.apache.oozie.service.TestPartitionDependencyManagerEhcache.testPartitionDependency

Error Message:
null

Stack Trace:
junit.framework.AssertionFailedError
	at org.apache.oozie.service.TestPartitionDependencyManagerEhcache.testPartitionDependency(TestPartitionDependencyManagerEhcache.java:47)


FAILED:  org.apache.oozie.service.TestRecoveryService.testCoordActionRecoveryServiceForWaitingRegisterPartition

Error Message:
null

Stack Trace:
junit.framework.AssertionFailedError
	at org.apache.oozie.service.TestRecoveryService.testCoordActionRecoveryServiceForWaitingRegisterPartition(TestRecoveryService.java:505)

Failed: OOZIE-3168 PreCommit Build #359

Posted by Apache Jenkins Server <je...@builds.apache.org>.
Jira: https://issues.apache.org/jira/browse/OOZIE-3168
Build: https://builds.apache.org/job/PreCommit-OOZIE-Build/359/

###################################################################################
########################## LAST 100 LINES OF THE CONSOLE ###########################
[...truncated 1.60 MB...]
    +1 the patch does not introduce any trailing spaces
    +1 the patch does not introduce any line longer than 132
    -1 the patch does not add/modify any testcase
+1 RAT
    +1 the patch does not seem to introduce new RAT warnings
+1 JAVADOC
    +1 the patch does not seem to introduce new Javadoc warnings
    WARNING: the current HEAD has 100 Javadoc warning(s)
+1 COMPILE
    +1 HEAD compiles
    +1 patch compiles
    +1 the patch does not seem to introduce new javac warnings
+1 There are no new bugs found in total.
 +1 There are no new bugs found in [core].
 +1 There are no new bugs found in [server].
 +1 There are no new bugs found in [client].
 +1 There are no new bugs found in [docs].
 +1 There are no new bugs found in [examples].
 +1 There are no new bugs found in [sharelib/hive].
 +1 There are no new bugs found in [sharelib/pig].
 +1 There are no new bugs found in [sharelib/distcp].
 +1 There are no new bugs found in [sharelib/streaming].
 +1 There are no new bugs found in [sharelib/spark].
 +1 There are no new bugs found in [sharelib/hcatalog].
 +1 There are no new bugs found in [sharelib/sqoop].
 +1 There are no new bugs found in [sharelib/hive2].
 +1 There are no new bugs found in [sharelib/oozie].
 +1 There are no new bugs found in [tools].
+1 BACKWARDS_COMPATIBILITY
    +1 the patch does not change any JPA Entity/Colum/Basic/Lob/Transient annotations
    +1 the patch does not modify JPA files
-1 TESTS
    Tests run: 2088
    Tests failed: 17
    Tests errors: 12

    The patch failed the following testcases:

testCoordinatorActionSelectors(org.apache.oozie.jms.TestJMSJobEventListener)
testCoordinatorActionSelectorsNegative(org.apache.oozie.jms.TestJMSJobEventListener)
testWorkflowJobSelectors(org.apache.oozie.jms.TestJMSJobEventListener)
testOnCoordinatorJobSuccessEvent(org.apache.oozie.jms.TestJMSJobEventListener)
testOnWorkflowJobSuspendEvent(org.apache.oozie.jms.TestJMSJobEventListener)
testWorkflowJobSelectorsAnd(org.apache.oozie.jms.TestJMSJobEventListener)
testOnCoordinatorJobFailureEvent(org.apache.oozie.jms.TestJMSJobEventListener)
testConnectionDrop(org.apache.oozie.jms.TestJMSJobEventListener)
testWorkflowJobSelectorsNegative(org.apache.oozie.jms.TestJMSJobEventListener)
testWorkflowJobSelectorsOr(org.apache.oozie.jms.TestJMSJobEventListener)
testOnWorkflowJobSuccessEvent(org.apache.oozie.jms.TestJMSJobEventListener)
testOnCoordinatorActionWaitingEvent(org.apache.oozie.jms.TestJMSJobEventListener)
testOnWorkflowJobFailureEvent(org.apache.oozie.jms.TestJMSJobEventListener)
testOnCoordinatorActionStartEvent(org.apache.oozie.jms.TestJMSJobEventListener)
testOnWorkflowJobStartedEvent(org.apache.oozie.jms.TestJMSJobEventListener)
testPartitionDependency(org.apache.oozie.service.TestPartitionDependencyManagerEhcache)
testCoordActionRecoveryServiceForWaitingRegisterPartition(org.apache.oozie.service.TestRecoveryService)

    Tests failing with errors:
testDropEventTypeMessage(org.apache.oozie.jms.TestHCatMessageHandler)
testCacheUpdateByMessage(org.apache.oozie.jms.TestHCatMessageHandler)
testThreadLocalSession(org.apache.oozie.jms.TestDefaultConnectionContext)
testConnectionRetry(org.apache.oozie.service.TestJMSAccessorService)
testOnSLADurationMetEvent(org.apache.oozie.jms.TestJMSSLAEventListener)
testOnSLAStartMetEvent(org.apache.oozie.jms.TestJMSSLAEventListener)
testSLAJobSelectorsNegative(org.apache.oozie.jms.TestJMSSLAEventListener)
testOnSLAEndMetEvent(org.apache.oozie.jms.TestJMSSLAEventListener)
testOnSLAStartMissEvent(org.apache.oozie.jms.TestJMSSLAEventListener)
testSLAJobSelectors(org.apache.oozie.jms.TestJMSSLAEventListener)
testOnSLAEndMissEvent(org.apache.oozie.jms.TestJMSSLAEventListener)
testOnSLADurationMissEvent(org.apache.oozie.jms.TestJMSSLAEventListener)

    Tests failed at first run:
TestJavaActionExecutor#testCredentialsSkip
    For the complete list of flaky tests, see TEST-SUMMARY-FULL files.
+1 DISTRO
    +1 distro tarball builds with the patch 

----------------------------
-1 Overall result, please check the reported -1(s)

 There is at least one warning, please check

The full output of the test-patch run is available at

 https://builds.apache.org/job/PreCommit-OOZIE-Build/359/

Adding comment to JIRA
  % Total    % Received % Xferd  Average Speed   Time    Time     Time  Current
                                 Dload  Upload   Total   Spent    Left  Speed
  0     0    0     0    0     0      0      0 --:--:-- --:--:-- --:--:--     0  0     0    0     0    0     0      0      0 --:--:-- --:--:-- --:--:--     0{"self":"https://issues.apache.org/jira/rest/api/2/issue/13133337/comment/16344730","id":"16344730","author":{"self":"https://issues.apache.org/jira/rest/api/2/user?username=hadoopqa","name":"hadoopqa","key":"hadoopqa","emailAddress":"blackhole at hadoop dot apache dot org","avatarUrls":{"48x48":"https://issues.apache.org/jira/secure/useravatar?ownerId=hadoopqa&avatarId=10393","24x24":"https://issues.apache.org/jira/secure/useravatar?size=small&ownerId=hadoopqa&avatarId=10393","16x16":"https://issues.apache.org/jira/secure/useravatar?size=xsmall&ownerId=hadoopqa&avatarId=10393","32x32":"https://issues.apache.org/jira/secure/useravatar?size=medium&ownerId=hadoopqa&avatarId=10393"},"displayName":"Hadoop QA","active":true,"timeZone":"Etc/UTC"},"body":"\nTesting JIRA OOZIE-3168\n\nCleaning local git workspace\n\n----------------------------\n\n{color:green}+1 PATCH_APPLIES{color}\n{color:green}+1 CLEAN{color}\n{color:red}-1 RAW_PATCH_ANALYSIS{color}\n.    {color:green}+1{color} the patch does not introduce any @author tags\n.    {color:green}+1{color} the patch does not introduce any tabs\n.    {color:green}+1{color} the patch does not introduce any trailing spaces\n.    {color:green}+1{color} the patch does not introduce any line longer than 132\n.    {color:red}-1{color} the patch does not add/modify any testcase\n{color:green}+1 RAT{color}\n.    {color:green}+1{color} the patch does not seem to introduce new RAT warnings\n{color:green}+1 JAVADOC{color}\n.    {color:green}+1{color} the patch does not seem to introduce new Javadoc warnings\n.    {color:red}WARNING{color}: the current HEAD has 100 Javadoc warning(s)\n{color:green}+1 COMPILE{color}\n.    {color:green}+1{color} HEAD compiles\n.    {color:green}+1{color} patch compiles\n.    {color:green}+1{color} the patch does not seem to introduce new javac warnings\n{color:green}+1{color} There are no new bugs found in total.\n. {color:green}+1{color} There are no new bugs found in [core].\n. {color:green}+1{color} There are no new bugs found in [server].\n. {color:green}+1{color} There are no new bugs found in [client].\n. {color:green}+1{color} There are no new bugs found in [docs].\n. {color:green}+1{color} There are no new bugs found in [examples].\n. {color:green}+1{color} There are no new bugs found in [sharelib/hive].\n. {color:green}+1{color} There are no new bugs found in [sharelib/pig].\n. {color:green}+1{color} There are no new bugs found in [sharelib/distcp].\n. {color:green}+1{color} There are no new bugs found in [sharelib/streaming].\n. {color:green}+1{color} There are no new bugs found in [sharelib/spark].\n. {color:green}+1{color} There are no new bugs found in [sharelib/hcatalog].\n. {color:green}+1{color} There are no new bugs found in [sharelib/sqoop].\n. {color:green}+1{color} There are no new bugs found in [sharelib/hive2].\n. {color:green}+1{color} There are no new bugs found in [sharelib/oozie].\n. {color:green}+1{color} There are no new bugs found in [tools].\n{color:green}+1 BACKWARDS_COMPATIBILITY{color}\n.    {color:green}+1{color} the patch does not change any JPA Entity/Colum/Basic/Lob/Transient annotations\n.    {color:green}+1{color} the patch does not modify JPA files\n{color:red}-1 TESTS{color}\n.    Tests run: 2088\n.    Tests failed: 17\n.    Tests errors: 12\n\n.    The patch failed the following testcases:\n\ntestCoordinatorActionSelectors(org.apache.oozie.jms.TestJMSJobEventListener)\ntestCoordinatorActionSelectorsNegative(org.apache.oozie.jms.TestJMSJobEventListener)\ntestWorkflowJobSelectors(org.apache.oozie.jms.TestJMSJobEventListener)\ntestOnCoordinatorJobSuccessEvent(org.apache.oozie.jms.TestJMSJobEventListener)\ntestOnWorkflowJobSuspendEvent(org.apache.oozie.jms.TestJMSJobEventListener)\ntestWorkflowJobSelectorsAnd(org.apache.oozie.jms.TestJMSJobEventListener)\ntestOnCoordinatorJobFailureEvent(org.apache.oozie.jms.TestJMSJobEventListener)\ntestConnectionDrop(org.apache.oozie.jms.TestJMSJobEventListener)\ntestWorkflowJobSelectorsNegative(org.apache.oozie.jms.TestJMSJobEventListener)\ntestWorkflowJobSelectorsOr(org.apache.oozie.jms100 12322    0  6905  100  5417   8028   6298 --:--:-- --:--:-- --:--:--  8029
.TestJMSJobEventListener)\ntestOnWorkflowJobSuccessEvent(org.apache.oozie.jms.TestJMSJobEventListener)\ntestOnCoordinatorActionWaitingEvent(org.apache.oozie.jms.TestJMSJobEventListener)\ntestOnWorkflowJobFailureEvent(org.apache.oozie.jms.TestJMSJobEventListener)\ntestOnCoordinatorActionStartEvent(org.apache.oozie.jms.TestJMSJobEventListener)\ntestOnWorkflowJobStartedEvent(org.apache.oozie.jms.TestJMSJobEventListener)\ntestPartitionDependency(org.apache.oozie.service.TestPartitionDependencyManagerEhcache)\ntestCoordActionRecoveryServiceForWaitingRegisterPartition(org.apache.oozie.service.TestRecoveryService)\n\n.    Tests failing with errors:\ntestDropEventTypeMessage(org.apache.oozie.jms.TestHCatMessageHandler)\ntestCacheUpdateByMessage(org.apache.oozie.jms.TestHCatMessageHandler)\ntestThreadLocalSession(org.apache.oozie.jms.TestDefaultConnectionContext)\ntestConnectionRetry(org.apache.oozie.service.TestJMSAccessorService)\ntestOnSLADurationMetEvent(org.apache.oozie.jms.TestJMSSLAEventListener)\ntestOnSLAStartMetEvent(org.apache.oozie.jms.TestJMSSLAEventListener)\ntestSLAJobSelectorsNegative(org.apache.oozie.jms.TestJMSSLAEventListener)\ntestOnSLAEndMetEvent(org.apache.oozie.jms.TestJMSSLAEventListener)\ntestOnSLAStartMissEvent(org.apache.oozie.jms.TestJMSSLAEventListener)\ntestSLAJobSelectors(org.apache.oozie.jms.TestJMSSLAEventListener)\ntestOnSLAEndMissEvent(org.apache.oozie.jms.TestJMSSLAEventListener)\ntestOnSLADurationMissEvent(org.apache.oozie.jms.TestJMSSLAEventListener)\n\n.    {color:orange}Tests failed at first run:{color}\nTestJavaActionExecutor#testCredentialsSkip\n.    For the complete list of flaky tests, see TEST-SUMMARY-FULL files.\n{color:green}+1 DISTRO{color}\n.    {color:green}+1{color} distro tarball builds with the patch \n\n----------------------------\n{color:red}*-1 Overall result, please check the reported -1(s)*{color}\n\n{color:red}. There is at least one warning, please check{color}\n\nThe full output of the test-patch run is available at\n\n. https://builds.apache.org/job/PreCommit-OOZIE-Build/359/\n\n","updateAuthor":{"self":"https://issues.apache.org/jira/rest/api/2/user?username=hadoopqa","name":"hadoopqa","key":"hadoopqa","emailAddress":"blackhole at hadoop dot apache dot org","avatarUrls":{"48x48":"https://issues.apache.org/jira/secure/useravatar?ownerId=hadoopqa&avatarId=10393","24x24":"https://issues.apache.org/jira/secure/useravatar?size=small&ownerId=hadoopqa&avatarId=10393","16x16":"https://issues.apache.org/jira/secure/useravatar?size=xsmall&ownerId=hadoopqa&avatarId=10393","32x32":"https://issues.apache.org/jira/secure/useravatar?size=medium&ownerId=hadoopqa&avatarId=10393"},"displayName":"Hadoop QA","active":true,"timeZone":"Etc/UTC"},"created":"2018-01-30T09:22:31.511+0000","updated":"2018-01-30T09:22:31.511+0000"}
test-patch exit code: 1

Build step 'Execute shell' marked build as failure
[description-setter] Description set: OOZIE-3168
Archiving artifacts
[Fast Archiver] Compressed 2.29 MB of artifacts by 49.1% relative to #346
Recording test results
Email was triggered for: Failure - Any
Sending email for trigger: Failure - Any



###################################################################################
############################## FAILED TESTS (if any) ##############################
29 tests failed.
FAILED:  org.apache.oozie.jms.TestDefaultConnectionContext.testThreadLocalSession

Error Message:
null

Stack Trace:
java.lang.NullPointerException
	at org.apache.oozie.jms.TestDefaultConnectionContext.testThreadLocalSession(TestDefaultConnectionContext.java:74)


FAILED:  org.apache.oozie.jms.TestHCatMessageHandler.testDropEventTypeMessage

Error Message:
Could not create Transport. Reason: javax.management.InstanceAlreadyExistsException: org.apache.activemq:type=Broker,brokerName=localhost

Stack Trace:
javax.jms.JMSException: Could not create Transport. Reason: javax.management.InstanceAlreadyExistsException: org.apache.activemq:type=Broker,brokerName=localhost
	at org.apache.oozie.jms.TestHCatMessageHandler.setUp(TestHCatMessageHandler.java:70)
Caused by: javax.management.InstanceAlreadyExistsException: org.apache.activemq:type=Broker,brokerName=localhost
	at org.apache.oozie.jms.TestHCatMessageHandler.setUp(TestHCatMessageHandler.java:70)


FAILED:  org.apache.oozie.jms.TestHCatMessageHandler.testCacheUpdateByMessage

Error Message:
Could not create Transport. Reason: javax.management.InstanceAlreadyExistsException: org.apache.activemq:type=Broker,brokerName=localhost

Stack Trace:
javax.jms.JMSException: Could not create Transport. Reason: javax.management.InstanceAlreadyExistsException: org.apache.activemq:type=Broker,brokerName=localhost
	at org.apache.oozie.jms.TestHCatMessageHandler.setUp(TestHCatMessageHandler.java:70)
Caused by: javax.management.InstanceAlreadyExistsException: org.apache.activemq:type=Broker,brokerName=localhost
	at org.apache.oozie.jms.TestHCatMessageHandler.setUp(TestHCatMessageHandler.java:70)


FAILED:  org.apache.oozie.jms.TestJMSJobEventListener.testCoordinatorActionSelectors

Error Message:
null

Stack Trace:
junit.framework.AssertionFailedError
	at org.apache.oozie.jms.TestJMSJobEventListener.testCoordinatorActionSelectors(TestJMSJobEventListener.java:544)


FAILED:  org.apache.oozie.jms.TestJMSJobEventListener.testCoordinatorActionSelectorsNegative

Error Message:
null

Stack Trace:
junit.framework.AssertionFailedError
	at org.apache.oozie.jms.TestJMSJobEventListener.testCoordinatorActionSelectorsNegative(TestJMSJobEventListener.java:568)


FAILED:  org.apache.oozie.jms.TestJMSJobEventListener.testWorkflowJobSelectors

Error Message:
null

Stack Trace:
junit.framework.AssertionFailedError
	at org.apache.oozie.jms.TestJMSJobEventListener.testWorkflowJobSelectors(TestJMSJobEventListener.java:239)


FAILED:  org.apache.oozie.jms.TestJMSJobEventListener.testOnCoordinatorJobSuccessEvent

Error Message:
null

Stack Trace:
junit.framework.AssertionFailedError
	at org.apache.oozie.jms.TestJMSJobEventListener.testOnCoordinatorJobSuccessEvent(TestJMSJobEventListener.java:477)


FAILED:  org.apache.oozie.jms.TestJMSJobEventListener.testOnWorkflowJobSuspendEvent

Error Message:
null

Stack Trace:
junit.framework.AssertionFailedError
	at org.apache.oozie.jms.TestJMSJobEventListener.testOnWorkflowJobSuspendEvent(TestJMSJobEventListener.java:214)


FAILED:  org.apache.oozie.jms.TestJMSJobEventListener.testWorkflowJobSelectorsAnd

Error Message:
null

Stack Trace:
junit.framework.AssertionFailedError
	at org.apache.oozie.jms.TestJMSJobEventListener.testWorkflowJobSelectorsAnd(TestJMSJobEventListener.java:316)


FAILED:  org.apache.oozie.jms.TestJMSJobEventListener.testOnCoordinatorJobFailureEvent

Error Message:
null

Stack Trace:
junit.framework.AssertionFailedError
	at org.apache.oozie.jms.TestJMSJobEventListener.testOnCoordinatorJobFailureEvent(TestJMSJobEventListener.java:517)


FAILED:  org.apache.oozie.jms.TestJMSJobEventListener.testConnectionDrop

Error Message:
org.apache.activemq:type=Broker,brokerName=localhost

Stack Trace:
junit.framework.AssertionFailedError: org.apache.activemq:type=Broker,brokerName=localhost
	at org.apache.oozie.jms.TestJMSJobEventListener.testConnectionDrop(TestJMSJobEventListener.java:365)


FAILED:  org.apache.oozie.jms.TestJMSJobEventListener.testWorkflowJobSelectorsNegative

Error Message:
null

Stack Trace:
junit.framework.AssertionFailedError
	at org.apache.oozie.jms.TestJMSJobEventListener.testWorkflowJobSelectorsNegative(TestJMSJobEventListener.java:262)


FAILED:  org.apache.oozie.jms.TestJMSJobEventListener.testWorkflowJobSelectorsOr

Error Message:
null

Stack Trace:
junit.framework.AssertionFailedError
	at org.apache.oozie.jms.TestJMSJobEventListener.testWorkflowJobSelectorsOr(TestJMSJobEventListener.java:289)


FAILED:  org.apache.oozie.jms.TestJMSJobEventListener.testOnWorkflowJobSuccessEvent

Error Message:
null

Stack Trace:
junit.framework.AssertionFailedError
	at org.apache.oozie.jms.TestJMSJobEventListener.testOnWorkflowJobSuccessEvent(TestJMSJobEventListener.java:143)


FAILED:  org.apache.oozie.jms.TestJMSJobEventListener.testOnCoordinatorActionWaitingEvent

Error Message:
null

Stack Trace:
junit.framework.AssertionFailedError
	at org.apache.oozie.jms.TestJMSJobEventListener.testOnCoordinatorActionWaitingEvent(TestJMSJobEventListener.java:403)


FAILED:  org.apache.oozie.jms.TestJMSJobEventListener.testOnWorkflowJobFailureEvent

Error Message:
null

Stack Trace:
junit.framework.AssertionFailedError
	at org.apache.oozie.jms.TestJMSJobEventListener.testOnWorkflowJobFailureEvent(TestJMSJobEventListener.java:180)


FAILED:  org.apache.oozie.jms.TestJMSJobEventListener.testOnCoordinatorActionStartEvent

Error Message:
null

Stack Trace:
junit.framework.AssertionFailedError
	at org.apache.oozie.jms.TestJMSJobEventListener.testOnCoordinatorActionStartEvent(TestJMSJobEventListener.java:439)


FAILED:  org.apache.oozie.jms.TestJMSJobEventListener.testOnWorkflowJobStartedEvent

Error Message:
null

Stack Trace:
junit.framework.AssertionFailedError
	at org.apache.oozie.jms.TestJMSJobEventListener.testOnWorkflowJobStartedEvent(TestJMSJobEventListener.java:108)


FAILED:  org.apache.oozie.jms.TestJMSSLAEventListener.testOnSLADurationMetEvent

Error Message:
null

Stack Trace:
java.lang.NullPointerException
	at org.apache.oozie.jms.TestJMSSLAEventListener.testOnSLADurationMetEvent(TestJMSSLAEventListener.java:382)


FAILED:  org.apache.oozie.jms.TestJMSSLAEventListener.testOnSLAStartMetEvent

Error Message:
null

Stack Trace:
java.lang.NullPointerException
	at org.apache.oozie.jms.TestJMSSLAEventListener.testOnSLAStartMetEvent(TestJMSSLAEventListener.java:292)


FAILED:  org.apache.oozie.jms.TestJMSSLAEventListener.testSLAJobSelectorsNegative

Error Message:
null

Stack Trace:
java.lang.NullPointerException
	at org.apache.oozie.jms.TestJMSSLAEventListener.testSLAJobSelectorsNegative(TestJMSSLAEventListener.java:261)


FAILED:  org.apache.oozie.jms.TestJMSSLAEventListener.testOnSLAEndMetEvent

Error Message:
null

Stack Trace:
java.lang.NullPointerException
	at org.apache.oozie.jms.TestJMSSLAEventListener.testOnSLAEndMetEvent(TestJMSSLAEventListener.java:332)


FAILED:  org.apache.oozie.jms.TestJMSSLAEventListener.testOnSLAStartMissEvent

Error Message:
null

Stack Trace:
java.lang.NullPointerException
	at org.apache.oozie.jms.TestJMSSLAEventListener.testOnSLAStartMissEvent(TestJMSSLAEventListener.java:103)


FAILED:  org.apache.oozie.jms.TestJMSSLAEventListener.testSLAJobSelectors

Error Message:
null

Stack Trace:
java.lang.NullPointerException
	at org.apache.oozie.jms.TestJMSSLAEventListener.testSLAJobSelectors(TestJMSSLAEventListener.java:231)


FAILED:  org.apache.oozie.jms.TestJMSSLAEventListener.testOnSLAEndMissEvent

Error Message:
null

Stack Trace:
java.lang.NullPointerException
	at org.apache.oozie.jms.TestJMSSLAEventListener.testOnSLAEndMissEvent(TestJMSSLAEventListener.java:143)


FAILED:  org.apache.oozie.jms.TestJMSSLAEventListener.testOnSLADurationMissEvent

Error Message:
null

Stack Trace:
java.lang.NullPointerException
	at org.apache.oozie.jms.TestJMSSLAEventListener.testOnSLADurationMissEvent(TestJMSSLAEventListener.java:191)


FAILED:  org.apache.oozie.service.TestJMSAccessorService.testConnectionRetry

Error Message:
null

Stack Trace:
junit.framework.AssertionFailedError
	at org.apache.oozie.service.TestJMSAccessorService.testConnectionRetry(TestJMSAccessorService.java:183)


FAILED:  org.apache.oozie.service.TestPartitionDependencyManagerEhcache.testPartitionDependency

Error Message:
null

Stack Trace:
junit.framework.AssertionFailedError
	at org.apache.oozie.service.TestPartitionDependencyManagerEhcache.testPartitionDependency(TestPartitionDependencyManagerEhcache.java:47)


FAILED:  org.apache.oozie.service.TestRecoveryService.testCoordActionRecoveryServiceForWaitingRegisterPartition

Error Message:
null

Stack Trace:
junit.framework.AssertionFailedError
	at org.apache.oozie.service.TestRecoveryService.testCoordActionRecoveryServiceForWaitingRegisterPartition(TestRecoveryService.java:505)