You are viewing a plain text version of this content. The canonical link for it is here.
Posted to issues-all@impala.apache.org by "Surya Hebbar (Jira)" <ji...@apache.org> on 2025/12/09 08:57:00 UTC
[jira] [Comment Edited] (IMPALA-14613) TestCreatingPaimonTable.test_paimon_query failing
[ https://issues.apache.org/jira/browse/IMPALA-14613?page=com.atlassian.jira.plugin.system.issuetabpanels:comment-tabpanel&focusedCommentId=18043796#comment-18043796 ]
Surya Hebbar edited comment on IMPALA-14613 at 12/9/25 8:56 AM:
----------------------------------------------------------------
Hello, assigning to [~boroknagyz] as the reviewer and as the build failure is in internal jenkins, the failure was caused from IMPALA-14092 change by [~jichen0919]. Please feel free to reassign to [~jichen0919].
was (Author: JIRAUSER299620):
Hello, assigning to [~boroknagyz]] as the reviewer and as the build failure is in internal jenkins, the failure was caused from IMPALA-14092 change by [~jichen0919]. Please feel free to reassign to [~jichen0919].
> TestCreatingPaimonTable.test_paimon_query failing
> -------------------------------------------------
>
> Key: IMPALA-14613
> URL: https://issues.apache.org/jira/browse/IMPALA-14613
> Project: IMPALA
> Issue Type: Bug
> Reporter: Surya Hebbar
> Assignee: Zoltán Borók-Nagy
> Priority: Major
>
> h3. Error Message
> {code}
> query_test/test_paimon.py:57: in test_paimon_query self.run_test_case('QueryTest/paimon-query', common/impala_test_suite.py:891: in run_test_case result = exec_fn(query, user=test_section.get('USER', '').strip() or None) common/impala_test_suite.py:821: in __exec_in_impala result = self.__execute_query(target_impalad_client, query, user=user) common/impala_test_suite.py:1299: in __execute_query return impalad_client.execute(query, user=user) common/impala_connection.py:687: in execute cursor.execute(sql_stmt, configuration=self.__query_options) /data/jenkins/workspace/impala-asf-master-core-asan-arm/repos/Impala/infra/python/env-gcc10.4.0-py3/lib/python3.8/site-packages/impala/hiveserver2.py:394: in execute self._wait_to_finish() # make execute synchronous /data/jenkins/workspace/impala-asf-master-core-asan-arm/repos/Impala/infra/python/env-gcc10.4.0-py3/lib/python3.8/site-packages/impala/hiveserver2.py:484: in _wait_to_finish raise OperationalError(resp.errorMessage) E impala.error.OperationalError: Query b24714fa6c5cbdbf:36eafde100000000 failed: E IllegalStateException: error loading native libraries: java.io.FileNotFoundException: aarch_64/libarrow_cdata_jni.so
> {code}
> h3. Stacktrace
> {code}
> query_test/test_paimon.py:57: in test_paimon_query
> self.run_test_case('QueryTest/paimon-query',
> common/impala_test_suite.py:891: in run_test_case
> result = exec_fn(query, user=test_section.get('USER', '').strip() or None)
> common/impala_test_suite.py:821: in __exec_in_impala
> result = self.__execute_query(target_impalad_client, query, user=user)
> common/impala_test_suite.py:1299: in __execute_query
> return impalad_client.execute(query, user=user)
> common/impala_connection.py:687: in execute
> cursor.execute(sql_stmt, configuration=self.__query_options)
> /data/jenkins/workspace/impala-asf-master-core-asan-arm/repos/Impala/infra/python/env-gcc10.4.0-py3/lib/python3.8/site-packages/impala/hiveserver2.py:394: in execute
> self._wait_to_finish() # make execute synchronous
> /data/jenkins/workspace/impala-asf-master-core-asan-arm/repos/Impala/infra/python/env-gcc10.4.0-py3/lib/python3.8/site-packages/impala/hiveserver2.py:484: in _wait_to_finish
> raise OperationalError(resp.errorMessage)
> E impala.error.OperationalError: Query b24714fa6c5cbdbf:36eafde100000000 failed:
> E IllegalStateException: error loading native libraries: java.io.FileNotFoundException: aarch_64/libarrow_cdata_jni.so
> {code}
--
This message was sent by Atlassian Jira
(v8.20.10#820010)
---------------------------------------------------------------------
To unsubscribe, e-mail: issues-all-unsubscribe@impala.apache.org
For additional commands, e-mail: issues-all-help@impala.apache.org