You are viewing a plain text version of this content. The canonical link for it is here.
Posted to issues@tez.apache.org by Apache Jenkins Server <je...@builds.apache.org> on 2015/03/11 21:18:03 UTC

Failed: TEZ-2189 PreCommit Build #280

Jira: https://issues.apache.org/jira/browse/TEZ-2189
Build: https://builds.apache.org/job/PreCommit-TEZ-Build/280/

###################################################################################
########################## LAST 60 LINES OF THE CONSOLE ###########################
[...truncated 2356 lines...]


{color:red}-1 overall{color}.  Here are the results of testing the latest attachment
  http://issues.apache.org/jira/secure/attachment/12704002/TEZ-2189.3.patch
  against master revision 59529ab.

    {color:green}+1 @author{color}.  The patch does not contain any @author tags.

    {color:red}-1 tests included{color}.  The patch doesn't appear to include any new or modified tests.
                        Please justify why no new tests are needed for this patch.
                        Also please list what manual steps were performed to verify this patch.

    {color:green}+1 javac{color}.  The applied patch does not increase the total number of javac compiler warnings.

    {color:green}+1 javadoc{color}.  There were no new javadoc warning messages.

    {color:green}+1 findbugs{color}.  The patch does not introduce any new Findbugs (version 2.0.3) warnings.

    {color:green}+1 release audit{color}.  The applied patch does not increase the total number of release audit warnings.

    {color:red}-1 core tests{color}.  The patch failed these unit tests in :
                   org.apache.tez.dag.app.rm.TestTaskSchedulerEventHandler

Test results: https://builds.apache.org/job/PreCommit-TEZ-Build/280//testReport/
Console output: https://builds.apache.org/job/PreCommit-TEZ-Build/280//console

This message is automatically generated.


======================================================================
======================================================================
    Adding comment to Jira.
======================================================================
======================================================================


Comment added.
3163cb75322dc48fac67cff32ada6065e2818600 logged out


======================================================================
======================================================================
    Finished build.
======================================================================
======================================================================


Build step 'Execute shell' marked build as failure
Archiving artifacts
Sending artifact delta relative to PreCommit-TEZ-Build #277
Archived 44 artifacts
Archive block size is 32768
Received 2 blocks and 2632585 bytes
Compression is 2.4%
Took 1.6 sec
[description-setter] Could not determine description.
Recording test results
Email was triggered for: Failure
Sending email for trigger: Failure



###################################################################################
############################## FAILED TESTS (if any) ##############################
1 tests failed.
FAILED:  org.apache.tez.dag.app.rm.TestTaskSchedulerEventHandler.testHistoryUrlConf

Error Message:
null

Stack Trace:
java.lang.AssertionError: null
	at org.junit.Assert.fail(Assert.java:86)
	at org.junit.Assert.assertTrue(Assert.java:41)
	at org.junit.Assert.assertTrue(Assert.java:52)
	at org.apache.tez.dag.app.rm.TestTaskSchedulerEventHandler.testHistoryUrlConf(TestTaskSchedulerEventHandler.java:311)



Success: TEZ-2179 PreCommit Build #281

Posted by Apache Jenkins Server <je...@builds.apache.org>.
Jira: https://issues.apache.org/jira/browse/TEZ-2179
Build: https://builds.apache.org/job/PreCommit-TEZ-Build/281/

###################################################################################
########################## LAST 60 LINES OF THE CONSOLE ###########################
[...truncated 2748 lines...]
[INFO] Final Memory: 70M/959M
[INFO] ------------------------------------------------------------------------




{color:green}+1 overall{color}.  Here are the results of testing the latest attachment
  http://issues.apache.org/jira/secure/attachment/12704031/TEZ-2179.3.patch
  against master revision 59529ab.

    {color:green}+1 @author{color}.  The patch does not contain any @author tags.

    {color:green}+1 tests included{color}.  The patch appears to include 1 new or modified test files.

    {color:green}+1 javac{color}.  The applied patch does not increase the total number of javac compiler warnings.

    {color:green}+1 javadoc{color}.  There were no new javadoc warning messages.

    {color:green}+1 findbugs{color}.  The patch does not introduce any new Findbugs (version 2.0.3) warnings.

    {color:green}+1 release audit{color}.  The applied patch does not increase the total number of release audit warnings.

    {color:green}+1 core tests{color}.  The patch passed unit tests in .

Test results: https://builds.apache.org/job/PreCommit-TEZ-Build/281//testReport/
Console output: https://builds.apache.org/job/PreCommit-TEZ-Build/281//console

This message is automatically generated.


======================================================================
======================================================================
    Adding comment to Jira.
======================================================================
======================================================================


Comment added.
b071ceda71356090e1527660a588906e44ffd2e1 logged out


======================================================================
======================================================================
    Finished build.
======================================================================
======================================================================


Archiving artifacts
Sending artifact delta relative to PreCommit-TEZ-Build #277
Archived 44 artifacts
Archive block size is 32768
Received 6 blocks and 2528694 bytes
Compression is 7.2%
Took 1.1 sec
Description set: TEZ-2179
Recording test results
Email was triggered for: Success
Sending email for trigger: Success



###################################################################################
############################## FAILED TESTS (if any) ##############################
All tests passed