You are viewing a plain text version of this content. The canonical link for it is here.
Posted to builds@beam.apache.org by Apache Jenkins Server <je...@builds.apache.org> on 2023/05/05 18:42:37 UTC

beam_PostCommit_Python_Examples_Flink - Build # 1803 - Aborted!

beam_PostCommit_Python_Examples_Flink - Build # 1803 - Aborted:

Check console output at https://ci-beam.apache.org/job/beam_PostCommit_Python_Examples_Flink/1803/ to view the results.

Jenkins build is back to normal : beam_PostCommit_Python_Examples_Flink #1806

Posted by Apache Jenkins Server <je...@builds.apache.org>.
See <https://ci-beam.apache.org/job/beam_PostCommit_Python_Examples_Flink/1806/display/redirect>


---------------------------------------------------------------------
To unsubscribe, e-mail: builds-unsubscribe@beam.apache.org
For additional commands, e-mail: builds-help@beam.apache.org


Build failed in Jenkins: beam_PostCommit_Python_Examples_Flink #1805

Posted by Apache Jenkins Server <je...@builds.apache.org>.
See <https://ci-beam.apache.org/job/beam_PostCommit_Python_Examples_Flink/1805/display/redirect>

Changes:


------------------------------------------
[...truncated 50.65 MB...]
../../build/gradleenv/2022703441/lib/python3.7/site-packages/hdfs/config.py:15
  <https://ci-beam.apache.org/job/beam_PostCommit_Python_Examples_Flink/ws/src/build/gradleenv/2022703441/lib/python3.7/site-packages/hdfs/config.py>:15: DeprecationWarning: the imp module is deprecated in favour of importlib; see the module's documentation for alternative uses
    from imp import load_source

../../build/gradleenv/2022703441/lib/python3.7/site-packages/pkg_resources/__init__.py:121
  <https://ci-beam.apache.org/job/beam_PostCommit_Python_Examples_Flink/ws/src/build/gradleenv/2022703441/lib/python3.7/site-packages/pkg_resources/__init__.py>:121: DeprecationWarning: pkg_resources is deprecated as an API
    warnings.warn("pkg_resources is deprecated as an API", DeprecationWarning)

../../build/gradleenv/2022703441/lib/python3.7/site-packages/pkg_resources/__init__.py:2870: 18 warnings
  <https://ci-beam.apache.org/job/beam_PostCommit_Python_Examples_Flink/ws/src/build/gradleenv/2022703441/lib/python3.7/site-packages/pkg_resources/__init__.py>:2870: DeprecationWarning: Deprecated call to `pkg_resources.declare_namespace('google')`.
  Implementing implicit namespace packages (as specified in PEP 420) is preferred to `pkg_resources.declare_namespace`. See https://setuptools.pypa.io/en/latest/references/keywords.html#keyword-namespace-packages
    declare_namespace(pkg)

../../build/gradleenv/2022703441/lib/python3.7/site-packages/pkg_resources/__init__.py:2870: 13 warnings
  <https://ci-beam.apache.org/job/beam_PostCommit_Python_Examples_Flink/ws/src/build/gradleenv/2022703441/lib/python3.7/site-packages/pkg_resources/__init__.py>:2870: DeprecationWarning: Deprecated call to `pkg_resources.declare_namespace('google.cloud')`.
  Implementing implicit namespace packages (as specified in PEP 420) is preferred to `pkg_resources.declare_namespace`. See https://setuptools.pypa.io/en/latest/references/keywords.html#keyword-namespace-packages
    declare_namespace(pkg)

../../build/gradleenv/2022703441/lib/python3.7/site-packages/pkg_resources/__init__.py:2349
../../build/gradleenv/2022703441/lib/python3.7/site-packages/pkg_resources/__init__.py:2349
../../build/gradleenv/2022703441/lib/python3.7/site-packages/pkg_resources/__init__.py:2349
../../build/gradleenv/2022703441/lib/python3.7/site-packages/pkg_resources/__init__.py:2349
  <https://ci-beam.apache.org/job/beam_PostCommit_Python_Examples_Flink/ws/src/build/gradleenv/2022703441/lib/python3.7/site-packages/pkg_resources/__init__.py>:2349: DeprecationWarning: Deprecated call to `pkg_resources.declare_namespace('google')`.
  Implementing implicit namespace packages (as specified in PEP 420) is preferred to `pkg_resources.declare_namespace`. See https://setuptools.pypa.io/en/latest/references/keywords.html#keyword-namespace-packages
    declare_namespace(parent)

../../build/gradleenv/2022703441/lib/python3.7/site-packages/pkg_resources/__init__.py:2870
  <https://ci-beam.apache.org/job/beam_PostCommit_Python_Examples_Flink/ws/src/build/gradleenv/2022703441/lib/python3.7/site-packages/pkg_resources/__init__.py>:2870: DeprecationWarning: Deprecated call to `pkg_resources.declare_namespace('google.logging')`.
  Implementing implicit namespace packages (as specified in PEP 420) is preferred to `pkg_resources.declare_namespace`. See https://setuptools.pypa.io/en/latest/references/keywords.html#keyword-namespace-packages
    declare_namespace(pkg)

../../build/gradleenv/2022703441/lib/python3.7/site-packages/pkg_resources/__init__.py:2870
  <https://ci-beam.apache.org/job/beam_PostCommit_Python_Examples_Flink/ws/src/build/gradleenv/2022703441/lib/python3.7/site-packages/pkg_resources/__init__.py>:2870: DeprecationWarning: Deprecated call to `pkg_resources.declare_namespace('google.iam')`.
  Implementing implicit namespace packages (as specified in PEP 420) is preferred to `pkg_resources.declare_namespace`. See https://setuptools.pypa.io/en/latest/references/keywords.html#keyword-namespace-packages
    declare_namespace(pkg)

../../build/gradleenv/2022703441/lib/python3.7/site-packages/google/rpc/__init__.py:20
  <https://ci-beam.apache.org/job/beam_PostCommit_Python_Examples_Flink/ws/src/build/gradleenv/2022703441/lib/python3.7/site-packages/google/rpc/__init__.py>:20: DeprecationWarning: Deprecated call to `pkg_resources.declare_namespace('google.rpc')`.
  Implementing implicit namespace packages (as specified in PEP 420) is preferred to `pkg_resources.declare_namespace`. See https://setuptools.pypa.io/en/latest/references/keywords.html#keyword-namespace-packages
    pkg_resources.declare_namespace(__name__)

apache_beam/examples/complete/game/hourly_team_score_it_test.py::HourlyTeamScoreIT::test_hourly_team_score_output_checksum_on_small_input
  <https://ci-beam.apache.org/job/beam_PostCommit_Python_Examples_Flink/ws/src/sdks/python/apache_beam/io/gcp/tests/utils.py>:63: PendingDeprecationWarning: Client.dataset is deprecated and will be removed in a future version. Use a string like 'my_project.my_dataset' or a cloud.google.bigquery.DatasetReference object, instead.
    dataset_ref = client.dataset(unique_dataset_name, project=project)

apache_beam/examples/complete/game/hourly_team_score_it_test.py::HourlyTeamScoreIT::test_hourly_team_score_output_checksum_on_small_input
apache_beam/examples/cookbook/bigquery_tornadoes_it_test.py::BigqueryTornadoesIT::test_bigquery_tornadoes_it
apache_beam/examples/cookbook/filters_test.py::FiltersTest::test_filters_output_bigquery_matcher
  <https://ci-beam.apache.org/job/beam_PostCommit_Python_Examples_Flink/ws/src/sdks/python/apache_beam/io/gcp/bigquery.py>:2029: BeamDeprecationWarning: options is deprecated since First stable release. References to <pipeline>.options will not be supported
    is_streaming_pipeline = p.options.view_as(StandardOptions).streaming

apache_beam/examples/complete/game/hourly_team_score_it_test.py::HourlyTeamScoreIT::test_hourly_team_score_output_checksum_on_small_input
apache_beam/examples/cookbook/bigquery_tornadoes_it_test.py::BigqueryTornadoesIT::test_bigquery_tornadoes_it
apache_beam/examples/cookbook/filters_test.py::FiltersTest::test_filters_output_bigquery_matcher
  <https://ci-beam.apache.org/job/beam_PostCommit_Python_Examples_Flink/ws/src/sdks/python/apache_beam/io/gcp/bigquery.py>:2035: BeamDeprecationWarning: options is deprecated since First stable release. References to <pipeline>.options will not be supported
    experiments = p.options.view_as(DebugOptions).experiments or []

apache_beam/examples/complete/game/hourly_team_score_it_test.py::HourlyTeamScoreIT::test_hourly_team_score_output_checksum_on_small_input
apache_beam/examples/cookbook/bigquery_tornadoes_it_test.py::BigqueryTornadoesIT::test_bigquery_tornadoes_it
apache_beam/examples/cookbook/filters_test.py::FiltersTest::test_filters_output_bigquery_matcher
  <https://ci-beam.apache.org/job/beam_PostCommit_Python_Examples_Flink/ws/src/sdks/python/apache_beam/io/gcp/bigquery_file_loads.py>:1173: BeamDeprecationWarning: options is deprecated since First stable release. References to <pipeline>.options will not be supported
    temp_location = p.options.view_as(GoogleCloudOptions).temp_location

apache_beam/examples/complete/game/hourly_team_score_it_test.py::HourlyTeamScoreIT::test_hourly_team_score_output_checksum_on_small_input
apache_beam/examples/cookbook/bigquery_tornadoes_it_test.py::BigqueryTornadoesIT::test_bigquery_tornadoes_it
apache_beam/examples/cookbook/filters_test.py::FiltersTest::test_filters_output_bigquery_matcher
  <https://ci-beam.apache.org/job/beam_PostCommit_Python_Examples_Flink/ws/src/sdks/python/apache_beam/io/gcp/bigquery_file_loads.py>:1175: BeamDeprecationWarning: options is deprecated since First stable release. References to <pipeline>.options will not be supported
    p.options.view_as(GoogleCloudOptions).job_name or 'AUTOMATIC_JOB_NAME')

apache_beam/examples/cookbook/bigquery_tornadoes_it_test.py::BigqueryTornadoesIT::test_bigquery_tornadoes_it
apache_beam/examples/cookbook/filters_test.py::FiltersTest::test_filters_output_bigquery_matcher
apache_beam/examples/dataframe/flight_delays_it_test.py::FlightDelaysTest::test_flight_delays
  <https://ci-beam.apache.org/job/beam_PostCommit_Python_Examples_Flink/ws/src/sdks/python/apache_beam/io/gcp/bigquery.py>:2665: BeamDeprecationWarning: options is deprecated since First stable release. References to <pipeline>.options will not be supported
    temp_location = pcoll.pipeline.options.view_as(

Exception in thread read_grpc_client_inputs:
Traceback (most recent call last):
  File "/usr/lib/python3.7/threading.py", line 926, in _bootstrap_inner
    self.run()

apache_beam/examples/cookbook/bigquery_tornadoes_it_test.py::BigqueryTornadoesIT::test_bigquery_tornadoes_it
apache_beam/examples/cookbook/filters_test.py::FiltersTest::test_filters_output_bigquery_matcher
apache_beam/examples/dataframe/flight_delays_it_test.py::FlightDelaysTest::test_flight_delays
  File "/usr/lib/python3.7/threading.py", line 870, in run
    self._target(*self._args, **self._kwargs)
  <https://ci-beam.apache.org/job/beam_PostCommit_Python_Examples_Flink/ws/src/sdks/python/apache_beam/io/gcp/bigquery.py>:2667: BeamDeprecationWarning: options is deprecated since First stable release. References to <pipeline>.options will not be supported
    job_name = pcoll.pipeline.options.view_as(GoogleCloudOptions).job_name

apache_beam/examples/cookbook/bigquery_tornadoes_it_test.py::BigqueryTornadoesIT::test_bigquery_tornadoes_it
apache_beam/examples/cookbook/filters_test.py::FiltersTest::test_filters_output_bigquery_matcher
apache_beam/examples/dataframe/flight_delays_it_test.py::FlightDelaysTest::test_flight_delays
  <https://ci-beam.apache.org/job/beam_PostCommit_Python_Examples_Flink/ws/src/sdks/python/apache_beam/io/gcp/bigquery.py>:2698: BeamDeprecationWarning: options is deprecated since First stable release. References to <pipeline>.options will not be supported
    | _PassThroughThenCleanup(files_to_remove_pcoll))

apache_beam/examples/cookbook/bigquery_tornadoes_it_test.py::BigqueryTornadoesIT::test_bigquery_tornadoes_it
apache_beam/examples/cookbook/filters_test.py::FiltersTest::test_filters_output_bigquery_matcher
  File "<https://ci-beam.apache.org/job/beam_PostCommit_Python_Examples_Flink/ws/src/sdks/python/apache_beam/runners/worker/data_plane.py",> line 671, in <lambda>
    target=lambda: self._read_inputs(elements_iterator),
  File "<https://ci-beam.apache.org/job/beam_PostCommit_Python_Examples_Flink/ws/src/sdks/python/apache_beam/runners/worker/data_plane.py",> line 654, in _read_inputs
    for elements in elements_iterator:
  File "<https://ci-beam.apache.org/job/beam_PostCommit_Python_Examples_Flink/ws/src/build/gradleenv/2022703441/lib/python3.7/site-packages/grpc/_channel.py",> line 475, in __next__
    return self._next()
  <https://ci-beam.apache.org/job/beam_PostCommit_Python_Examples_Flink/ws/src/sdks/python/apache_beam/io/gcp/bigquery.py>:2025: BeamDeprecationWarning: options is deprecated since First stable release. References to <pipeline>.options will not be supported
    self.table_reference.projectId = pcoll.pipeline.options.view_as(

apache_beam/examples/cookbook/bigquery_tornadoes_it_test.py::BigqueryTornadoesIT::test_bigquery_tornadoes_it
apache_beam/examples/cookbook/filters_test.py::FiltersTest::test_filters_output_bigquery_matcher
  File "<https://ci-beam.apache.org/job/beam_PostCommit_Python_Examples_Flink/ws/src/build/gradleenv/2022703441/lib/python3.7/site-packages/grpc/_channel.py",> line 881, in _next
    raise self
grpc._channel._MultiThreadedRendezvous: <_MultiThreadedRendezvous of RPC that terminated with:
	status = StatusCode.CANCELLED
	details = "Multiplexer hanging up"
	debug_error_string = "UNKNOWN:Error received from peer ipv6:%5B::1%5D:32837 {grpc_message:"Multiplexer hanging up", grpc_status:1, created_time:"2023-05-06T03:46:53.768201405+00:00"}"
>

Exception in thread read_grpc_client_inputs:
Traceback (most recent call last):
  File "/usr/lib/python3.7/threading.py", line 926, in _bootstrap_inner
    self.run()
  File "/usr/lib/python3.7/threading.py", line 870, in run
    self._target(*self._args, **self._kwargs)
  File "<https://ci-beam.apache.org/job/beam_PostCommit_Python_Examples_Flink/ws/src/sdks/python/apache_beam/runners/worker/data_plane.py",> line 671, in <lambda>
    target=lambda: self._read_inputs(elements_iterator),
  <https://ci-beam.apache.org/job/beam_PostCommit_Python_Examples_Flink/ws/src/sdks/python/apache_beam/io/gcp/bigquery_file_loads.py>:1166: BeamDeprecationWarning: options is deprecated since First stable release. References to <pipeline>.options will not be supported
    self.project = self.project or p.options.view_as(GoogleCloudOptions).project

  File "<https://ci-beam.apache.org/job/beam_PostCommit_Python_Examples_Flink/ws/src/sdks/python/apache_beam/runners/worker/data_plane.py",> line 654, in _read_inputs
    for elements in elements_iterator:
apache_beam/examples/cookbook/bigquery_tornadoes_it_test.py::BigqueryTornadoesIT::test_bigquery_tornadoes_it
apache_beam/examples/cookbook/filters_test.py::FiltersTest::test_filters_output_bigquery_matcher
  File "<https://ci-beam.apache.org/job/beam_PostCommit_Python_Examples_Flink/ws/src/build/gradleenv/2022703441/lib/python3.7/site-packages/grpc/_channel.py",> line 475, in __next__
    return self._next()
  <https://ci-beam.apache.org/job/beam_PostCommit_Python_Examples_Flink/ws/src/sdks/python/apache_beam/io/gcp/tests/utils.py>:100: PendingDeprecationWarning: Client.dataset is deprecated and will be removed in a future version. Use a string like 'my_project.my_dataset' or a cloud.google.bigquery.DatasetReference object, instead.
    table_ref = client.dataset(dataset_id).table(table_id)

apache_beam/examples/dataframe/flight_delays_it_test.py::FlightDelaysTest::test_flight_delays
apache_beam/examples/dataframe/flight_delays_it_test.py::FlightDelaysTest::test_flight_delays
  File "<https://ci-beam.apache.org/job/beam_PostCommit_Python_Examples_Flink/ws/src/build/gradleenv/2022703441/lib/python3.7/site-packages/grpc/_channel.py",> line 881, in _next
    raise self
  <https://ci-beam.apache.org/job/beam_PostCommit_Python_Examples_Flink/ws/src/sdks/python/apache_beam/examples/dataframe/flight_delays.py>:47: FutureWarning: Dropping of nuisance columns in DataFrame reductions (with 'numeric_only=None') is deprecated; in a future version this will raise TypeError.  Select only valid columns before calling the reduction.
    return airline_df[at_top_airports].mean()

apache_beam/examples/dataframe/flight_delays_it_test.py::FlightDelaysTest::test_flight_delays
grpc._channel._MultiThreadedRendezvous: <_MultiThreadedRendezvous of RPC that terminated with:
	status = StatusCode.CANCELLED
	details = "Multiplexer hanging up"
	debug_error_string = "UNKNOWN:Error received from peer ipv6:%5B::1%5D:36081 {grpc_message:"Multiplexer hanging up", grpc_status:1, created_time:"2023-05-06T03:48:41.21921762+00:00"}"
>
apache_beam/examples/dataframe/wordcount_test.py::WordCountTest::test_basics
  <https://ci-beam.apache.org/job/beam_PostCommit_Python_Examples_Flink/ws/src/sdks/python/apache_beam/dataframe/io.py>:664: FutureWarning: WriteToFiles is experimental.
    sink=lambda _: _WriteToPandasFileSink(

apache_beam/examples/dataframe/flight_delays_it_test.py::FlightDelaysTest::test_flight_delays

Exception in thread run_worker_2-1:
Traceback (most recent call last):
  File "/usr/lib/python3.7/threading.py", line 926, in _bootstrap_inner
apache_beam/examples/dataframe/wordcount_test.py::WordCountTest::test_basics
  <https://ci-beam.apache.org/job/beam_PostCommit_Python_Examples_Flink/ws/src/sdks/python/apache_beam/io/fileio.py>:596: BeamDeprecationWarning: options is deprecated since First stable release. References to <pipeline>.options will not be supported
    p.options.view_as(GoogleCloudOptions).temp_location or

-- Docs: https://docs.pytest.org/en/stable/how-to/capture-warnings.html
- generated xml file: <https://ci-beam.apache.org/job/beam_PostCommit_Python_Examples_Flink/ws/src/sdks/python/pytest_postCommitExamples-flink-py37.xml> -
=========================== short test summary info ============================
FAILED apache_beam/examples/complete/game/hourly_team_score_it_test.py::HourlyTeamScoreIT::test_hourly_team_score_output_checksum_on_small_input - RuntimeError: Service failed to start up with error 0
= 1 failed, 17 passed, 10 skipped, 6899 deselected, 74 warnings in 494.17s (0:08:14) =
    self.run()
  File "/usr/lib/python3.7/threading.py", line 870, in run
    self._target(*self._args, **self._kwargs)
  File "<https://ci-beam.apache.org/job/beam_PostCommit_Python_Examples_Flink/ws/src/sdks/python/apache_beam/runners/worker/sdk_worker.py",> line 262, in run
    for work_request in self._control_stub.Control(get_responses()):
  File "<https://ci-beam.apache.org/job/beam_PostCommit_Python_Examples_Flink/ws/src/build/gradleenv/2022703441/lib/python3.7/site-packages/grpc/_channel.py",> line 475, in __next__
    return self._next()
  File "<https://ci-beam.apache.org/job/beam_PostCommit_Python_Examples_Flink/ws/src/build/gradleenv/2022703441/lib/python3.7/site-packages/grpc/_channel.py",> line 881, in _next
    raise self
grpc._channel._MultiThreadedRendezvous: <_MultiThreadedRendezvous of RPC that terminated with:
	status = StatusCode.CANCELLED
	details = "Runner closed connection"
	debug_error_string = "UNKNOWN:Error received from peer ipv6:%5B::1%5D:46761 {created_time:"2023-05-06T03:49:01.519049599+00:00", grpc_status:1, grpc_message:"Runner closed connection"}"
>

Exception in thread read_grpc_client_inputs:
Traceback (most recent call last):
  File "/usr/lib/python3.7/threading.py", line 926, in _bootstrap_inner
    self.run()
  File "/usr/lib/python3.7/threading.py", line 870, in run
    self._target(*self._args, **self._kwargs)
  File "<https://ci-beam.apache.org/job/beam_PostCommit_Python_Examples_Flink/ws/src/sdks/python/apache_beam/runners/worker/data_plane.py",> line 671, in <lambda>
    target=lambda: self._read_inputs(elements_iterator),
  File "<https://ci-beam.apache.org/job/beam_PostCommit_Python_Examples_Flink/ws/src/sdks/python/apache_beam/runners/worker/data_plane.py",> line 654, in _read_inputs
    for elements in elements_iterator:
  File "<https://ci-beam.apache.org/job/beam_PostCommit_Python_Examples_Flink/ws/src/build/gradleenv/2022703441/lib/python3.7/site-packages/grpc/_channel.py",> line 475, in __next__
    return self._next()
  File "<https://ci-beam.apache.org/job/beam_PostCommit_Python_Examples_Flink/ws/src/build/gradleenv/2022703441/lib/python3.7/site-packages/grpc/_channel.py",> line 864, in _next
    raise self
grpc._channel._MultiThreadedRendezvous: <_MultiThreadedRendezvous of RPC that terminated with:
	status = StatusCode.CANCELLED
	details = "Multiplexer hanging up"
	debug_error_string = "UNKNOWN:Error received from peer ipv6:%5B::1%5D:37791 {grpc_message:"Multiplexer hanging up", grpc_status:1, created_time:"2023-05-06T03:49:01.64271737+00:00"}"
>


> Task :sdks:python:test-suites:portable:py37:flinkExamples FAILED

FAILURE: Build failed with an exception.

* Where:
Script '<https://ci-beam.apache.org/job/beam_PostCommit_Python_Examples_Flink/ws/src/sdks/python/test-suites/portable/common.gradle'> line: 245

* What went wrong:
Execution failed for task ':sdks:python:test-suites:portable:py37:flinkExamples'.
> Process 'command 'sh'' finished with non-zero exit value 1

* Try:
> Run with --stacktrace option to get the stack trace.
> Run with --info or --debug option to get more log output.

* Get more help at https://help.gradle.org

Deprecated Gradle features were used in this build, making it incompatible with Gradle 8.0.

You can use '--warning-mode all' to show the individual deprecation warnings and determine if they come from your own scripts or plugins.

See https://docs.gradle.org/7.5.1/userguide/command_line_interface.html#sec:command_line_warnings

BUILD FAILED in 12m 8s
136 actionable tasks: 92 executed, 42 from cache, 2 up-to-date
Build scan background action failed.
java.lang.IllegalArgumentException: com.gradle.enterprise.gradleplugin.internal.extension.a is not an interface
	at java.lang.reflect.Proxy$ProxyClassFactory.apply(Proxy.java:590)
	at java.lang.reflect.Proxy$ProxyClassFactory.apply(Proxy.java:557)
	at java.lang.reflect.WeakCache$Factory.get(WeakCache.java:230)
	at java.lang.reflect.WeakCache.get(WeakCache.java:127)
	at java.lang.reflect.Proxy.getProxyClass0(Proxy.java:419)
	at java.lang.reflect.Proxy.newProxyInstance(Proxy.java:719)
	at com.gradle.ProxyFactory$ProxyingInvocationHandler.createLocalProxy(ProxyFactory.java:66)
	at com.gradle.ProxyFactory$ProxyingInvocationHandler.lambda$adaptActionArg$1(ProxyFactory.java:61)
	at com.gradle.enterprise.gradleplugin.internal.extension.b$3.run(SourceFile:100)
	at java.util.concurrent.Executors$RunnableAdapter.call(Executors.java:511)
	at java.util.concurrent.FutureTask.run(FutureTask.java:266)
	at java.util.concurrent.ThreadPoolExecutor.runWorker(ThreadPoolExecutor.java:1149)
	at java.util.concurrent.ThreadPoolExecutor$Worker.run(ThreadPoolExecutor.java:624)
	at java.lang.Thread.run(Thread.java:750)

Publishing build scan...
https://ge.apache.org/s/r2tvbk5wxpuuw

Build step 'Invoke Gradle script' changed build result to FAILURE
Build step 'Invoke Gradle script' marked build as failure

---------------------------------------------------------------------
To unsubscribe, e-mail: builds-unsubscribe@beam.apache.org
For additional commands, e-mail: builds-help@beam.apache.org


Build failed in Jenkins: beam_PostCommit_Python_Examples_Flink #1804

Posted by Apache Jenkins Server <je...@builds.apache.org>.
See <https://ci-beam.apache.org/job/beam_PostCommit_Python_Examples_Flink/1804/display/redirect?page=changes>

Changes:

[noreply] Bump google.golang.org/grpc from 1.54.0 to 1.55.0 in /sdks (#26568)


------------------------------------------
[...truncated 53.99 MB...]
  Implementing implicit namespace packages (as specified in PEP 420) is preferred to `pkg_resources.declare_namespace`. See https://setuptools.pypa.io/en/latest/references/keywords.html#keyword-namespace-packages
    declare_namespace(pkg)

../../build/gradleenv/2022703441/lib/python3.7/site-packages/pkg_resources/__init__.py:2870
  <https://ci-beam.apache.org/job/beam_PostCommit_Python_Examples_Flink/ws/src/build/gradleenv/2022703441/lib/python3.7/site-packages/pkg_resources/__init__.py>:2870: DeprecationWarning: Deprecated call to `pkg_resources.declare_namespace('google.iam')`.
  Implementing implicit namespace packages (as specified in PEP 420) is preferred to `pkg_resources.declare_namespace`. See https://setuptools.pypa.io/en/latest/references/keywords.html#keyword-namespace-packages
    declare_namespace(pkg)

../../build/gradleenv/2022703441/lib/python3.7/site-packages/google/rpc/__init__.py:20
  <https://ci-beam.apache.org/job/beam_PostCommit_Python_Examples_Flink/ws/src/build/gradleenv/2022703441/lib/python3.7/site-packages/google/rpc/__init__.py>:20: DeprecationWarning: Deprecated call to `pkg_resources.declare_namespace('google.rpc')`.
  Implementing implicit namespace packages (as specified in PEP 420) is preferred to `pkg_resources.declare_namespace`. See https://setuptools.pypa.io/en/latest/references/keywords.html#keyword-namespace-packages
    pkg_resources.declare_namespace(__name__)

apache_beam/examples/complete/game/hourly_team_score_it_test.py::HourlyTeamScoreIT::test_hourly_team_score_output_checksum_on_small_input
  <https://ci-beam.apache.org/job/beam_PostCommit_Python_Examples_Flink/ws/src/sdks/python/apache_beam/io/gcp/tests/utils.py>:63: PendingDeprecationWarning: Client.dataset is deprecated and will be removed in a future version. Use a string like 'my_project.my_dataset' or a cloud.google.bigquery.DatasetReference object, instead.
    dataset_ref = client.dataset(unique_dataset_name, project=project)

apache_beam/examples/complete/game/hourly_team_score_it_test.py::HourlyTeamScoreIT::test_hourly_team_score_output_checksum_on_small_input
apache_beam/examples/cookbook/bigquery_tornadoes_it_test.py::BigqueryTornadoesIT::test_bigquery_tornadoes_it
apache_beam/examples/cookbook/filters_test.py::FiltersTest::test_filters_output_bigquery_matcher
  <https://ci-beam.apache.org/job/beam_PostCommit_Python_Examples_Flink/ws/src/sdks/python/apache_beam/io/gcp/bigquery.py>:2029: BeamDeprecationWarning: options is deprecated since First stable release. References to <pipeline>.options will not be supported
    is_streaming_pipeline = p.options.view_as(StandardOptions).streaming

apache_beam/examples/complete/game/hourly_team_score_it_test.py::HourlyTeamScoreIT::test_hourly_team_score_output_checksum_on_small_input
apache_beam/examples/cookbook/bigquery_tornadoes_it_test.py::BigqueryTornadoesIT::test_bigquery_tornadoes_it
apache_beam/examples/cookbook/filters_test.py::FiltersTest::test_filters_output_bigquery_matcher
  <https://ci-beam.apache.org/job/beam_PostCommit_Python_Examples_Flink/ws/src/sdks/python/apache_beam/io/gcp/bigquery.py>:2035: BeamDeprecationWarning: options is deprecated since First stable release. References to <pipeline>.options will not be supported
    experiments = p.options.view_as(DebugOptions).experiments or []

apache_beam/examples/complete/game/hourly_team_score_it_test.py::HourlyTeamScoreIT::test_hourly_team_score_output_checksum_on_small_input
apache_beam/examples/cookbook/bigquery_tornadoes_it_test.py::BigqueryTornadoesIT::test_bigquery_tornadoes_it
apache_beam/examples/cookbook/filters_test.py::FiltersTest::test_filters_output_bigquery_matcher
  <https://ci-beam.apache.org/job/beam_PostCommit_Python_Examples_Flink/ws/src/sdks/python/apache_beam/io/gcp/bigquery_file_loads.py>:1173: BeamDeprecationWarning: options is deprecated since First stable release. References to <pipeline>.options will not be supported
    temp_location = p.options.view_as(GoogleCloudOptions).temp_location

apache_beam/examples/complete/game/hourly_team_score_it_test.py::HourlyTeamScoreIT::test_hourly_team_score_output_checksum_on_small_input
apache_beam/examples/cookbook/bigquery_tornadoes_it_test.py::BigqueryTornadoesIT::test_bigquery_tornadoes_it
apache_beam/examples/cookbook/filters_test.py::FiltersTest::test_filters_output_bigquery_matcher
  <https://ci-beam.apache.org/job/beam_PostCommit_Python_Examples_Flink/ws/src/sdks/python/apache_beam/io/gcp/bigquery_file_loads.py>:1175: BeamDeprecationWarning: options is deprecated since First stable release. References to <pipeline>.options will not be supported
    p.options.view_as(GoogleCloudOptions).job_name or 'AUTOMATIC_JOB_NAME')

apache_beam/examples/cookbook/bigquery_tornadoes_it_test.py::BigqueryTornadoesIT::test_bigquery_tornadoes_it
apache_beam/examples/cookbook/filters_test.py::FiltersTest::test_filters_output_bigquery_matcher
apache_beam/examples/dataframe/flight_delays_it_test.py::FlightDelaysTest::test_flight_delays
  <https://ci-beam.apache.org/job/beam_PostCommit_Python_Examples_Flink/ws/src/sdks/python/apache_beam/io/gcp/bigquery.py>:2665: BeamDeprecationWarning: options is deprecated since First stable release. References to <pipeline>.options will not be supported
    temp_location = pcoll.pipeline.options.view_as(

apache_beam/examples/cookbook/bigquery_tornadoes_it_test.py::BigqueryTornadoesIT::test_bigquery_tornadoes_it
apache_beam/examples/cookbook/filters_test.py::FiltersTest::test_filters_output_bigquery_matcher
apache_beam/examples/dataframe/flight_delays_it_test.py::FlightDelaysTest::test_flight_delays
  <https://ci-beam.apache.org/job/beam_PostCommit_Python_Examples_Flink/ws/src/sdks/python/apache_beam/io/gcp/bigquery.py>:2667: BeamDeprecationWarning: options is deprecated since First stable release. References to <pipeline>.options will not be supported
    job_name = pcoll.pipeline.options.view_as(GoogleCloudOptions).job_name

apache_beam/examples/cookbook/bigquery_tornadoes_it_test.py::BigqueryTornadoesIT::test_bigquery_tornadoes_it
apache_beam/examples/cookbook/filters_test.py::FiltersTest::test_filters_output_bigquery_matcher
apache_beam/examples/dataframe/flight_delays_it_test.py::FlightDelaysTest::test_flight_delays
  <https://ci-beam.apache.org/job/beam_PostCommit_Python_Examples_Flink/ws/src/sdks/python/apache_beam/io/gcp/bigquery.py>:2698: BeamDeprecationWarning: options is deprecated since First stable release. References to <pipeline>.options will not be supported
    | _PassThroughThenCleanup(files_to_remove_pcoll))

apache_beam/examples/cookbook/bigquery_tornadoes_it_test.py::BigqueryTornadoesIT::test_bigquery_tornadoes_it
apache_beam/examples/cookbook/filters_test.py::FiltersTest::test_filters_output_bigquery_matcher
  <https://ci-beam.apache.org/job/beam_PostCommit_Python_Examples_Flink/ws/src/sdks/python/apache_beam/io/gcp/bigquery.py>:2025: BeamDeprecationWarning: options is deprecated since First stable release. References to <pipeline>.options will not be supported
    self.table_reference.projectId = pcoll.pipeline.options.view_as(

apache_beam/examples/cookbook/bigquery_tornadoes_it_test.py::BigqueryTornadoesIT::test_bigquery_tornadoes_it
apache_beam/examples/cookbook/filters_test.py::FiltersTest::test_filters_output_bigquery_matcher
  <https://ci-beam.apache.org/job/beam_PostCommit_Python_Examples_Flink/ws/src/sdks/python/apache_beam/io/gcp/bigquery_file_loads.py>:1166: BeamDeprecationWarning: options is deprecated since First stable release. References to <pipeline>.options will not be supported
    self.project = self.project or p.options.view_as(GoogleCloudOptions).project

apache_beam/examples/cookbook/bigquery_tornadoes_it_test.py::BigqueryTornadoesIT::test_bigquery_tornadoes_it
apache_beam/examples/cookbook/filters_test.py::FiltersTest::test_filters_output_bigquery_matcher
  <https://ci-beam.apache.org/job/beam_PostCommit_Python_Examples_Flink/ws/src/sdks/python/apache_beam/io/gcp/tests/utils.py>:100: PendingDeprecationWarning: Client.dataset is deprecated and will be removed in a future version. Use a string like 'my_project.my_dataset' or a cloud.google.bigquery.DatasetReference object, instead.
    table_ref = client.dataset(dataset_id).table(table_id)

apache_beam/examples/dataframe/flight_delays_it_test.py::FlightDelaysTest::test_flight_delays
apache_beam/examples/dataframe/flight_delays_it_test.py::FlightDelaysTest::test_flight_delays
  <https://ci-beam.apache.org/job/beam_PostCommit_Python_Examples_Flink/ws/src/sdks/python/apache_beam/examples/dataframe/flight_delays.py>:47: FutureWarning: Dropping of nuisance columns in DataFrame reductions (with 'numeric_only=None') is deprecated; in a future version this will raise TypeError.  Select only valid columns before calling the reduction.
    return airline_df[at_top_airports].mean()

apache_beam/examples/dataframe/flight_delays_it_test.py::FlightDelaysTest::test_flight_delays
apache_beam/examples/dataframe/wordcount_test.py::WordCountTest::test_basics
  <https://ci-beam.apache.org/job/beam_PostCommit_Python_Examples_Flink/ws/src/sdks/python/apache_beam/dataframe/io.py>:664: FutureWarning: WriteToFiles is experimental.
    sink=lambda _: _WriteToPandasFileSink(

apache_beam/examples/dataframe/flight_delays_it_test.py::FlightDelaysTest::test_flight_delays
apache_beam/examples/dataframe/wordcount_test.py::WordCountTest::test_basics
  <https://ci-beam.apache.org/job/beam_PostCommit_Python_Examples_Flink/ws/src/sdks/python/apache_beam/io/fileio.py>:596: BeamDeprecationWarning: options is deprecated since First stable release. References to <pipeline>.options will not be supported
    p.options.view_as(GoogleCloudOptions).temp_location or

-- Docs: https://docs.pytest.org/en/stable/how-to/capture-warnings.html
- generated xml file: <https://ci-beam.apache.org/job/beam_PostCommit_Python_Examples_Flink/ws/src/sdks/python/pytest_postCommitExamples-flink-py37.xml> -
=========================== short test summary info ============================
FAILED apache_beam/examples/dataframe/flight_delays_it_test.py::FlightDelaysTest::test_flight_delays - RuntimeError: Pipeline BeamApp-jenkins-0505214726-47a0d222_35dbb9fe-d7fa-42cd-bc5f-20d7f3171945 failed in state FAILED: java.lang.RuntimeException: Error received from SDK harness for instruction 23: Traceback (most recent call last):
  File "<https://ci-beam.apache.org/job/beam_PostCommit_Python_Examples_Flink/ws/src/sdks/python/apache_beam/runners/common.py",> line 1459, in _invoke_bundle_method
    bundle_method()
  File "<https://ci-beam.apache.org/job/beam_PostCommit_Python_Examples_Flink/ws/src/sdks/python/apache_beam/runners/common.py",> line 568, in invoke_finish_bundle
    self.signature.finish_bundle_method.method_value())
  File "<https://ci-beam.apache.org/job/beam_PostCommit_Python_Examples_Flink/ws/src/sdks/python/apache_beam/runners/common.py",> line 1731, in finish_bundle_outputs
    for result in results:
  File "<https://ci-beam.apache.org/job/beam_PostCommit_Python_Examples_Flink/ws/src/sdks/python/apache_beam/io/fileio.py",> line 873, in finish_bundle
    writer.close()
  File "<https://ci-beam.apache.org/job/beam_PostCommit_Python_Examples_Flink/ws/src/sdks/python/apache_beam/io/filesystemio.py",> line 215, in close
    self._uploader.finish()
  File "<https://ci-beam.apache.org/job/beam_PostCommit_Python_Examples_Flink/ws/src/sdks/python/apache_beam/io/gcp/gcsio.py",> line 829, in finish
    self._upload_thread.last_error.message)  # pylint: disable=raising-bad-type
AttributeError: 'HttpError' object has no attribute 'message'

During handling of the above exception, another exception occurred:

Traceback (most recent call last):
  File "<https://ci-beam.apache.org/job/beam_PostCommit_Python_Examples_Flink/ws/src/sdks/python/apache_beam/runners/worker/sdk_worker.py",> line 295, in _execute
    response = task()
  File "<https://ci-beam.apache.org/job/beam_PostCommit_Python_Examples_Flink/ws/src/sdks/python/apache_beam/runners/worker/sdk_worker.py",> line 370, in <lambda>
    lambda: self.create_worker().do_instruction(request), request)
  File "<https://ci-beam.apache.org/job/beam_PostCommit_Python_Examples_Flink/ws/src/sdks/python/apache_beam/runners/worker/sdk_worker.py",> line 630, in do_instruction
    getattr(request, request_type), request.instruction_id)
  File "<https://ci-beam.apache.org/job/beam_PostCommit_Python_Examples_Flink/ws/src/sdks/python/apache_beam/runners/worker/sdk_worker.py",> line 667, in process_bundle
    bundle_processor.process_bundle(instruction_id))
  File "<https://ci-beam.apache.org/job/beam_PostCommit_Python_Examples_Flink/ws/src/sdks/python/apache_beam/runners/worker/bundle_processor.py",> line 1068, in process_bundle
    op.finish()
  File "<https://ci-beam.apache.org/job/beam_PostCommit_Python_Examples_Flink/ws/src/sdks/python/apache_beam/runners/worker/operations.py",> line 943, in finish
    self.dofn_runner.finish()
  File "<https://ci-beam.apache.org/job/beam_PostCommit_Python_Examples_Flink/ws/src/sdks/python/apache_beam/runners/common.py",> line 1480, in finish
    self._invoke_bundle_method(self.do_fn_invoker.invoke_finish_bundle)
  File "<https://ci-beam.apache.org/job/beam_PostCommit_Python_Examples_Flink/ws/src/sdks/python/apache_beam/runners/common.py",> line 1461, in _invoke_bundle_method
    self._reraise_augmented(exn)
  File "<https://ci-beam.apache.org/job/beam_PostCommit_Python_Examples_Flink/ws/src/sdks/python/apache_beam/runners/common.py",> line 1508, in _reraise_augmented
    raise new_exn.with_traceback(tb)
  File "<https://ci-beam.apache.org/job/beam_PostCommit_Python_Examples_Flink/ws/src/sdks/python/apache_beam/runners/common.py",> line 1459, in _invoke_bundle_method
    bundle_method()
  File "<https://ci-beam.apache.org/job/beam_PostCommit_Python_Examples_Flink/ws/src/sdks/python/apache_beam/runners/common.py",> line 568, in invoke_finish_bundle
    self.signature.finish_bundle_method.method_value())
  File "<https://ci-beam.apache.org/job/beam_PostCommit_Python_Examples_Flink/ws/src/sdks/python/apache_beam/runners/common.py",> line 1731, in finish_bundle_outputs
    for result in results:
  File "<https://ci-beam.apache.org/job/beam_PostCommit_Python_Examples_Flink/ws/src/sdks/python/apache_beam/io/fileio.py",> line 873, in finish_bundle
    writer.close()
  File "<https://ci-beam.apache.org/job/beam_PostCommit_Python_Examples_Flink/ws/src/sdks/python/apache_beam/io/filesystemio.py",> line 215, in close
    self._uploader.finish()
  File "<https://ci-beam.apache.org/job/beam_PostCommit_Python_Examples_Flink/ws/src/sdks/python/apache_beam/io/gcp/gcsio.py",> line 829, in finish
    self._upload_thread.last_error.message)  # pylint: disable=raising-bad-type
AttributeError: 'HttpError' object has no attribute 'message' [while running 'WriteToPandas(df) - gs://temp-storage-for-end-to-end-tests/temp-it/flight_delays_it-a219a929-e13f-4363-b65d-aadb49618366/output.csv/WriteToFiles/ParDo(_WriteUnshardedRecordsFn)/ParDo(_WriteUnshardedRecordsFn)']
= 1 failed, 17 passed, 10 skipped, 6899 deselected, 74 warnings in 498.49s (0:08:18) =

Exception in thread read_grpc_client_inputs:
Traceback (most recent call last):
  File "/usr/lib/python3.7/threading.py", line 926, in _bootstrap_inner
    self.run()
  File "/usr/lib/python3.7/threading.py", line 870, in run
    self._target(*self._args, **self._kwargs)
  File "<https://ci-beam.apache.org/job/beam_PostCommit_Python_Examples_Flink/ws/src/sdks/python/apache_beam/runners/worker/data_plane.py",> line 671, in <lambda>
    target=lambda: self._read_inputs(elements_iterator),
  File "<https://ci-beam.apache.org/job/beam_PostCommit_Python_Examples_Flink/ws/src/sdks/python/apache_beam/runners/worker/data_plane.py",> line 654, in _read_inputs
    for elements in elements_iterator:
  File "<https://ci-beam.apache.org/job/beam_PostCommit_Python_Examples_Flink/ws/src/build/gradleenv/2022703441/lib/python3.7/site-packages/grpc/_channel.py",> line 475, in __next__
    return self._next()
  File "<https://ci-beam.apache.org/job/beam_PostCommit_Python_Examples_Flink/ws/src/build/gradleenv/2022703441/lib/python3.7/site-packages/grpc/_channel.py",> line 881, in _next
    raise self
grpc._channel._MultiThreadedRendezvous: <_MultiThreadedRendezvous of RPC that terminated with:
	status = StatusCode.CANCELLED
	details = "Multiplexer hanging up"
	debug_error_string = "UNKNOWN:Error received from peer ipv6:%5B::1%5D:45911 {created_time:"2023-05-05T21:47:00.317879569+00:00", grpc_status:1, grpc_message:"Multiplexer hanging up"}"
>

Exception in thread run_worker_3-1:
Traceback (most recent call last):
  File "/usr/lib/python3.7/threading.py", line 926, in _bootstrap_inner
    self.run()
  File "/usr/lib/python3.7/threading.py", line 870, in run
    self._target(*self._args, **self._kwargs)
  File "<https://ci-beam.apache.org/job/beam_PostCommit_Python_Examples_Flink/ws/src/sdks/python/apache_beam/runners/worker/sdk_worker.py",> line 262, in run
    for work_request in self._control_stub.Control(get_responses()):
  File "<https://ci-beam.apache.org/job/beam_PostCommit_Python_Examples_Flink/ws/src/build/gradleenv/2022703441/lib/python3.7/site-packages/grpc/_channel.py",> line 475, in __next__
    return self._next()
  File "<https://ci-beam.apache.org/job/beam_PostCommit_Python_Examples_Flink/ws/src/build/gradleenv/2022703441/lib/python3.7/site-packages/grpc/_channel.py",> line 881, in _next
    raise self
grpc._channel._MultiThreadedRendezvous: <_MultiThreadedRendezvous of RPC that terminated with:
	status = StatusCode.CANCELLED
	details = "Runner closed connection"
	debug_error_string = "UNKNOWN:Error received from peer ipv6:%5B::1%5D:32893 {created_time:"2023-05-05T21:47:19.755992488+00:00", grpc_status:1, grpc_message:"Runner closed connection"}"
>

Exception in thread read_grpc_client_inputs:
Traceback (most recent call last):
  File "/usr/lib/python3.7/threading.py", line 926, in _bootstrap_inner
    self.run()
  File "/usr/lib/python3.7/threading.py", line 870, in run
    self._target(*self._args, **self._kwargs)
  File "<https://ci-beam.apache.org/job/beam_PostCommit_Python_Examples_Flink/ws/src/sdks/python/apache_beam/runners/worker/data_plane.py",> line 671, in <lambda>
    target=lambda: self._read_inputs(elements_iterator),
  File "<https://ci-beam.apache.org/job/beam_PostCommit_Python_Examples_Flink/ws/src/sdks/python/apache_beam/runners/worker/data_plane.py",> line 654, in _read_inputs
    for elements in elements_iterator:
  File "<https://ci-beam.apache.org/job/beam_PostCommit_Python_Examples_Flink/ws/src/build/gradleenv/2022703441/lib/python3.7/site-packages/grpc/_channel.py",> line 475, in __next__
    return self._next()
  File "<https://ci-beam.apache.org/job/beam_PostCommit_Python_Examples_Flink/ws/src/build/gradleenv/2022703441/lib/python3.7/site-packages/grpc/_channel.py",> line 881, in _next
    raise self
grpc._channel._MultiThreadedRendezvous: <_MultiThreadedRendezvous of RPC that terminated with:
	status = StatusCode.CANCELLED
	details = "Multiplexer hanging up"
	debug_error_string = "UNKNOWN:Error received from peer ipv6:%5B::1%5D:33797 {created_time:"2023-05-05T21:47:19.784077452+00:00", grpc_status:1, grpc_message:"Multiplexer hanging up"}"
>


> Task :sdks:python:test-suites:portable:py37:flinkExamples FAILED

FAILURE: Build failed with an exception.

* Where:
Script '<https://ci-beam.apache.org/job/beam_PostCommit_Python_Examples_Flink/ws/src/sdks/python/test-suites/portable/common.gradle'> line: 245

* What went wrong:
Execution failed for task ':sdks:python:test-suites:portable:py37:flinkExamples'.
> Process 'command 'sh'' finished with non-zero exit value 1

* Try:
> Run with --stacktrace option to get the stack trace.
> Run with --info or --debug option to get more log output.

* Get more help at https://help.gradle.org

Deprecated Gradle features were used in this build, making it incompatible with Gradle 8.0.

You can use '--warning-mode all' to show the individual deprecation warnings and determine if they come from your own scripts or plugins.

See https://docs.gradle.org/7.5.1/userguide/command_line_interface.html#sec:command_line_warnings

BUILD FAILED in 10m 19s
136 actionable tasks: 89 executed, 45 from cache, 2 up-to-date
Build scan background action failed.
java.lang.IllegalArgumentException: com.gradle.enterprise.gradleplugin.internal.extension.a is not an interface
	at java.lang.reflect.Proxy$ProxyClassFactory.apply(Proxy.java:590)
	at java.lang.reflect.Proxy$ProxyClassFactory.apply(Proxy.java:557)
	at java.lang.reflect.WeakCache$Factory.get(WeakCache.java:230)
	at java.lang.reflect.WeakCache.get(WeakCache.java:127)
	at java.lang.reflect.Proxy.getProxyClass0(Proxy.java:419)
	at java.lang.reflect.Proxy.newProxyInstance(Proxy.java:719)
	at com.gradle.ProxyFactory$ProxyingInvocationHandler.createLocalProxy(ProxyFactory.java:66)
	at com.gradle.ProxyFactory$ProxyingInvocationHandler.lambda$adaptActionArg$1(ProxyFactory.java:61)
	at com.gradle.enterprise.gradleplugin.internal.extension.b$3.run(SourceFile:100)
	at java.util.concurrent.Executors$RunnableAdapter.call(Executors.java:511)
	at java.util.concurrent.FutureTask.run(FutureTask.java:266)
	at java.util.concurrent.ThreadPoolExecutor.runWorker(ThreadPoolExecutor.java:1149)
	at java.util.concurrent.ThreadPoolExecutor$Worker.run(ThreadPoolExecutor.java:624)
	at java.lang.Thread.run(Thread.java:750)

Publishing build scan...
https://ge.apache.org/s/baaslfxa4ougq

Build step 'Invoke Gradle script' changed build result to FAILURE
Build step 'Invoke Gradle script' marked build as failure

---------------------------------------------------------------------
To unsubscribe, e-mail: builds-unsubscribe@beam.apache.org
For additional commands, e-mail: builds-help@beam.apache.org