You are viewing a plain text version of this content. The canonical link for it is here.
Posted to dev@kafka.apache.org by Apache Jenkins Server <je...@builds.apache.org> on 2023/08/16 03:33:59 UTC

Build failed in Jenkins: Kafka » Kafka Branch Builder » 3.3 #187

See <https://ci-builds.apache.org/job/Kafka/job/kafka/job/3.3/187/display/redirect>

Changes:


------------------------------------------
[...truncated 503740 lines...]

org.apache.kafka.streams.integration.StandbyTaskCreationIntegrationTest > shouldCreateStandByTasksForMaterializedAndOptimizedSourceTables STARTED

org.apache.kafka.streams.integration.StandbyTaskCreationIntegrationTest > shouldCreateStandByTasksForMaterializedAndOptimizedSourceTables PASSED

org.apache.kafka.streams.integration.StateDirectoryIntegrationTest > testNotCleanUpStateDirIfNotEmpty STARTED

org.apache.kafka.streams.integration.StateDirectoryIntegrationTest > testNotCleanUpStateDirIfNotEmpty PASSED

org.apache.kafka.streams.integration.StateDirectoryIntegrationTest > testCleanUpStateDirIfEmpty STARTED

org.apache.kafka.streams.integration.StateDirectoryIntegrationTest > testCleanUpStateDirIfEmpty PASSED

org.apache.kafka.streams.integration.StoreQueryIntegrationTest > shouldQuerySpecificActivePartitionStores STARTED

org.apache.kafka.streams.integration.StoreQueryIntegrationTest > shouldQuerySpecificActivePartitionStores PASSED

org.apache.kafka.streams.integration.StoreQueryIntegrationTest > shouldQueryAllStalePartitionStores STARTED

org.apache.kafka.streams.integration.StoreQueryIntegrationTest > shouldQueryAllStalePartitionStores PASSED

org.apache.kafka.streams.integration.StoreQueryIntegrationTest > shouldQuerySpecificStalePartitionStoresMultiStreamThreads STARTED

org.apache.kafka.streams.integration.StoreQueryIntegrationTest > shouldQuerySpecificStalePartitionStoresMultiStreamThreads PASSED

org.apache.kafka.streams.integration.StoreQueryIntegrationTest > shouldQuerySpecificStalePartitionStores STARTED

org.apache.kafka.streams.integration.StoreQueryIntegrationTest > shouldQuerySpecificStalePartitionStores PASSED

org.apache.kafka.streams.integration.StoreQueryIntegrationTest > shouldQueryOnlyActivePartitionStoresByDefault STARTED

org.apache.kafka.streams.integration.StoreQueryIntegrationTest > shouldQueryOnlyActivePartitionStoresByDefault PASSED

org.apache.kafka.streams.integration.StoreQueryIntegrationTest > shouldQueryStoresAfterAddingAndRemovingStreamThread STARTED

org.apache.kafka.streams.integration.StoreQueryIntegrationTest > shouldQueryStoresAfterAddingAndRemovingStreamThread PASSED

org.apache.kafka.streams.integration.StoreQueryIntegrationTest > shouldQuerySpecificStalePartitionStoresMultiStreamThreadsNamedTopology STARTED

org.apache.kafka.streams.integration.StoreQueryIntegrationTest > shouldQuerySpecificStalePartitionStoresMultiStreamThreadsNamedTopology PASSED

org.apache.kafka.streams.integration.StreamStreamJoinIntegrationTest > testInnerRepartitioned[caching enabled = true] STARTED

org.apache.kafka.streams.integration.StreamStreamJoinIntegrationTest > testInnerRepartitioned[caching enabled = true] PASSED

org.apache.kafka.streams.integration.StreamStreamJoinIntegrationTest > testOuterRepartitioned[caching enabled = true] STARTED

org.apache.kafka.streams.integration.StreamStreamJoinIntegrationTest > testOuterRepartitioned[caching enabled = true] PASSED

org.apache.kafka.streams.integration.StreamStreamJoinIntegrationTest > testInner[caching enabled = true] STARTED

org.apache.kafka.streams.integration.StreamStreamJoinIntegrationTest > testInner[caching enabled = true] PASSED

org.apache.kafka.streams.integration.StreamStreamJoinIntegrationTest > testOuter[caching enabled = true] STARTED

org.apache.kafka.streams.integration.StreamStreamJoinIntegrationTest > testOuter[caching enabled = true] PASSED

org.apache.kafka.streams.integration.StreamStreamJoinIntegrationTest > testLeft[caching enabled = true] STARTED

org.apache.kafka.streams.integration.StreamStreamJoinIntegrationTest > testLeft[caching enabled = true] PASSED

org.apache.kafka.streams.integration.StreamStreamJoinIntegrationTest > testMultiInner[caching enabled = true] STARTED

org.apache.kafka.streams.integration.StreamStreamJoinIntegrationTest > testMultiInner[caching enabled = true] PASSED

org.apache.kafka.streams.integration.StreamStreamJoinIntegrationTest > testLeftRepartitioned[caching enabled = true] STARTED

org.apache.kafka.streams.integration.StreamStreamJoinIntegrationTest > testLeftRepartitioned[caching enabled = true] PASSED

org.apache.kafka.streams.integration.StreamStreamJoinIntegrationTest > testSelfJoin[caching enabled = true] STARTED

org.apache.kafka.streams.integration.StreamStreamJoinIntegrationTest > testSelfJoin[caching enabled = true] PASSED

org.apache.kafka.streams.integration.StreamStreamJoinIntegrationTest > testInnerRepartitioned[caching enabled = false] STARTED

org.apache.kafka.streams.integration.StreamStreamJoinIntegrationTest > testInnerRepartitioned[caching enabled = false] PASSED

org.apache.kafka.streams.integration.StreamStreamJoinIntegrationTest > testOuterRepartitioned[caching enabled = false] STARTED

org.apache.kafka.streams.integration.StreamStreamJoinIntegrationTest > testOuterRepartitioned[caching enabled = false] PASSED

org.apache.kafka.streams.integration.StreamStreamJoinIntegrationTest > testInner[caching enabled = false] STARTED

org.apache.kafka.streams.integration.StreamStreamJoinIntegrationTest > testInner[caching enabled = false] PASSED

org.apache.kafka.streams.integration.StreamStreamJoinIntegrationTest > testOuter[caching enabled = false] STARTED

org.apache.kafka.streams.integration.StreamStreamJoinIntegrationTest > testOuter[caching enabled = false] PASSED

org.apache.kafka.streams.integration.StreamStreamJoinIntegrationTest > testLeft[caching enabled = false] STARTED

org.apache.kafka.streams.integration.StreamStreamJoinIntegrationTest > testLeft[caching enabled = false] PASSED

org.apache.kafka.streams.integration.StreamStreamJoinIntegrationTest > testMultiInner[caching enabled = false] STARTED

org.apache.kafka.streams.integration.StreamStreamJoinIntegrationTest > testMultiInner[caching enabled = false] PASSED

org.apache.kafka.streams.integration.StreamStreamJoinIntegrationTest > testLeftRepartitioned[caching enabled = false] STARTED

org.apache.kafka.streams.integration.StreamStreamJoinIntegrationTest > testLeftRepartitioned[caching enabled = false] PASSED

org.apache.kafka.streams.integration.StreamStreamJoinIntegrationTest > testSelfJoin[caching enabled = false] STARTED

org.apache.kafka.streams.integration.StreamStreamJoinIntegrationTest > testSelfJoin[caching enabled = false] PASSED

org.apache.kafka.streams.integration.StreamTableJoinTopologyOptimizationIntegrationTest > shouldDoStreamTableJoinWithDifferentNumberOfPartitions[Optimization = all] STARTED

org.apache.kafka.streams.integration.StreamTableJoinTopologyOptimizationIntegrationTest > shouldDoStreamTableJoinWithDifferentNumberOfPartitions[Optimization = all] PASSED

org.apache.kafka.streams.integration.StreamTableJoinTopologyOptimizationIntegrationTest > shouldDoStreamTableJoinWithDifferentNumberOfPartitions[Optimization = none] STARTED

org.apache.kafka.streams.integration.StreamTableJoinTopologyOptimizationIntegrationTest > shouldDoStreamTableJoinWithDifferentNumberOfPartitions[Optimization = none] PASSED

org.apache.kafka.streams.integration.StreamsUpgradeTestIntegrationTest > testVersionProbingUpgrade STARTED

org.apache.kafka.streams.integration.StreamsUpgradeTestIntegrationTest > testVersionProbingUpgrade PASSED

org.apache.kafka.streams.integration.SuppressionIntegrationTest > shouldInheritSerdes STARTED

org.apache.kafka.streams.integration.SuppressionIntegrationTest > shouldInheritSerdes PASSED

org.apache.kafka.streams.integration.SuppressionIntegrationTest > shouldShutdownWhenRecordConstraintIsViolated STARTED

org.apache.kafka.streams.integration.SuppressionIntegrationTest > shouldShutdownWhenRecordConstraintIsViolated PASSED

org.apache.kafka.streams.integration.SuppressionIntegrationTest > shouldUseDefaultSerdes STARTED

org.apache.kafka.streams.integration.SuppressionIntegrationTest > shouldUseDefaultSerdes PASSED

org.apache.kafka.streams.integration.SuppressionIntegrationTest > shouldAllowDisablingChangelog STARTED

org.apache.kafka.streams.integration.SuppressionIntegrationTest > shouldAllowDisablingChangelog PASSED

org.apache.kafka.streams.integration.SuppressionIntegrationTest > shouldAllowOverridingChangelogConfig STARTED

org.apache.kafka.streams.integration.SuppressionIntegrationTest > shouldAllowOverridingChangelogConfig PASSED

org.apache.kafka.streams.integration.SuppressionIntegrationTest > shouldShutdownWhenBytesConstraintIsViolated STARTED

org.apache.kafka.streams.integration.SuppressionIntegrationTest > shouldShutdownWhenBytesConstraintIsViolated PASSED

org.apache.kafka.streams.integration.SuppressionIntegrationTest > shouldCreateChangelogByDefault STARTED

org.apache.kafka.streams.integration.SuppressionIntegrationTest > shouldCreateChangelogByDefault PASSED

org.apache.kafka.streams.integration.TaskAssignorIntegrationTest > shouldProperlyConfigureTheAssignor STARTED

org.apache.kafka.streams.integration.TaskAssignorIntegrationTest > shouldProperlyConfigureTheAssignor PASSED

org.apache.kafka.streams.integration.TimeWindowedKStreamIntegrationTest > shouldThrowUnlimitedWindows[ON_WINDOW_UPDATE_true] STARTED

org.apache.kafka.streams.integration.TimeWindowedKStreamIntegrationTest > shouldThrowUnlimitedWindows[ON_WINDOW_UPDATE_true] PASSED

org.apache.kafka.streams.integration.TimeWindowedKStreamIntegrationTest > shouldAggregateWindowedWithNoGrace[ON_WINDOW_UPDATE_true] STARTED

org.apache.kafka.streams.integration.TimeWindowedKStreamIntegrationTest > shouldAggregateWindowedWithNoGrace[ON_WINDOW_UPDATE_true] PASSED

org.apache.kafka.streams.integration.TimeWindowedKStreamIntegrationTest > shouldAggregateWindowedWithGrace[ON_WINDOW_UPDATE_true] STARTED

org.apache.kafka.streams.integration.TimeWindowedKStreamIntegrationTest > shouldAggregateWindowedWithGrace[ON_WINDOW_UPDATE_true] PASSED

org.apache.kafka.streams.integration.TimeWindowedKStreamIntegrationTest > shouldRestoreAfterJoinRestart[ON_WINDOW_UPDATE_true] STARTED

org.apache.kafka.streams.integration.TimeWindowedKStreamIntegrationTest > shouldRestoreAfterJoinRestart[ON_WINDOW_UPDATE_true] PASSED

org.apache.kafka.streams.integration.TimeWindowedKStreamIntegrationTest > shouldThrowUnlimitedWindows[ON_WINDOW_UPDATE_false] STARTED

org.apache.kafka.streams.integration.TimeWindowedKStreamIntegrationTest > shouldThrowUnlimitedWindows[ON_WINDOW_UPDATE_false] PASSED

org.apache.kafka.streams.integration.TimeWindowedKStreamIntegrationTest > shouldAggregateWindowedWithNoGrace[ON_WINDOW_UPDATE_false] STARTED

org.apache.kafka.streams.integration.TimeWindowedKStreamIntegrationTest > shouldAggregateWindowedWithNoGrace[ON_WINDOW_UPDATE_false] PASSED

org.apache.kafka.streams.integration.TimeWindowedKStreamIntegrationTest > shouldAggregateWindowedWithGrace[ON_WINDOW_UPDATE_false] STARTED

org.apache.kafka.streams.integration.TimeWindowedKStreamIntegrationTest > shouldAggregateWindowedWithGrace[ON_WINDOW_UPDATE_false] PASSED

org.apache.kafka.streams.integration.TimeWindowedKStreamIntegrationTest > shouldRestoreAfterJoinRestart[ON_WINDOW_UPDATE_false] STARTED

org.apache.kafka.streams.integration.TimeWindowedKStreamIntegrationTest > shouldRestoreAfterJoinRestart[ON_WINDOW_UPDATE_false] PASSED

org.apache.kafka.streams.integration.TimeWindowedKStreamIntegrationTest > shouldThrowUnlimitedWindows[ON_WINDOW_CLOSE_true] STARTED

org.apache.kafka.streams.integration.TimeWindowedKStreamIntegrationTest > shouldThrowUnlimitedWindows[ON_WINDOW_CLOSE_true] PASSED

org.apache.kafka.streams.integration.TimeWindowedKStreamIntegrationTest > shouldAggregateWindowedWithNoGrace[ON_WINDOW_CLOSE_true] STARTED

org.apache.kafka.streams.integration.TimeWindowedKStreamIntegrationTest > shouldAggregateWindowedWithNoGrace[ON_WINDOW_CLOSE_true] PASSED

org.apache.kafka.streams.integration.TimeWindowedKStreamIntegrationTest > shouldAggregateWindowedWithGrace[ON_WINDOW_CLOSE_true] STARTED

org.apache.kafka.streams.integration.TimeWindowedKStreamIntegrationTest > shouldAggregateWindowedWithGrace[ON_WINDOW_CLOSE_true] PASSED

org.apache.kafka.streams.integration.TimeWindowedKStreamIntegrationTest > shouldRestoreAfterJoinRestart[ON_WINDOW_CLOSE_true] STARTED

org.apache.kafka.streams.integration.TimeWindowedKStreamIntegrationTest > shouldRestoreAfterJoinRestart[ON_WINDOW_CLOSE_true] PASSED

org.apache.kafka.streams.integration.TimeWindowedKStreamIntegrationTest > shouldThrowUnlimitedWindows[ON_WINDOW_CLOSE_false] STARTED

org.apache.kafka.streams.integration.TimeWindowedKStreamIntegrationTest > shouldThrowUnlimitedWindows[ON_WINDOW_CLOSE_false] PASSED

org.apache.kafka.streams.integration.TimeWindowedKStreamIntegrationTest > shouldAggregateWindowedWithNoGrace[ON_WINDOW_CLOSE_false] STARTED

org.apache.kafka.streams.integration.TimeWindowedKStreamIntegrationTest > shouldAggregateWindowedWithNoGrace[ON_WINDOW_CLOSE_false] PASSED

org.apache.kafka.streams.integration.TimeWindowedKStreamIntegrationTest > shouldAggregateWindowedWithGrace[ON_WINDOW_CLOSE_false] STARTED

org.apache.kafka.streams.integration.TimeWindowedKStreamIntegrationTest > shouldAggregateWindowedWithGrace[ON_WINDOW_CLOSE_false] PASSED

org.apache.kafka.streams.integration.TimeWindowedKStreamIntegrationTest > shouldRestoreAfterJoinRestart[ON_WINDOW_CLOSE_false] STARTED

org.apache.kafka.streams.integration.TimeWindowedKStreamIntegrationTest > shouldRestoreAfterJoinRestart[ON_WINDOW_CLOSE_false] PASSED

BUILD SUCCESSFUL in 2h 40m 40s
212 actionable tasks: 115 executed, 97 up-to-date

See the profiling report at: file:///home/jenkins/jenkins-agent/workspace/Kafka_kafka_3.3/build/reports/profile/profile-2023-08-16-00-53-15.html
A fine-grained performance profile is available: use the --scan option.
[Pipeline] junit
Recording test results
[Checks API] No suitable checks publisher found.
[Pipeline] echo
Skipping Kafka Streams archetype test for Java 11
[Pipeline] }
[Pipeline] // withEnv
[Pipeline] }
[Pipeline] // withEnv
[Pipeline] }
[Pipeline] // withEnv
[Pipeline] }
[Pipeline] // node
[Pipeline] }
[Pipeline] // timestamps
[Pipeline] }
[Pipeline] // timeout
[Pipeline] }
[Pipeline] // stage
[Pipeline] }
[Pipeline] // parallel
[Pipeline] }
[Pipeline] // stage
[Pipeline] stage
[Pipeline] { (Declarative: Post Actions)
[Pipeline] node
Running on builds30 in /home/jenkins/jenkins-agent/workspace/Kafka_kafka_3.3
[Pipeline] {
[Pipeline] script
[Pipeline] {
[Pipeline] step

Build failed in Jenkins: Kafka » Kafka Branch Builder » 3.3 #191

Posted by Apache Jenkins Server <je...@builds.apache.org>.
See <https://ci-builds.apache.org/job/Kafka/job/kafka/job/3.3/191/display/redirect>

Changes:


------------------------------------------
[...truncated 419241 lines...]

org.apache.kafka.streams.integration.StreamStreamJoinIntegrationTest > testSelfJoin[caching enabled = false] PASSED

org.apache.kafka.streams.integration.StreamTableJoinTopologyOptimizationIntegrationTest > shouldDoStreamTableJoinWithDifferentNumberOfPartitions[Optimization = all] STARTED

org.apache.kafka.streams.integration.StreamTableJoinTopologyOptimizationIntegrationTest > shouldDoStreamTableJoinWithDifferentNumberOfPartitions[Optimization = all] PASSED

org.apache.kafka.streams.integration.StreamTableJoinTopologyOptimizationIntegrationTest > shouldDoStreamTableJoinWithDifferentNumberOfPartitions[Optimization = none] STARTED

org.apache.kafka.streams.integration.StreamTableJoinTopologyOptimizationIntegrationTest > shouldDoStreamTableJoinWithDifferentNumberOfPartitions[Optimization = none] PASSED

org.apache.kafka.streams.integration.StreamsUpgradeTestIntegrationTest > testVersionProbingUpgrade STARTED

Exception: java.lang.OutOfMemoryError thrown from the UncaughtExceptionHandler in thread "delete-temp-file-shutdown-hook"

Exception: java.lang.OutOfMemoryError thrown from the UncaughtExceptionHandler in thread "delete-temp-file-shutdown-hook"

org.apache.kafka.streams.integration.StreamsUpgradeTestIntegrationTest > testVersionProbingUpgrade PASSED

org.apache.kafka.streams.integration.SuppressionIntegrationTest > shouldInheritSerdes STARTED

org.apache.kafka.streams.integration.SuppressionIntegrationTest > shouldInheritSerdes PASSED

org.apache.kafka.streams.integration.SuppressionIntegrationTest > shouldShutdownWhenRecordConstraintIsViolated STARTED

org.apache.kafka.streams.integration.SuppressionIntegrationTest > shouldShutdownWhenRecordConstraintIsViolated PASSED

org.apache.kafka.streams.integration.SuppressionIntegrationTest > shouldUseDefaultSerdes STARTED

org.apache.kafka.streams.integration.SuppressionIntegrationTest > shouldUseDefaultSerdes PASSED

org.apache.kafka.streams.integration.SuppressionIntegrationTest > shouldAllowDisablingChangelog STARTED

org.apache.kafka.streams.integration.SuppressionIntegrationTest > shouldAllowDisablingChangelog PASSED

org.apache.kafka.streams.integration.SuppressionIntegrationTest > shouldAllowOverridingChangelogConfig STARTED

org.apache.kafka.streams.integration.SuppressionIntegrationTest > shouldAllowOverridingChangelogConfig PASSED

org.apache.kafka.streams.integration.SuppressionIntegrationTest > shouldShutdownWhenBytesConstraintIsViolated STARTED

org.apache.kafka.streams.integration.SuppressionIntegrationTest > shouldShutdownWhenBytesConstraintIsViolated PASSED

org.apache.kafka.streams.integration.SuppressionIntegrationTest > shouldCreateChangelogByDefault STARTED

org.apache.kafka.streams.integration.SuppressionIntegrationTest > shouldCreateChangelogByDefault PASSED

org.apache.kafka.streams.integration.TaskAssignorIntegrationTest > shouldProperlyConfigureTheAssignor STARTED

org.apache.kafka.streams.integration.TaskAssignorIntegrationTest > shouldProperlyConfigureTheAssignor PASSED

org.apache.kafka.streams.integration.TimeWindowedKStreamIntegrationTest > shouldThrowUnlimitedWindows[ON_WINDOW_UPDATE_true] STARTED

org.apache.kafka.streams.integration.TimeWindowedKStreamIntegrationTest > shouldThrowUnlimitedWindows[ON_WINDOW_UPDATE_true] PASSED

org.apache.kafka.streams.integration.TimeWindowedKStreamIntegrationTest > shouldAggregateWindowedWithNoGrace[ON_WINDOW_UPDATE_true] STARTED

org.apache.kafka.streams.integration.TimeWindowedKStreamIntegrationTest > shouldAggregateWindowedWithNoGrace[ON_WINDOW_UPDATE_true] PASSED

org.apache.kafka.streams.integration.TimeWindowedKStreamIntegrationTest > shouldAggregateWindowedWithGrace[ON_WINDOW_UPDATE_true] STARTED

org.apache.kafka.streams.integration.TimeWindowedKStreamIntegrationTest > shouldAggregateWindowedWithGrace[ON_WINDOW_UPDATE_true] PASSED

org.apache.kafka.streams.integration.TimeWindowedKStreamIntegrationTest > shouldRestoreAfterJoinRestart[ON_WINDOW_UPDATE_true] STARTED

org.apache.kafka.streams.integration.TimeWindowedKStreamIntegrationTest > shouldRestoreAfterJoinRestart[ON_WINDOW_UPDATE_true] PASSED

org.apache.kafka.streams.integration.TimeWindowedKStreamIntegrationTest > shouldThrowUnlimitedWindows[ON_WINDOW_UPDATE_false] STARTED

org.apache.kafka.streams.integration.TimeWindowedKStreamIntegrationTest > shouldThrowUnlimitedWindows[ON_WINDOW_UPDATE_false] PASSED

org.apache.kafka.streams.integration.TimeWindowedKStreamIntegrationTest > shouldAggregateWindowedWithNoGrace[ON_WINDOW_UPDATE_false] STARTED

org.apache.kafka.streams.integration.TimeWindowedKStreamIntegrationTest > shouldAggregateWindowedWithNoGrace[ON_WINDOW_UPDATE_false] PASSED

org.apache.kafka.streams.integration.TimeWindowedKStreamIntegrationTest > shouldAggregateWindowedWithGrace[ON_WINDOW_UPDATE_false] STARTED

org.apache.kafka.streams.integration.TimeWindowedKStreamIntegrationTest > shouldAggregateWindowedWithGrace[ON_WINDOW_UPDATE_false] PASSED

org.apache.kafka.streams.integration.TimeWindowedKStreamIntegrationTest > shouldRestoreAfterJoinRestart[ON_WINDOW_UPDATE_false] STARTED

Exception: java.lang.OutOfMemoryError thrown from the UncaughtExceptionHandler in thread "delete-temp-file-shutdown-hook"

Exception: java.lang.OutOfMemoryError thrown from the UncaughtExceptionHandler in thread "delete-temp-file-shutdown-hook"

org.apache.kafka.streams.integration.TimeWindowedKStreamIntegrationTest > shouldRestoreAfterJoinRestart[ON_WINDOW_UPDATE_false] PASSED

org.apache.kafka.streams.integration.TimeWindowedKStreamIntegrationTest > shouldThrowUnlimitedWindows[ON_WINDOW_CLOSE_true] STARTED

org.apache.kafka.streams.integration.TimeWindowedKStreamIntegrationTest > shouldThrowUnlimitedWindows[ON_WINDOW_CLOSE_true] PASSED

org.apache.kafka.streams.integration.TimeWindowedKStreamIntegrationTest > shouldAggregateWindowedWithNoGrace[ON_WINDOW_CLOSE_true] STARTED

org.apache.kafka.streams.integration.TimeWindowedKStreamIntegrationTest > shouldAggregateWindowedWithNoGrace[ON_WINDOW_CLOSE_true] PASSED

org.apache.kafka.streams.integration.TimeWindowedKStreamIntegrationTest > shouldAggregateWindowedWithGrace[ON_WINDOW_CLOSE_true] STARTED

org.apache.kafka.streams.integration.TimeWindowedKStreamIntegrationTest > shouldAggregateWindowedWithGrace[ON_WINDOW_CLOSE_true] PASSED

org.apache.kafka.streams.integration.TimeWindowedKStreamIntegrationTest > shouldRestoreAfterJoinRestart[ON_WINDOW_CLOSE_true] STARTED

Exception: java.lang.OutOfMemoryError thrown from the UncaughtExceptionHandler in thread "delete-temp-file-shutdown-hook"

Exception: java.lang.OutOfMemoryError thrown from the UncaughtExceptionHandler in thread "kafka-scheduler-7"

Exception: java.lang.OutOfMemoryError thrown from the UncaughtExceptionHandler in thread "delete-temp-file-shutdown-hook"

org.apache.kafka.streams.integration.TimeWindowedKStreamIntegrationTest > shouldRestoreAfterJoinRestart[ON_WINDOW_CLOSE_true] PASSED

org.apache.kafka.streams.integration.TimeWindowedKStreamIntegrationTest > shouldThrowUnlimitedWindows[ON_WINDOW_CLOSE_false] STARTED

org.apache.kafka.streams.integration.TimeWindowedKStreamIntegrationTest > shouldThrowUnlimitedWindows[ON_WINDOW_CLOSE_false] PASSED

org.apache.kafka.streams.integration.TimeWindowedKStreamIntegrationTest > shouldAggregateWindowedWithNoGrace[ON_WINDOW_CLOSE_false] STARTED

org.apache.kafka.streams.integration.TimeWindowedKStreamIntegrationTest > shouldAggregateWindowedWithNoGrace[ON_WINDOW_CLOSE_false] PASSED

org.apache.kafka.streams.integration.TimeWindowedKStreamIntegrationTest > shouldAggregateWindowedWithGrace[ON_WINDOW_CLOSE_false] STARTED

org.apache.kafka.streams.integration.TimeWindowedKStreamIntegrationTest > shouldAggregateWindowedWithGrace[ON_WINDOW_CLOSE_false] PASSED

org.apache.kafka.streams.integration.TimeWindowedKStreamIntegrationTest > shouldRestoreAfterJoinRestart[ON_WINDOW_CLOSE_false] STARTED

Exception: java.lang.OutOfMemoryError thrown from the UncaughtExceptionHandler in thread "delete-temp-file-shutdown-hook"

Exception: java.lang.OutOfMemoryError thrown from the UncaughtExceptionHandler in thread "delete-temp-file-shutdown-hook"

org.apache.kafka.streams.integration.TimeWindowedKStreamIntegrationTest > shouldRestoreAfterJoinRestart[ON_WINDOW_CLOSE_false] PASSED

BUILD SUCCESSFUL in 3h 12m 32s
212 actionable tasks: 115 executed, 97 up-to-date

See the profiling report at: file:///home/jenkins/jenkins-agent/workspace/Kafka_kafka_3.3/build/reports/profile/profile-2023-09-26-07-24-26.html
A fine-grained performance profile is available: use the --scan option.
[Pipeline] junit
Recording test results

Exception: java.lang.OutOfMemoryError thrown from the UncaughtExceptionHandler in thread "delete-temp-file-shutdown-hook"

Exception: java.lang.OutOfMemoryError thrown from the UncaughtExceptionHandler in thread "delete-temp-file-shutdown-hook"
[Checks API] No suitable checks publisher found.
[Pipeline] echo
Skipping Kafka Streams archetype test for Java 11
[Pipeline] }
[Pipeline] // withEnv
[Pipeline] }
[Pipeline] // withEnv
[Pipeline] }
[Pipeline] // withEnv
[Pipeline] }
[Pipeline] // node
[Pipeline] }
[Pipeline] // timestamps
[Pipeline] }
[Pipeline] // timeout
[Pipeline] }
[Pipeline] // stage
[Pipeline] }

Exception: java.lang.OutOfMemoryError thrown from the UncaughtExceptionHandler in thread "delete-temp-file-shutdown-hook"

Exception: java.lang.OutOfMemoryError thrown from the UncaughtExceptionHandler in thread "delete-temp-file-shutdown-hook"

Exception: java.lang.OutOfMemoryError thrown from the UncaughtExceptionHandler in thread "delete-temp-file-shutdown-hook"

Exception: java.lang.OutOfMemoryError thrown from the UncaughtExceptionHandler in thread "delete-temp-file-shutdown-hook"

Exception: java.lang.OutOfMemoryError thrown from the UncaughtExceptionHandler in thread "delete-temp-file-shutdown-hook"

Exception: java.lang.OutOfMemoryError thrown from the UncaughtExceptionHandler in thread "delete-temp-file-shutdown-hook"

Exception: java.lang.OutOfMemoryError thrown from the UncaughtExceptionHandler in thread "delete-temp-file-shutdown-hook"

Exception: java.lang.OutOfMemoryError thrown from the UncaughtExceptionHandler in thread "delete-temp-file-shutdown-hook"

Exception: java.lang.OutOfMemoryError thrown from the UncaughtExceptionHandler in thread "delete-temp-file-shutdown-hook"

Exception: java.lang.OutOfMemoryError thrown from the UncaughtExceptionHandler in thread "delete-temp-file-shutdown-hook"

Exception: java.lang.OutOfMemoryError thrown from the UncaughtExceptionHandler in thread "delete-temp-file-shutdown-hook"

Exception: java.lang.OutOfMemoryError thrown from the UncaughtExceptionHandler in thread "delete-temp-file-shutdown-hook"

Exception: java.lang.OutOfMemoryError thrown from the UncaughtExceptionHandler in thread "delete-temp-file-shutdown-hook"

Exception: java.lang.OutOfMemoryError thrown from the UncaughtExceptionHandler in thread "delete-temp-file-shutdown-hook"

Exception: java.lang.OutOfMemoryError thrown from the UncaughtExceptionHandler in thread "delete-temp-file-shutdown-hook"

Exception: java.lang.OutOfMemoryError thrown from the UncaughtExceptionHandler in thread "delete-temp-file-shutdown-hook"

Exception: java.lang.OutOfMemoryError thrown from the UncaughtExceptionHandler in thread "delete-temp-file-shutdown-hook"

Exception: java.lang.OutOfMemoryError thrown from the UncaughtExceptionHandler in thread "delete-temp-file-shutdown-hook"

Exception: java.lang.OutOfMemoryError thrown from the UncaughtExceptionHandler in thread "delete-temp-file-shutdown-hook"

Exception: java.lang.OutOfMemoryError thrown from the UncaughtExceptionHandler in thread "delete-temp-file-shutdown-hook"

Exception: java.lang.OutOfMemoryError thrown from the UncaughtExceptionHandler in thread "delete-temp-file-shutdown-hook"

Exception: java.lang.OutOfMemoryError thrown from the UncaughtExceptionHandler in thread "delete-temp-file-shutdown-hook"

Exception: java.lang.OutOfMemoryError thrown from the UncaughtExceptionHandler in thread "delete-temp-file-shutdown-hook"

Exception: java.lang.OutOfMemoryError thrown from the UncaughtExceptionHandler in thread "delete-temp-file-shutdown-hook"

Exception: java.lang.OutOfMemoryError thrown from the UncaughtExceptionHandler in thread "delete-temp-file-shutdown-hook"

Exception: java.lang.OutOfMemoryError thrown from the UncaughtExceptionHandler in thread "delete-temp-file-shutdown-hook"

Exception: java.lang.OutOfMemoryError thrown from the UncaughtExceptionHandler in thread "delete-temp-file-shutdown-hook"

Exception: java.lang.OutOfMemoryError thrown from the UncaughtExceptionHandler in thread "delete-temp-file-shutdown-hook"

Exception: java.lang.OutOfMemoryError thrown from the UncaughtExceptionHandler in thread "delete-temp-file-shutdown-hook"

Exception: java.lang.OutOfMemoryError thrown from the UncaughtExceptionHandler in thread "delete-temp-file-shutdown-hook"
Cancelling nested steps due to timeout
Sending interrupt signal to process
Terminated
script returned exit code 143
[Pipeline] }
[Pipeline] // withEnv
[Pipeline] }
[Pipeline] // withEnv
[Pipeline] }
[Pipeline] // withEnv
[Pipeline] }
[Pipeline] // node
[Pipeline] }
[Pipeline] // timestamps
[Pipeline] }
[Pipeline] // timeout
[Pipeline] }
[Pipeline] // stage
[Pipeline] }
Failed in branch JDK 8 and Scala 2.12
[Pipeline] // parallel
[Pipeline] }
[Pipeline] // stage
[Pipeline] stage
[Pipeline] { (Declarative: Post Actions)
[Pipeline] node
Running on builds30 in /home/jenkins/jenkins-agent/workspace/Kafka_kafka_3.3
[Pipeline] {
[Pipeline] script
[Pipeline] {
[Pipeline] step

Build failed in Jenkins: Kafka » Kafka Branch Builder » 3.3 #190

Posted by Apache Jenkins Server <je...@builds.apache.org>.
See <https://ci-builds.apache.org/job/Kafka/job/kafka/job/3.3/190/display/redirect>

Changes:


------------------------------------------
[...truncated 419853 lines...]
> Task :connect:api:compileTestJava UP-TO-DATE
> Task :connect:api:testClasses UP-TO-DATE
> Task :connect:api:testJar
> Task :connect:api:testSrcJar
> Task :connect:api:publishMavenJavaPublicationToMavenLocal
> Task :connect:api:publishToMavenLocal

> Task :streams:javadoc
/home/jenkins/jenkins-agent/workspace/Kafka_kafka_3.3/streams/src/main/java/org/apache/kafka/streams/kstream/KStream.java:890: warning - Tag @link: reference not found: DefaultPartitioner
/home/jenkins/jenkins-agent/workspace/Kafka_kafka_3.3/streams/src/main/java/org/apache/kafka/streams/kstream/KStream.java:919: warning - Tag @link: reference not found: DefaultPartitioner
/home/jenkins/jenkins-agent/workspace/Kafka_kafka_3.3/streams/src/main/java/org/apache/kafka/streams/kstream/KStream.java:939: warning - Tag @link: reference not found: DefaultPartitioner
/home/jenkins/jenkins-agent/workspace/Kafka_kafka_3.3/streams/src/main/java/org/apache/kafka/streams/kstream/KStream.java:854: warning - Tag @link: reference not found: DefaultPartitioner
/home/jenkins/jenkins-agent/workspace/Kafka_kafka_3.3/streams/src/main/java/org/apache/kafka/streams/kstream/KStream.java:890: warning - Tag @link: reference not found: DefaultPartitioner
/home/jenkins/jenkins-agent/workspace/Kafka_kafka_3.3/streams/src/main/java/org/apache/kafka/streams/kstream/KStream.java:919: warning - Tag @link: reference not found: DefaultPartitioner
/home/jenkins/jenkins-agent/workspace/Kafka_kafka_3.3/streams/src/main/java/org/apache/kafka/streams/kstream/KStream.java:939: warning - Tag @link: reference not found: DefaultPartitioner
/home/jenkins/jenkins-agent/workspace/Kafka_kafka_3.3/streams/src/main/java/org/apache/kafka/streams/kstream/Produced.java:84: warning - Tag @link: reference not found: DefaultPartitioner
/home/jenkins/jenkins-agent/workspace/Kafka_kafka_3.3/streams/src/main/java/org/apache/kafka/streams/kstream/Produced.java:136: warning - Tag @link: reference not found: DefaultPartitioner
/home/jenkins/jenkins-agent/workspace/Kafka_kafka_3.3/streams/src/main/java/org/apache/kafka/streams/kstream/Produced.java:147: warning - Tag @link: reference not found: DefaultPartitioner
/home/jenkins/jenkins-agent/workspace/Kafka_kafka_3.3/streams/src/main/java/org/apache/kafka/streams/kstream/Repartitioned.java:101: warning - Tag @link: reference not found: DefaultPartitioner
/home/jenkins/jenkins-agent/workspace/Kafka_kafka_3.3/streams/src/main/java/org/apache/kafka/streams/kstream/Repartitioned.java:167: warning - Tag @link: reference not found: DefaultPartitioner
/home/jenkins/jenkins-agent/workspace/Kafka_kafka_3.3/streams/src/main/java/org/apache/kafka/streams/TopologyConfig.java:58: warning - Tag @link: missing '#': "org.apache.kafka.streams.StreamsBuilder()"
/home/jenkins/jenkins-agent/workspace/Kafka_kafka_3.3/streams/src/main/java/org/apache/kafka/streams/TopologyConfig.java:58: warning - Tag @link: can't find org.apache.kafka.streams.StreamsBuilder() in org.apache.kafka.streams.TopologyConfig
/home/jenkins/jenkins-agent/workspace/Kafka_kafka_3.3/streams/src/main/java/org/apache/kafka/streams/TopologyDescription.java:38: warning - Tag @link: reference not found: ProcessorContext#forward(Object, Object) forwards
/home/jenkins/jenkins-agent/workspace/Kafka_kafka_3.3/streams/src/main/java/org/apache/kafka/streams/query/Position.java:44: warning - Tag @link: can't find query(Query,
 PositionBound, boolean) in org.apache.kafka.streams.processor.StateStore
/home/jenkins/jenkins-agent/workspace/Kafka_kafka_3.3/streams/src/main/java/org/apache/kafka/streams/query/QueryResult.java:44: warning - Tag @link: can't find query(Query, PositionBound, boolean) in org.apache.kafka.streams.processor.StateStore
/home/jenkins/jenkins-agent/workspace/Kafka_kafka_3.3/streams/src/main/java/org/apache/kafka/streams/query/QueryResult.java:36: warning - Tag @link: can't find query(Query, PositionBound, boolean) in org.apache.kafka.streams.processor.StateStore
/home/jenkins/jenkins-agent/workspace/Kafka_kafka_3.3/streams/src/main/java/org/apache/kafka/streams/query/QueryResult.java:57: warning - Tag @link: can't find query(Query, PositionBound, boolean) in org.apache.kafka.streams.processor.StateStore
/home/jenkins/jenkins-agent/workspace/Kafka_kafka_3.3/streams/src/main/java/org/apache/kafka/streams/query/QueryResult.java:74: warning - Tag @link: can't find query(Query, PositionBound, boolean) in org.apache.kafka.streams.processor.StateStore
/home/jenkins/jenkins-agent/workspace/Kafka_kafka_3.3/streams/src/main/java/org/apache/kafka/streams/query/QueryResult.java:110: warning - Tag @link: reference not found: this#getResult()
/home/jenkins/jenkins-agent/workspace/Kafka_kafka_3.3/streams/src/main/java/org/apache/kafka/streams/query/QueryResult.java:117: warning - Tag @link: reference not found: this#getFailureReason()
/home/jenkins/jenkins-agent/workspace/Kafka_kafka_3.3/streams/src/main/java/org/apache/kafka/streams/query/QueryResult.java:117: warning - Tag @link: reference not found: this#getFailureMessage()
/home/jenkins/jenkins-agent/workspace/Kafka_kafka_3.3/streams/src/main/java/org/apache/kafka/streams/query/QueryResult.java:155: warning - Tag @link: reference not found: this#isSuccess()
/home/jenkins/jenkins-agent/workspace/Kafka_kafka_3.3/streams/src/main/java/org/apache/kafka/streams/query/QueryResult.java:155: warning - Tag @link: reference not found: this#isFailure()
/home/jenkins/jenkins-agent/workspace/Kafka_kafka_3.3/streams/src/main/java/org/apache/kafka/streams/kstream/KStream.java:890: warning - Tag @link: reference not found: DefaultPartitioner
/home/jenkins/jenkins-agent/workspace/Kafka_kafka_3.3/streams/src/main/java/org/apache/kafka/streams/kstream/KStream.java:919: warning - Tag @link: reference not found: DefaultPartitioner
/home/jenkins/jenkins-agent/workspace/Kafka_kafka_3.3/streams/src/main/java/org/apache/kafka/streams/kstream/KStream.java:939: warning - Tag @link: reference not found: DefaultPartitioner
29 warnings

> Task :streams:javadocJar
> Task :streams:compileTestJava UP-TO-DATE
> Task :streams:testClasses UP-TO-DATE
> Task :streams:testJar
> Task :streams:testSrcJar
> Task :streams:publishMavenJavaPublicationToMavenLocal
> Task :streams:publishToMavenLocal

> Task :clients:javadoc
/home/jenkins/jenkins-agent/workspace/Kafka_kafka_3.3/clients/src/main/java/org/apache/kafka/common/security/oauthbearer/secured/OAuthBearerLoginCallbackHandler.java:147: warning - Tag @link: reference not found: 
1 warning

> Task :clients:javadocJar
> Task :clients:testJar
> Task :clients:testSrcJar
> Task :clients:publishMavenJavaPublicationToMavenLocal
> Task :clients:publishToMavenLocal

Deprecated Gradle features were used in this build, making it incompatible with Gradle 8.0.

You can use '--warning-mode all' to show the individual deprecation warnings and determine if they come from your own scripts or plugins.

See https://docs.gradle.org/7.4.2/userguide/command_line_interface.html#sec:command_line_warnings

Execution optimizations have been disabled for 2 invalid unit(s) of work during this build to ensure correctness.
Please consult deprecation warnings for more details.

BUILD SUCCESSFUL in 30s
79 actionable tasks: 33 executed, 46 up-to-date
[Pipeline] sh
+ grep ^version= gradle.properties
+ cut -d= -f 2
[Pipeline] dir
Running in /home/jenkins/jenkins-agent/workspace/Kafka_kafka_3.3/streams/quickstart
[Pipeline] {
[Pipeline] sh
+ mvn clean install -Dgpg.skip
[INFO] Scanning for projects...
[INFO] ------------------------------------------------------------------------
[INFO] Reactor Build Order:
[INFO] 
[INFO] Kafka Streams :: Quickstart                                        [pom]
[INFO] streams-quickstart-java                                [maven-archetype]
[INFO] 
[INFO] ----------------< org.apache.kafka:streams-quickstart >-----------------
[INFO] Building Kafka Streams :: Quickstart 3.3.3-SNAPSHOT                [1/2]
[INFO]   from pom.xml
[INFO] --------------------------------[ pom ]---------------------------------
[INFO] 
[INFO] --- clean:3.0.0:clean (default-clean) @ streams-quickstart ---
[INFO] 
[INFO] --- remote-resources:1.5:process (process-resource-bundles) @ streams-quickstart ---
[INFO] 
[INFO] --- site:3.5.1:attach-descriptor (attach-descriptor) @ streams-quickstart ---
[INFO] 
[INFO] --- gpg:1.6:sign (sign-artifacts) @ streams-quickstart ---
[INFO] 
[INFO] --- install:2.5.2:install (default-install) @ streams-quickstart ---
[INFO] Installing /home/jenkins/jenkins-agent/workspace/Kafka_kafka_3.3/streams/quickstart/pom.xml to /home/jenkins/.m2/repository/org/apache/kafka/streams-quickstart/3.3.3-SNAPSHOT/streams-quickstart-3.3.3-SNAPSHOT.pom
[INFO] 
[INFO] --------------< org.apache.kafka:streams-quickstart-java >--------------
[INFO] Building streams-quickstart-java 3.3.3-SNAPSHOT                    [2/2]
[INFO]   from java/pom.xml
[INFO] --------------------------[ maven-archetype ]---------------------------
[INFO] 
[INFO] --- clean:3.0.0:clean (default-clean) @ streams-quickstart-java ---
[INFO] 
[INFO] --- remote-resources:1.5:process (process-resource-bundles) @ streams-quickstart-java ---
[INFO] 
[INFO] --- resources:2.7:resources (default-resources) @ streams-quickstart-java ---
[INFO] Using 'UTF-8' encoding to copy filtered resources.
[INFO] Copying 6 resources
[INFO] Copying 3 resources
[INFO] 
[INFO] --- resources:2.7:testResources (default-testResources) @ streams-quickstart-java ---
[INFO] Using 'UTF-8' encoding to copy filtered resources.
[INFO] Copying 2 resources
[INFO] Copying 3 resources
[INFO] 
[INFO] --- archetype:2.2:jar (default-jar) @ streams-quickstart-java ---
[INFO] Building archetype jar: /home/jenkins/jenkins-agent/workspace/Kafka_kafka_3.3/streams/quickstart/java/target/streams-quickstart-java-3.3.3-SNAPSHOT
[INFO] 
[INFO] --- site:3.5.1:attach-descriptor (attach-descriptor) @ streams-quickstart-java ---
[INFO] 
[INFO] --- archetype:2.2:integration-test (default-integration-test) @ streams-quickstart-java ---
[WARNING]  Parameter 'skip' (user property 'archetype.test.skip') is read-only, must not be used in configuration
[INFO] 
[INFO] --- gpg:1.6:sign (sign-artifacts) @ streams-quickstart-java ---
[INFO] 
[INFO] --- install:2.5.2:install (default-install) @ streams-quickstart-java ---
[INFO] Installing /home/jenkins/jenkins-agent/workspace/Kafka_kafka_3.3/streams/quickstart/java/target/streams-quickstart-java-3.3.3-SNAPSHOT.jar to /home/jenkins/.m2/repository/org/apache/kafka/streams-quickstart-java/3.3.3-SNAPSHOT/streams-quickstart-java-3.3.3-SNAPSHOT.jar
[INFO] Installing /home/jenkins/jenkins-agent/workspace/Kafka_kafka_3.3/streams/quickstart/java/pom.xml to /home/jenkins/.m2/repository/org/apache/kafka/streams-quickstart-java/3.3.3-SNAPSHOT/streams-quickstart-java-3.3.3-SNAPSHOT.pom
[INFO] 
[INFO] --- archetype:2.2:update-local-catalog (default-update-local-catalog) @ streams-quickstart-java ---
[INFO] ------------------------------------------------------------------------
[INFO] Reactor Summary for Kafka Streams :: Quickstart 3.3.3-SNAPSHOT:
[INFO] 
[INFO] Kafka Streams :: Quickstart ........................ SUCCESS [  3.264 s]
[INFO] streams-quickstart-java ............................ SUCCESS [  1.082 s]
[INFO] ------------------------------------------------------------------------
[INFO] BUILD SUCCESS
[INFO] ------------------------------------------------------------------------
[INFO] Total time:  4.760 s
[INFO] Finished at: 2023-09-08T05:06:10Z
[INFO] ------------------------------------------------------------------------
[Pipeline] dir
Running in /home/jenkins/jenkins-agent/workspace/Kafka_kafka_3.3/streams/quickstart/test-streams-archetype
[Pipeline] {
[Pipeline] sh
+ echo Y
+ mvn archetype:generate -DarchetypeCatalog=local -DarchetypeGroupId=org.apache.kafka -DarchetypeArtifactId=streams-quickstart-java -DarchetypeVersion=3.3.3-SNAPSHOT -DgroupId=streams.examples -DartifactId=streams.examples -Dversion=0.1 -Dpackage=myapps
[INFO] Scanning for projects...
[INFO] 
[INFO] ------------------< org.apache.maven:standalone-pom >-------------------
[INFO] Building Maven Stub Project (No POM) 1
[INFO] --------------------------------[ pom ]---------------------------------
[INFO] 
[INFO] >>> archetype:3.2.1:generate (default-cli) > generate-sources @ standalone-pom >>>
[INFO] 
[INFO] <<< archetype:3.2.1:generate (default-cli) < generate-sources @ standalone-pom <<<
[INFO] 
[INFO] 
[INFO] --- archetype:3.2.1:generate (default-cli) @ standalone-pom ---
[INFO] Generating project in Interactive mode
[WARNING] Archetype not found in any catalog. Falling back to central repository.
[WARNING] Add a repository with id 'archetype' in your settings.xml if archetype's repository is elsewhere.
[INFO] Using property: groupId = streams.examples
[INFO] Using property: artifactId = streams.examples
[INFO] Using property: version = 0.1
[INFO] Using property: package = myapps
Confirm properties configuration:
groupId: streams.examples
artifactId: streams.examples
version: 0.1
package: myapps
 Y: : [INFO] ----------------------------------------------------------------------------
[INFO] Using following parameters for creating project from Archetype: streams-quickstart-java:3.3.3-SNAPSHOT
[INFO] ----------------------------------------------------------------------------
[INFO] Parameter: groupId, Value: streams.examples
[INFO] Parameter: artifactId, Value: streams.examples
[INFO] Parameter: version, Value: 0.1
[INFO] Parameter: package, Value: myapps
[INFO] Parameter: packageInPathFormat, Value: myapps
[INFO] Parameter: package, Value: myapps
[INFO] Parameter: version, Value: 0.1
[INFO] Parameter: groupId, Value: streams.examples
[INFO] Parameter: artifactId, Value: streams.examples
[INFO] Project created from Archetype in dir: /home/jenkins/jenkins-agent/workspace/Kafka_kafka_3.3/streams/quickstart/test-streams-archetype/streams.examples
[INFO] ------------------------------------------------------------------------
[INFO] BUILD SUCCESS
[INFO] ------------------------------------------------------------------------
[INFO] Total time:  3.119 s
[INFO] Finished at: 2023-09-08T05:06:17Z
[INFO] ------------------------------------------------------------------------
[Pipeline] dir
Running in /home/jenkins/jenkins-agent/workspace/Kafka_kafka_3.3/streams/quickstart/test-streams-archetype/streams.examples
[Pipeline] {
[Pipeline] sh
+ mvn compile
[INFO] Scanning for projects...
[INFO] 
[INFO] -----------------< streams.examples:streams.examples >------------------
[INFO] Building Kafka Streams Quickstart :: Java 0.1
[INFO]   from pom.xml
[INFO] --------------------------------[ jar ]---------------------------------
[INFO] 
[INFO] --- resources:3.3.1:resources (default-resources) @ streams.examples ---
[INFO] Copying 1 resource from src/main/resources to target/classes
[INFO] 
[INFO] --- compiler:3.1:compile (default-compile) @ streams.examples ---
[INFO] Changes detected - recompiling the module!
[INFO] Compiling 3 source files to /home/jenkins/jenkins-agent/workspace/Kafka_kafka_3.3/streams/quickstart/test-streams-archetype/streams.examples/target/classes
[INFO] ------------------------------------------------------------------------
[INFO] BUILD SUCCESS
[INFO] ------------------------------------------------------------------------
[INFO] Total time:  3.055 s
[INFO] Finished at: 2023-09-08T05:06:24Z
[INFO] ------------------------------------------------------------------------
[Pipeline] }
[Pipeline] // dir
[Pipeline] }
[Pipeline] // dir
[Pipeline] }
[Pipeline] // dir
[Pipeline] }
[Pipeline] // withEnv
[Pipeline] }
[Pipeline] // withEnv
[Pipeline] }
[Pipeline] // withEnv
[Pipeline] }
[Pipeline] // node
[Pipeline] }
[Pipeline] // timestamps
[Pipeline] }
[Pipeline] // timeout
[Pipeline] }
[Pipeline] // stage
[Pipeline] }
[Pipeline] // parallel
[Pipeline] }
[Pipeline] // stage
[Pipeline] stage
[Pipeline] { (Declarative: Post Actions)
[Pipeline] node
Running on builds30 in /home/jenkins/jenkins-agent/workspace/Kafka_kafka_3.3
[Pipeline] {
[Pipeline] script
[Pipeline] {
[Pipeline] step

Build failed in Jenkins: Kafka » Kafka Branch Builder » 3.3 #189

Posted by Apache Jenkins Server <je...@builds.apache.org>.
See <https://ci-builds.apache.org/job/Kafka/job/kafka/job/3.3/189/display/redirect>

Changes:


------------------------------------------
[...truncated 417461 lines...]
org.apache.kafka.streams.integration.StoreQueryIntegrationTest > shouldQuerySpecificStalePartitionStoresMultiStreamThreadsNamedTopology PASSED

org.apache.kafka.streams.integration.StreamStreamJoinIntegrationTest > testInnerRepartitioned[caching enabled = true] STARTED

org.apache.kafka.streams.integration.StreamStreamJoinIntegrationTest > testInnerRepartitioned[caching enabled = true] PASSED

org.apache.kafka.streams.integration.StreamStreamJoinIntegrationTest > testOuterRepartitioned[caching enabled = true] STARTED

org.apache.kafka.streams.integration.StreamStreamJoinIntegrationTest > testOuterRepartitioned[caching enabled = true] PASSED

org.apache.kafka.streams.integration.StreamStreamJoinIntegrationTest > testInner[caching enabled = true] STARTED

org.apache.kafka.streams.integration.StreamStreamJoinIntegrationTest > testInner[caching enabled = true] PASSED

org.apache.kafka.streams.integration.StreamStreamJoinIntegrationTest > testOuter[caching enabled = true] STARTED

org.apache.kafka.streams.integration.StreamStreamJoinIntegrationTest > testOuter[caching enabled = true] PASSED

org.apache.kafka.streams.integration.StreamStreamJoinIntegrationTest > testLeft[caching enabled = true] STARTED

org.apache.kafka.streams.integration.StreamStreamJoinIntegrationTest > testLeft[caching enabled = true] PASSED

org.apache.kafka.streams.integration.StreamStreamJoinIntegrationTest > testMultiInner[caching enabled = true] STARTED

org.apache.kafka.streams.integration.StreamStreamJoinIntegrationTest > testMultiInner[caching enabled = true] PASSED

org.apache.kafka.streams.integration.StreamStreamJoinIntegrationTest > testLeftRepartitioned[caching enabled = true] STARTED

org.apache.kafka.streams.integration.StreamStreamJoinIntegrationTest > testLeftRepartitioned[caching enabled = true] PASSED

org.apache.kafka.streams.integration.StreamStreamJoinIntegrationTest > testSelfJoin[caching enabled = true] STARTED

org.apache.kafka.streams.integration.StreamStreamJoinIntegrationTest > testSelfJoin[caching enabled = true] PASSED

org.apache.kafka.streams.integration.StreamStreamJoinIntegrationTest > testInnerRepartitioned[caching enabled = false] STARTED

org.apache.kafka.streams.integration.StreamStreamJoinIntegrationTest > testInnerRepartitioned[caching enabled = false] PASSED

org.apache.kafka.streams.integration.StreamStreamJoinIntegrationTest > testOuterRepartitioned[caching enabled = false] STARTED

org.apache.kafka.streams.integration.StreamStreamJoinIntegrationTest > testOuterRepartitioned[caching enabled = false] PASSED

org.apache.kafka.streams.integration.StreamStreamJoinIntegrationTest > testInner[caching enabled = false] STARTED

org.apache.kafka.streams.integration.StreamStreamJoinIntegrationTest > testInner[caching enabled = false] PASSED

org.apache.kafka.streams.integration.StreamStreamJoinIntegrationTest > testOuter[caching enabled = false] STARTED

org.apache.kafka.streams.integration.StreamStreamJoinIntegrationTest > testOuter[caching enabled = false] PASSED

org.apache.kafka.streams.integration.StreamStreamJoinIntegrationTest > testLeft[caching enabled = false] STARTED

org.apache.kafka.streams.integration.StreamStreamJoinIntegrationTest > testLeft[caching enabled = false] PASSED

org.apache.kafka.streams.integration.StreamStreamJoinIntegrationTest > testMultiInner[caching enabled = false] STARTED

org.apache.kafka.streams.integration.StreamStreamJoinIntegrationTest > testMultiInner[caching enabled = false] PASSED

org.apache.kafka.streams.integration.StreamStreamJoinIntegrationTest > testLeftRepartitioned[caching enabled = false] STARTED

org.apache.kafka.streams.integration.StreamStreamJoinIntegrationTest > testLeftRepartitioned[caching enabled = false] PASSED

org.apache.kafka.streams.integration.StreamStreamJoinIntegrationTest > testSelfJoin[caching enabled = false] STARTED

org.apache.kafka.streams.integration.StreamStreamJoinIntegrationTest > testSelfJoin[caching enabled = false] PASSED

org.apache.kafka.streams.integration.StreamTableJoinTopologyOptimizationIntegrationTest > shouldDoStreamTableJoinWithDifferentNumberOfPartitions[Optimization = all] STARTED

org.apache.kafka.streams.integration.StreamTableJoinTopologyOptimizationIntegrationTest > shouldDoStreamTableJoinWithDifferentNumberOfPartitions[Optimization = all] PASSED

org.apache.kafka.streams.integration.StreamTableJoinTopologyOptimizationIntegrationTest > shouldDoStreamTableJoinWithDifferentNumberOfPartitions[Optimization = none] STARTED

org.apache.kafka.streams.integration.StreamTableJoinTopologyOptimizationIntegrationTest > shouldDoStreamTableJoinWithDifferentNumberOfPartitions[Optimization = none] PASSED

org.apache.kafka.streams.integration.StreamsUpgradeTestIntegrationTest > testVersionProbingUpgrade STARTED

org.apache.kafka.streams.integration.StreamsUpgradeTestIntegrationTest > testVersionProbingUpgrade PASSED

org.apache.kafka.streams.integration.SuppressionIntegrationTest > shouldInheritSerdes STARTED

org.apache.kafka.streams.integration.SuppressionIntegrationTest > shouldInheritSerdes PASSED

org.apache.kafka.streams.integration.SuppressionIntegrationTest > shouldShutdownWhenRecordConstraintIsViolated STARTED

org.apache.kafka.streams.integration.SuppressionIntegrationTest > shouldShutdownWhenRecordConstraintIsViolated PASSED

org.apache.kafka.streams.integration.SuppressionIntegrationTest > shouldUseDefaultSerdes STARTED

org.apache.kafka.streams.integration.SuppressionIntegrationTest > shouldUseDefaultSerdes PASSED

org.apache.kafka.streams.integration.SuppressionIntegrationTest > shouldAllowDisablingChangelog STARTED

org.apache.kafka.streams.integration.SuppressionIntegrationTest > shouldAllowDisablingChangelog PASSED

org.apache.kafka.streams.integration.SuppressionIntegrationTest > shouldAllowOverridingChangelogConfig STARTED

org.apache.kafka.streams.integration.SuppressionIntegrationTest > shouldAllowOverridingChangelogConfig PASSED

org.apache.kafka.streams.integration.SuppressionIntegrationTest > shouldShutdownWhenBytesConstraintIsViolated STARTED

org.apache.kafka.streams.integration.SuppressionIntegrationTest > shouldShutdownWhenBytesConstraintIsViolated PASSED

org.apache.kafka.streams.integration.SuppressionIntegrationTest > shouldCreateChangelogByDefault STARTED

org.apache.kafka.streams.integration.SuppressionIntegrationTest > shouldCreateChangelogByDefault PASSED

org.apache.kafka.streams.integration.TaskAssignorIntegrationTest > shouldProperlyConfigureTheAssignor STARTED

org.apache.kafka.streams.integration.TaskAssignorIntegrationTest > shouldProperlyConfigureTheAssignor PASSED

org.apache.kafka.streams.integration.TimeWindowedKStreamIntegrationTest > shouldThrowUnlimitedWindows[ON_WINDOW_UPDATE_true] STARTED

org.apache.kafka.streams.integration.TimeWindowedKStreamIntegrationTest > shouldThrowUnlimitedWindows[ON_WINDOW_UPDATE_true] PASSED

org.apache.kafka.streams.integration.TimeWindowedKStreamIntegrationTest > shouldAggregateWindowedWithNoGrace[ON_WINDOW_UPDATE_true] STARTED

org.apache.kafka.streams.integration.TimeWindowedKStreamIntegrationTest > shouldAggregateWindowedWithNoGrace[ON_WINDOW_UPDATE_true] PASSED

org.apache.kafka.streams.integration.TimeWindowedKStreamIntegrationTest > shouldAggregateWindowedWithGrace[ON_WINDOW_UPDATE_true] STARTED

org.apache.kafka.streams.integration.TimeWindowedKStreamIntegrationTest > shouldAggregateWindowedWithGrace[ON_WINDOW_UPDATE_true] PASSED

org.apache.kafka.streams.integration.TimeWindowedKStreamIntegrationTest > shouldRestoreAfterJoinRestart[ON_WINDOW_UPDATE_true] STARTED

org.apache.kafka.streams.integration.TimeWindowedKStreamIntegrationTest > shouldRestoreAfterJoinRestart[ON_WINDOW_UPDATE_true] PASSED

org.apache.kafka.streams.integration.TimeWindowedKStreamIntegrationTest > shouldThrowUnlimitedWindows[ON_WINDOW_UPDATE_false] STARTED

org.apache.kafka.streams.integration.TimeWindowedKStreamIntegrationTest > shouldThrowUnlimitedWindows[ON_WINDOW_UPDATE_false] PASSED

org.apache.kafka.streams.integration.TimeWindowedKStreamIntegrationTest > shouldAggregateWindowedWithNoGrace[ON_WINDOW_UPDATE_false] STARTED

org.apache.kafka.streams.integration.TimeWindowedKStreamIntegrationTest > shouldAggregateWindowedWithNoGrace[ON_WINDOW_UPDATE_false] PASSED

org.apache.kafka.streams.integration.TimeWindowedKStreamIntegrationTest > shouldAggregateWindowedWithGrace[ON_WINDOW_UPDATE_false] STARTED

org.apache.kafka.streams.integration.TimeWindowedKStreamIntegrationTest > shouldAggregateWindowedWithGrace[ON_WINDOW_UPDATE_false] PASSED

org.apache.kafka.streams.integration.TimeWindowedKStreamIntegrationTest > shouldRestoreAfterJoinRestart[ON_WINDOW_UPDATE_false] STARTED

org.apache.kafka.streams.integration.TimeWindowedKStreamIntegrationTest > shouldRestoreAfterJoinRestart[ON_WINDOW_UPDATE_false] PASSED

org.apache.kafka.streams.integration.TimeWindowedKStreamIntegrationTest > shouldThrowUnlimitedWindows[ON_WINDOW_CLOSE_true] STARTED

org.apache.kafka.streams.integration.TimeWindowedKStreamIntegrationTest > shouldThrowUnlimitedWindows[ON_WINDOW_CLOSE_true] PASSED

org.apache.kafka.streams.integration.TimeWindowedKStreamIntegrationTest > shouldAggregateWindowedWithNoGrace[ON_WINDOW_CLOSE_true] STARTED

org.apache.kafka.streams.integration.TimeWindowedKStreamIntegrationTest > shouldAggregateWindowedWithNoGrace[ON_WINDOW_CLOSE_true] PASSED

org.apache.kafka.streams.integration.TimeWindowedKStreamIntegrationTest > shouldAggregateWindowedWithGrace[ON_WINDOW_CLOSE_true] STARTED

org.apache.kafka.streams.integration.TimeWindowedKStreamIntegrationTest > shouldAggregateWindowedWithGrace[ON_WINDOW_CLOSE_true] PASSED

org.apache.kafka.streams.integration.TimeWindowedKStreamIntegrationTest > shouldRestoreAfterJoinRestart[ON_WINDOW_CLOSE_true] STARTED

org.apache.kafka.streams.integration.TimeWindowedKStreamIntegrationTest > shouldRestoreAfterJoinRestart[ON_WINDOW_CLOSE_true] PASSED

org.apache.kafka.streams.integration.TimeWindowedKStreamIntegrationTest > shouldThrowUnlimitedWindows[ON_WINDOW_CLOSE_false] STARTED

org.apache.kafka.streams.integration.TimeWindowedKStreamIntegrationTest > shouldThrowUnlimitedWindows[ON_WINDOW_CLOSE_false] PASSED

org.apache.kafka.streams.integration.TimeWindowedKStreamIntegrationTest > shouldAggregateWindowedWithNoGrace[ON_WINDOW_CLOSE_false] STARTED

org.apache.kafka.streams.integration.TimeWindowedKStreamIntegrationTest > shouldAggregateWindowedWithNoGrace[ON_WINDOW_CLOSE_false] PASSED

org.apache.kafka.streams.integration.TimeWindowedKStreamIntegrationTest > shouldAggregateWindowedWithGrace[ON_WINDOW_CLOSE_false] STARTED

org.apache.kafka.streams.integration.TimeWindowedKStreamIntegrationTest > shouldAggregateWindowedWithGrace[ON_WINDOW_CLOSE_false] PASSED

org.apache.kafka.streams.integration.TimeWindowedKStreamIntegrationTest > shouldRestoreAfterJoinRestart[ON_WINDOW_CLOSE_false] STARTED

org.apache.kafka.streams.integration.TimeWindowedKStreamIntegrationTest > shouldRestoreAfterJoinRestart[ON_WINDOW_CLOSE_false] PASSED

BUILD SUCCESSFUL in 2h 30m 23s
212 actionable tasks: 115 executed, 97 up-to-date

See the profiling report at: file:///home/jenkins/jenkins-agent/workspace/Kafka_kafka_3.3/build/reports/profile/profile-2023-08-30-19-55-55.html
A fine-grained performance profile is available: use the --scan option.
[Pipeline] junit
Recording test results
[Checks API] No suitable checks publisher found.
[Pipeline] echo
Skipping Kafka Streams archetype test for Java 17
[Pipeline] }
[Pipeline] // withEnv
[Pipeline] }
[Pipeline] // withEnv
[Pipeline] }
[Pipeline] // withEnv
[Pipeline] }
[Pipeline] // node
[Pipeline] }
[Pipeline] // timestamps
[Pipeline] }
[Pipeline] // timeout
[Pipeline] }
[Pipeline] // stage
[Pipeline] }
Cancelling nested steps due to timeout
Cancelling nested steps due to timeout
Sending interrupt signal to process
After 20s process did not stop
Sending interrupt signal to process
After 20s process did not stop
Terminated
[Pipeline] }
[Pipeline] }
[Pipeline] // withEnv
[Pipeline] // withEnv
[Pipeline] }
[Pipeline] }
[Pipeline] // withEnv
[Pipeline] // withEnv
[Pipeline] }
[Pipeline] }
[Pipeline] // withEnv
[Pipeline] // withEnv
[Pipeline] }
[Pipeline] }
[Pipeline] // node
[Pipeline] // node
[Pipeline] }
[Pipeline] }
[Pipeline] // timestamps
[Pipeline] // timestamps
[Pipeline] }
[Pipeline] }
[Pipeline] // timeout
[Pipeline] // timeout
[Pipeline] }
[Pipeline] }
[Pipeline] // stage
[Pipeline] // stage
[Pipeline] }
Failed in branch JDK 8 and Scala 2.12
[Pipeline] }
Failed in branch JDK 8 and Scala 2.13
[Pipeline] // parallel
[Pipeline] }
[Pipeline] // stage
[Pipeline] stage
[Pipeline] { (Declarative: Post Actions)
[Pipeline] node
Running on builds30 in /home/jenkins/jenkins-agent/workspace/Kafka_kafka_3.3
[Pipeline] {
[Pipeline] script
[Pipeline] {
[Pipeline] step

Build failed in Jenkins: Kafka » Kafka Branch Builder » 3.3 #188

Posted by Apache Jenkins Server <je...@builds.apache.org>.
See <https://ci-builds.apache.org/job/Kafka/job/kafka/job/3.3/188/display/redirect>

Changes:


------------------------------------------
[...truncated 421311 lines...]
> Task :connect:api:testSrcJar
> Task :connect:api:publishMavenJavaPublicationToMavenLocal
> Task :connect:api:publishToMavenLocal

> Task :streams:javadoc
/home/jenkins/jenkins-agent/workspace/Kafka_kafka_3.3/streams/src/main/java/org/apache/kafka/streams/kstream/KStream.java:890: warning - Tag @link: reference not found: DefaultPartitioner
/home/jenkins/jenkins-agent/workspace/Kafka_kafka_3.3/streams/src/main/java/org/apache/kafka/streams/kstream/KStream.java:919: warning - Tag @link: reference not found: DefaultPartitioner
/home/jenkins/jenkins-agent/workspace/Kafka_kafka_3.3/streams/src/main/java/org/apache/kafka/streams/kstream/KStream.java:939: warning - Tag @link: reference not found: DefaultPartitioner
/home/jenkins/jenkins-agent/workspace/Kafka_kafka_3.3/streams/src/main/java/org/apache/kafka/streams/kstream/KStream.java:854: warning - Tag @link: reference not found: DefaultPartitioner
/home/jenkins/jenkins-agent/workspace/Kafka_kafka_3.3/streams/src/main/java/org/apache/kafka/streams/kstream/KStream.java:890: warning - Tag @link: reference not found: DefaultPartitioner
/home/jenkins/jenkins-agent/workspace/Kafka_kafka_3.3/streams/src/main/java/org/apache/kafka/streams/kstream/KStream.java:919: warning - Tag @link: reference not found: DefaultPartitioner
/home/jenkins/jenkins-agent/workspace/Kafka_kafka_3.3/streams/src/main/java/org/apache/kafka/streams/kstream/KStream.java:939: warning - Tag @link: reference not found: DefaultPartitioner
/home/jenkins/jenkins-agent/workspace/Kafka_kafka_3.3/streams/src/main/java/org/apache/kafka/streams/kstream/Produced.java:84: warning - Tag @link: reference not found: DefaultPartitioner
/home/jenkins/jenkins-agent/workspace/Kafka_kafka_3.3/streams/src/main/java/org/apache/kafka/streams/kstream/Produced.java:136: warning - Tag @link: reference not found: DefaultPartitioner
/home/jenkins/jenkins-agent/workspace/Kafka_kafka_3.3/streams/src/main/java/org/apache/kafka/streams/kstream/Produced.java:147: warning - Tag @link: reference not found: DefaultPartitioner
/home/jenkins/jenkins-agent/workspace/Kafka_kafka_3.3/streams/src/main/java/org/apache/kafka/streams/kstream/Repartitioned.java:101: warning - Tag @link: reference not found: DefaultPartitioner
/home/jenkins/jenkins-agent/workspace/Kafka_kafka_3.3/streams/src/main/java/org/apache/kafka/streams/kstream/Repartitioned.java:167: warning - Tag @link: reference not found: DefaultPartitioner
/home/jenkins/jenkins-agent/workspace/Kafka_kafka_3.3/streams/src/main/java/org/apache/kafka/streams/TopologyConfig.java:58: warning - Tag @link: missing '#': "org.apache.kafka.streams.StreamsBuilder()"
/home/jenkins/jenkins-agent/workspace/Kafka_kafka_3.3/streams/src/main/java/org/apache/kafka/streams/TopologyConfig.java:58: warning - Tag @link: can't find org.apache.kafka.streams.StreamsBuilder() in org.apache.kafka.streams.TopologyConfig
/home/jenkins/jenkins-agent/workspace/Kafka_kafka_3.3/streams/src/main/java/org/apache/kafka/streams/TopologyDescription.java:38: warning - Tag @link: reference not found: ProcessorContext#forward(Object, Object) forwards
/home/jenkins/jenkins-agent/workspace/Kafka_kafka_3.3/streams/src/main/java/org/apache/kafka/streams/query/Position.java:44: warning - Tag @link: can't find query(Query,
 PositionBound, boolean) in org.apache.kafka.streams.processor.StateStore
/home/jenkins/jenkins-agent/workspace/Kafka_kafka_3.3/streams/src/main/java/org/apache/kafka/streams/query/QueryResult.java:44: warning - Tag @link: can't find query(Query, PositionBound, boolean) in org.apache.kafka.streams.processor.StateStore
/home/jenkins/jenkins-agent/workspace/Kafka_kafka_3.3/streams/src/main/java/org/apache/kafka/streams/query/QueryResult.java:36: warning - Tag @link: can't find query(Query, PositionBound, boolean) in org.apache.kafka.streams.processor.StateStore
/home/jenkins/jenkins-agent/workspace/Kafka_kafka_3.3/streams/src/main/java/org/apache/kafka/streams/query/QueryResult.java:57: warning - Tag @link: can't find query(Query, PositionBound, boolean) in org.apache.kafka.streams.processor.StateStore
/home/jenkins/jenkins-agent/workspace/Kafka_kafka_3.3/streams/src/main/java/org/apache/kafka/streams/query/QueryResult.java:74: warning - Tag @link: can't find query(Query, PositionBound, boolean) in org.apache.kafka.streams.processor.StateStore
/home/jenkins/jenkins-agent/workspace/Kafka_kafka_3.3/streams/src/main/java/org/apache/kafka/streams/query/QueryResult.java:110: warning - Tag @link: reference not found: this#getResult()
/home/jenkins/jenkins-agent/workspace/Kafka_kafka_3.3/streams/src/main/java/org/apache/kafka/streams/query/QueryResult.java:117: warning - Tag @link: reference not found: this#getFailureReason()
/home/jenkins/jenkins-agent/workspace/Kafka_kafka_3.3/streams/src/main/java/org/apache/kafka/streams/query/QueryResult.java:117: warning - Tag @link: reference not found: this#getFailureMessage()
/home/jenkins/jenkins-agent/workspace/Kafka_kafka_3.3/streams/src/main/java/org/apache/kafka/streams/query/QueryResult.java:155: warning - Tag @link: reference not found: this#isSuccess()
/home/jenkins/jenkins-agent/workspace/Kafka_kafka_3.3/streams/src/main/java/org/apache/kafka/streams/query/QueryResult.java:155: warning - Tag @link: reference not found: this#isFailure()
/home/jenkins/jenkins-agent/workspace/Kafka_kafka_3.3/streams/src/main/java/org/apache/kafka/streams/kstream/KStream.java:890: warning - Tag @link: reference not found: DefaultPartitioner
/home/jenkins/jenkins-agent/workspace/Kafka_kafka_3.3/streams/src/main/java/org/apache/kafka/streams/kstream/KStream.java:919: warning - Tag @link: reference not found: DefaultPartitioner
/home/jenkins/jenkins-agent/workspace/Kafka_kafka_3.3/streams/src/main/java/org/apache/kafka/streams/kstream/KStream.java:939: warning - Tag @link: reference not found: DefaultPartitioner
29 warnings

> Task :streams:javadocJar
> Task :streams:compileTestJava UP-TO-DATE
> Task :streams:testClasses UP-TO-DATE
> Task :streams:testJar
> Task :streams:testSrcJar

> Task :clients:javadoc
/home/jenkins/jenkins-agent/workspace/Kafka_kafka_3.3/clients/src/main/java/org/apache/kafka/common/security/oauthbearer/secured/OAuthBearerLoginCallbackHandler.java:147: warning - Tag @link: reference not found: 

> Task :streams:publishMavenJavaPublicationToMavenLocal
> Task :streams:publishToMavenLocal

> Task :clients:javadoc
1 warning

> Task :clients:javadocJar
> Task :clients:testJar
> Task :clients:testSrcJar
> Task :clients:publishMavenJavaPublicationToMavenLocal
> Task :clients:publishToMavenLocal

Deprecated Gradle features were used in this build, making it incompatible with Gradle 8.0.

You can use '--warning-mode all' to show the individual deprecation warnings and determine if they come from your own scripts or plugins.

See https://docs.gradle.org/7.4.2/userguide/command_line_interface.html#sec:command_line_warnings

Execution optimizations have been disabled for 2 invalid unit(s) of work during this build to ensure correctness.
Please consult deprecation warnings for more details.

BUILD SUCCESSFUL in 30s
79 actionable tasks: 33 executed, 46 up-to-date
[Pipeline] sh
+ grep ^version= gradle.properties
+ cut -d= -f 2
[Pipeline] dir
Running in /home/jenkins/jenkins-agent/workspace/Kafka_kafka_3.3/streams/quickstart
[Pipeline] {
[Pipeline] sh
+ mvn clean install -Dgpg.skip
[INFO] Scanning for projects...
[INFO] ------------------------------------------------------------------------
[INFO] Reactor Build Order:
[INFO] 
[INFO] Kafka Streams :: Quickstart                                        [pom]
[INFO] streams-quickstart-java                                [maven-archetype]
[INFO] 
[INFO] ----------------< org.apache.kafka:streams-quickstart >-----------------
[INFO] Building Kafka Streams :: Quickstart 3.3.3-SNAPSHOT                [1/2]
[INFO]   from pom.xml
[INFO] --------------------------------[ pom ]---------------------------------
[INFO] 
[INFO] --- clean:3.0.0:clean (default-clean) @ streams-quickstart ---
[INFO] 
[INFO] --- remote-resources:1.5:process (process-resource-bundles) @ streams-quickstart ---
[INFO] 
[INFO] --- site:3.5.1:attach-descriptor (attach-descriptor) @ streams-quickstart ---
[INFO] 
[INFO] --- gpg:1.6:sign (sign-artifacts) @ streams-quickstart ---
[INFO] 
[INFO] --- install:2.5.2:install (default-install) @ streams-quickstart ---
[INFO] Installing /home/jenkins/jenkins-agent/workspace/Kafka_kafka_3.3/streams/quickstart/pom.xml to /home/jenkins/.m2/repository/org/apache/kafka/streams-quickstart/3.3.3-SNAPSHOT/streams-quickstart-3.3.3-SNAPSHOT.pom
[INFO] 
[INFO] --------------< org.apache.kafka:streams-quickstart-java >--------------
[INFO] Building streams-quickstart-java 3.3.3-SNAPSHOT                    [2/2]
[INFO]   from java/pom.xml
[INFO] --------------------------[ maven-archetype ]---------------------------
[INFO] 
[INFO] --- clean:3.0.0:clean (default-clean) @ streams-quickstart-java ---
[INFO] 
[INFO] --- remote-resources:1.5:process (process-resource-bundles) @ streams-quickstart-java ---
[INFO] 
[INFO] --- resources:2.7:resources (default-resources) @ streams-quickstart-java ---
[INFO] Using 'UTF-8' encoding to copy filtered resources.
[INFO] Copying 6 resources
[INFO] Copying 3 resources
[INFO] 
[INFO] --- resources:2.7:testResources (default-testResources) @ streams-quickstart-java ---
[INFO] Using 'UTF-8' encoding to copy filtered resources.
[INFO] Copying 2 resources
[INFO] Copying 3 resources
[INFO] 
[INFO] --- archetype:2.2:jar (default-jar) @ streams-quickstart-java ---
[INFO] Building archetype jar: /home/jenkins/jenkins-agent/workspace/Kafka_kafka_3.3/streams/quickstart/java/target/streams-quickstart-java-3.3.3-SNAPSHOT
[INFO] 
[INFO] --- site:3.5.1:attach-descriptor (attach-descriptor) @ streams-quickstart-java ---
[INFO] 
[INFO] --- archetype:2.2:integration-test (default-integration-test) @ streams-quickstart-java ---
[WARNING]  Parameter 'skip' (user property 'archetype.test.skip') is read-only, must not be used in configuration
[INFO] 
[INFO] --- gpg:1.6:sign (sign-artifacts) @ streams-quickstart-java ---
[INFO] 
[INFO] --- install:2.5.2:install (default-install) @ streams-quickstart-java ---
[INFO] Installing /home/jenkins/jenkins-agent/workspace/Kafka_kafka_3.3/streams/quickstart/java/target/streams-quickstart-java-3.3.3-SNAPSHOT.jar to /home/jenkins/.m2/repository/org/apache/kafka/streams-quickstart-java/3.3.3-SNAPSHOT/streams-quickstart-java-3.3.3-SNAPSHOT.jar
[INFO] Installing /home/jenkins/jenkins-agent/workspace/Kafka_kafka_3.3/streams/quickstart/java/pom.xml to /home/jenkins/.m2/repository/org/apache/kafka/streams-quickstart-java/3.3.3-SNAPSHOT/streams-quickstart-java-3.3.3-SNAPSHOT.pom
[INFO] 
[INFO] --- archetype:2.2:update-local-catalog (default-update-local-catalog) @ streams-quickstart-java ---
[INFO] ------------------------------------------------------------------------
[INFO] Reactor Summary for Kafka Streams :: Quickstart 3.3.3-SNAPSHOT:
[INFO] 
[INFO] Kafka Streams :: Quickstart ........................ SUCCESS [  2.048 s]
[INFO] streams-quickstart-java ............................ SUCCESS [  0.971 s]
[INFO] ------------------------------------------------------------------------
[INFO] BUILD SUCCESS
[INFO] ------------------------------------------------------------------------
[INFO] Total time:  3.357 s
[INFO] Finished at: 2023-08-24T22:47:15Z
[INFO] ------------------------------------------------------------------------
[Pipeline] dir
Running in /home/jenkins/jenkins-agent/workspace/Kafka_kafka_3.3/streams/quickstart/test-streams-archetype
[Pipeline] {
[Pipeline] sh
+ echo Y
+ mvn archetype:generate -DarchetypeCatalog=local -DarchetypeGroupId=org.apache.kafka -DarchetypeArtifactId=streams-quickstart-java -DarchetypeVersion=3.3.3-SNAPSHOT -DgroupId=streams.examples -DartifactId=streams.examples -Dversion=0.1 -Dpackage=myapps
[INFO] Scanning for projects...
[INFO] 
[INFO] ------------------< org.apache.maven:standalone-pom >-------------------
[INFO] Building Maven Stub Project (No POM) 1
[INFO] --------------------------------[ pom ]---------------------------------
[INFO] 
[INFO] >>> archetype:3.2.1:generate (default-cli) > generate-sources @ standalone-pom >>>
[INFO] 
[INFO] <<< archetype:3.2.1:generate (default-cli) < generate-sources @ standalone-pom <<<
[INFO] 
[INFO] 
[INFO] --- archetype:3.2.1:generate (default-cli) @ standalone-pom ---
[INFO] Generating project in Interactive mode
[WARNING] Archetype not found in any catalog. Falling back to central repository.
[WARNING] Add a repository with id 'archetype' in your settings.xml if archetype's repository is elsewhere.
[INFO] Using property: groupId = streams.examples
[INFO] Using property: artifactId = streams.examples
[INFO] Using property: version = 0.1
[INFO] Using property: package = myapps
Confirm properties configuration:
groupId: streams.examples
artifactId: streams.examples
version: 0.1
package: myapps
 Y: : [INFO] ----------------------------------------------------------------------------
[INFO] Using following parameters for creating project from Archetype: streams-quickstart-java:3.3.3-SNAPSHOT
[INFO] ----------------------------------------------------------------------------
[INFO] Parameter: groupId, Value: streams.examples
[INFO] Parameter: artifactId, Value: streams.examples
[INFO] Parameter: version, Value: 0.1
[INFO] Parameter: package, Value: myapps
[INFO] Parameter: packageInPathFormat, Value: myapps
[INFO] Parameter: package, Value: myapps
[INFO] Parameter: version, Value: 0.1
[INFO] Parameter: groupId, Value: streams.examples
[INFO] Parameter: artifactId, Value: streams.examples
[INFO] Project created from Archetype in dir: /home/jenkins/jenkins-agent/workspace/Kafka_kafka_3.3/streams/quickstart/test-streams-archetype/streams.examples
[INFO] ------------------------------------------------------------------------
[INFO] BUILD SUCCESS
[INFO] ------------------------------------------------------------------------
[INFO] Total time:  2.290 s
[INFO] Finished at: 2023-08-24T22:47:21Z
[INFO] ------------------------------------------------------------------------
[Pipeline] dir
Running in /home/jenkins/jenkins-agent/workspace/Kafka_kafka_3.3/streams/quickstart/test-streams-archetype/streams.examples
[Pipeline] {
[Pipeline] sh
+ mvn compile
[INFO] Scanning for projects...
[INFO] 
[INFO] -----------------< streams.examples:streams.examples >------------------
[INFO] Building Kafka Streams Quickstart :: Java 0.1
[INFO]   from pom.xml
[INFO] --------------------------------[ jar ]---------------------------------
[INFO] 
[INFO] --- resources:3.3.1:resources (default-resources) @ streams.examples ---
[INFO] Copying 1 resource from src/main/resources to target/classes
[INFO] 
[INFO] --- compiler:3.1:compile (default-compile) @ streams.examples ---
[INFO] Changes detected - recompiling the module!
[INFO] Compiling 3 source files to /home/jenkins/jenkins-agent/workspace/Kafka_kafka_3.3/streams/quickstart/test-streams-archetype/streams.examples/target/classes
[INFO] ------------------------------------------------------------------------
[INFO] BUILD SUCCESS
[INFO] ------------------------------------------------------------------------
[INFO] Total time:  2.479 s
[INFO] Finished at: 2023-08-24T22:47:28Z
[INFO] ------------------------------------------------------------------------
[Pipeline] }
[Pipeline] // dir
[Pipeline] }
[Pipeline] // dir
[Pipeline] }
[Pipeline] // dir
[Pipeline] }
[Pipeline] // withEnv
[Pipeline] }
[Pipeline] // withEnv
[Pipeline] }
[Pipeline] // withEnv
[Pipeline] }
[Pipeline] // node
[Pipeline] }
[Pipeline] // timestamps
[Pipeline] }
[Pipeline] // timeout
[Pipeline] }
[Pipeline] // stage
[Pipeline] }
[Pipeline] // parallel
[Pipeline] }
[Pipeline] // stage
[Pipeline] stage
[Pipeline] { (Declarative: Post Actions)
[Pipeline] node
Running on builds30 in /home/jenkins/jenkins-agent/workspace/Kafka_kafka_3.3
[Pipeline] {
[Pipeline] script
[Pipeline] {
[Pipeline] step