You are viewing a plain text version of this content. The canonical link for it is here.
Posted to dev@atlas.apache.org by Apache Jenkins Server <je...@builds.apache.org> on 2018/04/28 05:40:42 UTC

Build failed in Jenkins: Atlas-master-IntegrationTests #1185

See <https://builds.apache.org/job/Atlas-master-IntegrationTests/1185/display/redirect>

------------------------------------------
[...truncated 589.21 KB...]
127.0.0.1 - - [28/Apr/2018:03:43:42 +0000] "GET //localhost:31000/api/atlas/discovery/search?query=DB_v1+as+db1+Table+where+(db1.name+%3D+%22Reporting%22)&limit=10&offset=0 HTTP/1.1" 200 193 "-" "Java/1.8.0_172"
127.0.0.1 - - [28/Apr/2018:03:43:43 +0000] "GET //localhost:31000/api/atlas/discovery/search?query=DB_v1+where+(name+%3D+%22Reporting%22)+select+name+as+_col_0,+(createTime+%2B+1)+as+_col_1+&limit=10&offset=0 HTTP/1.1" 200 1139 "-" "Java/1.8.0_172"
127.0.0.1 - - [28/Apr/2018:03:43:43 +0000] "GET //localhost:31000/api/atlas/discovery/search?query=Dimension_v1&limit=10&offset=0 HTTP/1.1" 200 15962 "-" "Java/1.8.0_172"
127.0.0.1 - - [28/Apr/2018:03:43:43 +0000] "GET //localhost:31000/api/atlas/discovery/search?query=JdbcAccess_v1&limit=10&offset=0 HTTP/1.1" 200 1552 "-" "Java/1.8.0_172"
127.0.0.1 - - [28/Apr/2018:03:43:43 +0000] "GET //localhost:31000/api/atlas/discovery/search?query=ETL_v1&limit=10&offset=0 HTTP/1.1" 200 11307 "-" "Java/1.8.0_172"
127.0.0.1 - - [28/Apr/2018:03:43:44 +0000] "GET //localhost:31000/api/atlas/discovery/search?query=Metric_v1&limit=10&offset=0 HTTP/1.1" 200 7919 "-" "Java/1.8.0_172"
127.0.0.1 - - [28/Apr/2018:03:43:44 +0000] "GET //localhost:31000/api/atlas/discovery/search?query=PII_v1&limit=10&offset=0 HTTP/1.1" 200 2529 "-" "Java/1.8.0_172"
127.0.0.1 - - [28/Apr/2018:03:43:45 +0000] "GET //localhost:31000/api/atlas/discovery/search?query=%60Log+Data_v1%60&limit=10&offset=0 HTTP/1.1" 200 7150 "-" "Java/1.8.0_172"
127.0.0.1 - - [28/Apr/2018:03:43:45 +0000] "GET //localhost:31000/api/atlas/discovery/search?query=Table_v1+where+name%3D%22sales_fact%22,+columns&limit=10&offset=0 HTTP/1.1" 200 1670 "-" "Java/1.8.0_172"
127.0.0.1 - - [28/Apr/2018:03:43:45 +0000] "GET //localhost:31000/api/atlas/discovery/search?query=Table_v1+where+name%3D%22sales_fact%22,+columns+as+column+select+column.name,+column.dataType,+column.comment&limit=10&offset=0 HTTP/1.1" 200 570 "-" "Java/1.8.0_172"
127.0.0.1 - - [28/Apr/2018:03:43:45 +0000] "GET //localhost:31000/api/atlas/discovery/search?query=from+DataSet&limit=10&offset=0 HTTP/1.1" 200 23855 "-" "Java/1.8.0_172"
127.0.0.1 - - [28/Apr/2018:03:43:46 +0000] "GET //localhost:31000/api/atlas/discovery/search?query=from+Process&limit=10&offset=0 HTTP/1.1" 200 9698 "-" "Java/1.8.0_172"
127.0.0.1 - - [28/Apr/2018:03:43:46 +0000] "GET //localhost:31000/api/atlas/entities?type=DB_v1&property=name&value=Sales HTTP/1.1" 200 688 "-" "Java/1.8.0_172"
127.0.0.1 - - [28/Apr/2018:03:43:46 +0000] "GET //localhost:31000/api/atlas/entities?type=Table_v1&property=qualifiedName&value=sales_fact HTTP/1.1" 200 4110 "-" "Java/1.8.0_172"
127.0.0.1 - - [28/Apr/2018:03:43:46 +0000] "GET //localhost:31000/api/atlas/entities?type=Table_v1&property=qualifiedName&value=time_dim HTTP/1.1" 200 3334 "-" "Java/1.8.0_172"
127.0.0.1 - - [28/Apr/2018:03:43:46 +0000] "GET //localhost:31000/api/atlas/entities?type=Table_v1&property=qualifiedName&value=sales_fact_daily_mv HTTP/1.1" 200 4569 "-" "Java/1.8.0_172"
127.0.0.1 - - [28/Apr/2018:03:43:46 +0000] "GET //localhost:31000/api/atlas/lineage/4605e4f3-36e5-4468-80d1-39cd2f22ed0d/inputs/graph HTTP/1.1" 200 1722 "-" "Java/1.8.0_172"
127.0.0.1 - - [28/Apr/2018:03:43:46 +0000] "GET //localhost:31000/api/atlas/entities?type=LoadProcess_v1&property=qualifiedName&value=loadSalesDaily HTTP/1.1" 200 1779 "-" "Java/1.8.0_172"
127.0.0.1 - - [28/Apr/2018:03:43:47 +0000] "GET //localhost:31000/api/atlas/entities?type=Table_v1&property=qualifiedName&value=sales_fact HTTP/1.1" 200 4110 "-" "Java/1.8.0_172"
127.0.0.1 - - [28/Apr/2018:03:43:47 +0000] "GET //localhost:31000/api/atlas/entities?type=Table_v1&property=qualifiedName&value=time_dim HTTP/1.1" 200 3334 "-" "Java/1.8.0_172"
127.0.0.1 - - [28/Apr/2018:03:43:47 +0000] "GET //localhost:31000/api/atlas/entities?type=Table_v1&property=qualifiedName&value=sales_fact_daily_mv HTTP/1.1" 200 4569 "-" "Java/1.8.0_172"
127.0.0.1 - - [28/Apr/2018:03:43:47 +0000] "GET //localhost:31000/api/atlas/entities?type=Table_v1&property=qualifiedName&value=sales_fact HTTP/1.1" 200 4110 "-" "Java/1.8.0_172"
127.0.0.1 - - [28/Apr/2018:03:43:47 +0000] "GET //localhost:31000/api/atlas/entities?type=DB_v1&property=name&value=Sales HTTP/1.1" 200 688 "-" "Java/1.8.0_172"
127.0.0.1 - - [28/Apr/2018:03:43:47 +0000] "GET //localhost:31000/api/atlas/entities?type=View_v1&property=qualifiedName&value=product_dim_view HTTP/1.1" 200 1296 "-" "Java/1.8.0_172"
127.0.0.1 - - [28/Apr/2018:03:43:47 +0000] "GET //localhost:31000/api/atlas/entities?type=Table_v1&property=qualifiedName&value=product_dim HTTP/1.1" 200 3360 "-" "Java/1.8.0_172"
Apr 28, 2018 3:43:47 AM java.io.ObjectInputStream filterCheck
INFO: ObjectInputFilter REJECTED: null, array length: -1, nRefs: 1, depth: 1, bytes: 70, ex: n/a
Apr 28, 2018 3:43:48 AM java.io.ObjectInputStream filterCheck
INFO: ObjectInputFilter REJECTED: null, array length: -1, nRefs: 1, depth: 1, bytes: 70, ex: n/a
Apr 28, 2018 3:43:49 AM java.io.ObjectInputStream filterCheck
INFO: ObjectInputFilter REJECTED: null, array length: -1, nRefs: 1, depth: 1, bytes: 70, ex: n/a
Apr 28, 2018 3:43:49 AM java.io.ObjectInputStream filterCheck
INFO: ObjectInputFilter REJECTED: null, array length: -1, nRefs: 1, depth: 1, bytes: 70, ex: n/a
Tests run: 126, Failures: 4, Errors: 0, Skipped: 0, Time elapsed: 153.271 sec <<< FAILURE! - in TestSuite
testEnterEmptyValues(org.apache.atlas.CredentialProviderUtilityIT)  Time elapsed: 0.772 sec  <<< FAILURE!
java.io.IOException: Invalid secret key format
	at com.sun.crypto.provider.JceKeyStore.engineLoad(JceKeyStore.java:856)
	at java.security.KeyStore.load(KeyStore.java:1445)
	at org.apache.hadoop.security.alias.AbstractJavaKeyStoreProvider.<init>(AbstractJavaKeyStoreProvider.java:106)
	at org.apache.hadoop.security.alias.JavaKeyStoreProvider.<init>(JavaKeyStoreProvider.java:49)
	at org.apache.hadoop.security.alias.JavaKeyStoreProvider.<init>(JavaKeyStoreProvider.java:41)
	at org.apache.hadoop.security.alias.JavaKeyStoreProvider$Factory.createProvider(JavaKeyStoreProvider.java:100)
	at org.apache.hadoop.security.alias.CredentialProviderFactory.getProviders(CredentialProviderFactory.java:58)
	at org.apache.atlas.CredentialProviderUtilityIT.testEnterEmptyValues(CredentialProviderUtilityIT.java:138)

testEnterMismatchedValues(org.apache.atlas.CredentialProviderUtilityIT)  Time elapsed: 0.59 sec  <<< FAILURE!
java.io.IOException: Invalid secret key format
	at com.sun.crypto.provider.JceKeyStore.engineLoad(JceKeyStore.java:856)
	at java.security.KeyStore.load(KeyStore.java:1445)
	at org.apache.hadoop.security.alias.AbstractJavaKeyStoreProvider.<init>(AbstractJavaKeyStoreProvider.java:106)
	at org.apache.hadoop.security.alias.JavaKeyStoreProvider.<init>(JavaKeyStoreProvider.java:49)
	at org.apache.hadoop.security.alias.JavaKeyStoreProvider.<init>(JavaKeyStoreProvider.java:41)
	at org.apache.hadoop.security.alias.JavaKeyStoreProvider$Factory.createProvider(JavaKeyStoreProvider.java:100)
	at org.apache.hadoop.security.alias.CredentialProviderFactory.getProviders(CredentialProviderFactory.java:58)
	at org.apache.atlas.CredentialProviderUtilityIT.testEnterMismatchedValues(CredentialProviderUtilityIT.java:192)

testEnterValidValues(org.apache.atlas.CredentialProviderUtilityIT)  Time elapsed: 0.593 sec  <<< FAILURE!
java.io.IOException: Invalid secret key format
	at com.sun.crypto.provider.JceKeyStore.engineLoad(JceKeyStore.java:856)
	at java.security.KeyStore.load(KeyStore.java:1445)
	at org.apache.hadoop.security.alias.AbstractJavaKeyStoreProvider.<init>(AbstractJavaKeyStoreProvider.java:106)
	at org.apache.hadoop.security.alias.JavaKeyStoreProvider.<init>(JavaKeyStoreProvider.java:49)
	at org.apache.hadoop.security.alias.JavaKeyStoreProvider.<init>(JavaKeyStoreProvider.java:41)
	at org.apache.hadoop.security.alias.JavaKeyStoreProvider$Factory.createProvider(JavaKeyStoreProvider.java:100)
	at org.apache.hadoop.security.alias.CredentialProviderFactory.getProviders(CredentialProviderFactory.java:58)
	at org.apache.atlas.CredentialProviderUtilityIT.testEnterValidValues(CredentialProviderUtilityIT.java:76)

testOverwriteValues(org.apache.atlas.CredentialProviderUtilityIT)  Time elapsed: 0.579 sec  <<< FAILURE!
java.io.IOException: Invalid secret key format
	at com.sun.crypto.provider.JceKeyStore.engineLoad(JceKeyStore.java:856)
	at java.security.KeyStore.load(KeyStore.java:1445)
	at org.apache.hadoop.security.alias.AbstractJavaKeyStoreProvider.<init>(AbstractJavaKeyStoreProvider.java:106)
	at org.apache.hadoop.security.alias.JavaKeyStoreProvider.<init>(JavaKeyStoreProvider.java:49)
	at org.apache.hadoop.security.alias.JavaKeyStoreProvider.<init>(JavaKeyStoreProvider.java:41)
	at org.apache.hadoop.security.alias.JavaKeyStoreProvider$Factory.createProvider(JavaKeyStoreProvider.java:100)
	at org.apache.hadoop.security.alias.CredentialProviderFactory.getProviders(CredentialProviderFactory.java:58)
	at org.apache.atlas.util.CredentialProviderUtility.getCredentialProvider(CredentialProviderUtility.java:150)
	at org.apache.atlas.util.CredentialProviderUtility.main(CredentialProviderUtility.java:75)
	at org.apache.atlas.CredentialProviderUtilityIT.testOverwriteValues(CredentialProviderUtilityIT.java:251)


Results :

Failed tests: 
  CredentialProviderUtilityIT.testEnterEmptyValues:138 » IO Invalid secret key f...
  CredentialProviderUtilityIT.testEnterMismatchedValues:192 » IO Invalid secret ...
  CredentialProviderUtilityIT.testEnterValidValues:76 » IO Invalid secret key fo...
  CredentialProviderUtilityIT.testOverwriteValues:251 » IO Invalid secret key fo...

Tests run: 126, Failures: 4, Errors: 0, Skipped: 0

[INFO] 
[INFO] --- jetty-maven-plugin:9.3.14.v20161028:stop (stop-jetty) @ atlas-webapp ---
[INFO] Waiting 10 seconds for jetty to stop
[INFO] Stopped ServerConnector@246ed904{HTTP/1.1,[http/1.1]}{0.0.0.0:31000}
[INFO] Closing Spring root WebApplicationContext
[INFO] Shutting down log4j
[INFO] Stopped o.e.j.m.p.JettyWebAppContext@2772ead0{/,file://<https://builds.apache.org/job/Atlas-master-IntegrationTests/ws/webapp/target/atlas-webapp-1.0.0-SNAPSHOT/,UNAVAILABLE}{/home/jenkins/jenkins-slave/workspace/Atlas-master-IntegrationTests/webapp/target/atlas-webapp-1.0.0-SNAPSHOT.war}>
[INFO] Server reports itself as stopped
[INFO] 
[INFO] --- maven-source-plugin:2.4:jar-no-fork (attach-sources) @ atlas-webapp ---
[INFO] Building jar: <https://builds.apache.org/job/Atlas-master-IntegrationTests/ws/webapp/target/atlas-webapp-1.0.0-SNAPSHOT-sources.jar>
log4j:WARN No appenders could be found for logger (org.apache.zookeeper.ClientCnxn).
log4j:WARN Please initialize the log4j system properly.
log4j:WARN See http://logging.apache.org/log4j/1.2/faq.html#noconfig for more info.
[INFO] 
[INFO] --- maven-source-plugin:2.4:test-jar-no-fork (attach-sources) @ atlas-webapp ---
[INFO] Building jar: <https://builds.apache.org/job/Atlas-master-IntegrationTests/ws/webapp/target/atlas-webapp-1.0.0-SNAPSHOT-test-sources.jar>
[INFO] 
[INFO] --- maven-failsafe-plugin:2.18.1:verify (verify) @ atlas-webapp ---
[INFO] Failsafe report directory: <https://builds.apache.org/job/Atlas-master-IntegrationTests/ws/webapp/target/failsafe-reports>
[INFO] ------------------------------------------------------------------------
[INFO] Reactor Summary:
[INFO] 
[INFO] Apache Atlas Server Build Tools .................... SUCCESS [  0.899 s]
[INFO] apache-atlas ....................................... SUCCESS [  4.446 s]
[INFO] Apache Atlas Test Utility Tools .................... SUCCESS [ 10.713 s]
[INFO] Open Connector Framework (OCF) ..................... SUCCESS [ 11.158 s]
[INFO] Open Metadata Repository Services (OMRS) ........... SUCCESS [ 32.944 s]
[INFO] Open Metadata and Governance (OMAG) Server APIs .... SUCCESS [  7.764 s]
[INFO] Connected Asset Open Metadata Access Service (OMAS)  SUCCESS [  8.922 s]
[INFO] Asset Consumer Open Metadata Access Service (OMAS) . SUCCESS [  8.312 s]
[INFO] Open Metadata and Governance (OMAG) Server ......... SUCCESS [  4.323 s]
[INFO] Apache Atlas Integration ........................... SUCCESS [ 19.086 s]
[INFO] Apache Atlas Common ................................ SUCCESS [  7.940 s]
[INFO] Apache Atlas Client ................................ SUCCESS [  0.512 s]
[INFO] atlas-client-common ................................ SUCCESS [  6.727 s]
[INFO] atlas-client-v1 .................................... SUCCESS [  6.984 s]
[INFO] Apache Atlas Server API ............................ SUCCESS [  5.425 s]
[INFO] Apache Atlas Notification .......................... SUCCESS [  9.299 s]
[INFO] atlas-client-v2 .................................... SUCCESS [  5.700 s]
[INFO] Apache Atlas Graph Database Projects ............... SUCCESS [  0.467 s]
[INFO] Apache Atlas Graph Database API .................... SUCCESS [  4.864 s]
[INFO] Graph Database Common Code ......................... SUCCESS [  5.178 s]
[INFO] Apache Atlas JanusGraph DB Impl .................... SUCCESS [ 17.836 s]
[INFO] Apache Atlas Graph Database Implementation Dependencies SUCCESS [  2.262 s]
[INFO] Shaded version of Apache hbase client .............. SUCCESS [  8.302 s]
[INFO] Apache Atlas Titan 0.5.4 Graph DB Impl ............. SUCCESS [ 39.972 s]
[INFO] Shaded version of Apache hbase server .............. SUCCESS [ 20.773 s]
[INFO] Apache Atlas Authorization ......................... SUCCESS [  6.687 s]
[INFO] Apache Atlas Repository ............................ SUCCESS [ 32.905 s]
[INFO] Apache Atlas UI .................................... SUCCESS [01:48 min]
[INFO] Apache Atlas Web Application ....................... FAILURE [03:56 min]
[INFO] Apache Atlas Documentation ......................... SKIPPED
[INFO] Apache Atlas FileSystem Model ...................... SKIPPED
[INFO] Apache Atlas Plugin Classloader .................... SKIPPED
[INFO] Apache Atlas Hive Bridge Shim ...................... SKIPPED
[INFO] Apache Atlas Hive Bridge ........................... SKIPPED
[INFO] Apache Atlas Falcon Bridge Shim .................... SKIPPED
[INFO] Apache Atlas Falcon Bridge ......................... SKIPPED
[INFO] Apache Atlas Sqoop Bridge Shim ..................... SKIPPED
[INFO] Apache Atlas Sqoop Bridge .......................... SKIPPED
[INFO] Apache Atlas Storm Bridge Shim ..................... SKIPPED
[INFO] Apache Atlas Storm Bridge .......................... SKIPPED
[INFO] Apache Atlas Hbase Bridge Shim ..................... SKIPPED
[INFO] Apache Atlas Hbase Bridge .......................... SKIPPED
[INFO] Apache Atlas Kafka Bridge .......................... SKIPPED
[INFO] Apache Atlas Migration Exporter .................... SKIPPED
[INFO] Apache Atlas Distribution .......................... SKIPPED
[INFO] ------------------------------------------------------------------------
[INFO] BUILD FAILURE
[INFO] ------------------------------------------------------------------------
[INFO] Total time: 10:37 min
[INFO] Finished at: 2018-04-28T03:43:53Z
[INFO] Final Memory: 392M/2516M
[INFO] ------------------------------------------------------------------------
[ERROR] Failed to execute goal org.apache.maven.plugins:maven-failsafe-plugin:2.18.1:verify (verify) on project atlas-webapp: There are test failures.
[ERROR] 
[ERROR] Please refer to <https://builds.apache.org/job/Atlas-master-IntegrationTests/ws/webapp/target/failsafe-reports> for the individual test results.
[ERROR] -> [Help 1]
[ERROR] 
[ERROR] To see the full stack trace of the errors, re-run Maven with the -e switch.
[ERROR] Re-run Maven using the -X switch to enable full debug logging.
[ERROR] 
[ERROR] For more information about the errors and possible solutions, please read the following articles:
[ERROR] [Help 1] http://cwiki.apache.org/confluence/display/MAVEN/MojoFailureException
[ERROR] 
[ERROR] After correcting the problems, you can resume the build with the command
[ERROR]   mvn <goals> -rf :atlas-webapp
Build step 'Execute shell' marked build as failure
[CHECKSTYLE] Collecting checkstyle analysis files...
[CHECKSTYLE] Searching for all files in <https://builds.apache.org/job/Atlas-master-IntegrationTests/ws/> that match the pattern **/target/checkstyle-result.xml
[CHECKSTYLE] Parsing 27 files in <https://builds.apache.org/job/Atlas-master-IntegrationTests/ws/>
[CHECKSTYLE] Successfully parsed file <https://builds.apache.org/job/Atlas-master-IntegrationTests/ws/authorization/target/checkstyle-result.xml> with 669 unique warnings and 0 duplicates.
[CHECKSTYLE] Successfully parsed file <https://builds.apache.org/job/Atlas-master-IntegrationTests/ws/client/client-v1/target/checkstyle-result.xml> with 1556 unique warnings and 0 duplicates.
[CHECKSTYLE] Successfully parsed file <https://builds.apache.org/job/Atlas-master-IntegrationTests/ws/client/client-v2/target/checkstyle-result.xml> with 1915 unique warnings and 0 duplicates.
[CHECKSTYLE] Successfully parsed file <https://builds.apache.org/job/Atlas-master-IntegrationTests/ws/client/common/target/checkstyle-result.xml> with 2406 unique warnings and 0 duplicates.
[CHECKSTYLE] Successfully parsed file <https://builds.apache.org/job/Atlas-master-IntegrationTests/ws/client/target/checkstyle-result.xml> with 2406 unique warnings and 0 duplicates.
[CHECKSTYLE] Successfully parsed file <https://builds.apache.org/job/Atlas-master-IntegrationTests/ws/common/target/checkstyle-result.xml> with 3463 unique warnings and 0 duplicates.
[CHECKSTYLE] Successfully parsed file <https://builds.apache.org/job/Atlas-master-IntegrationTests/ws/dashboardv2/target/checkstyle-result.xml> with 3463 unique warnings and 0 duplicates.
[CHECKSTYLE] Successfully parsed file <https://builds.apache.org/job/Atlas-master-IntegrationTests/ws/graphdb/api/target/checkstyle-result.xml> with 3763 unique warnings and 0 duplicates.
[CHECKSTYLE] Successfully parsed file <https://builds.apache.org/job/Atlas-master-IntegrationTests/ws/graphdb/common/target/checkstyle-result.xml> with 3989 unique warnings and 0 duplicates.
[CHECKSTYLE] Successfully parsed file <https://builds.apache.org/job/Atlas-master-IntegrationTests/ws/graphdb/graphdb-impls/target/checkstyle-result.xml> with 3989 unique warnings and 0 duplicates.
[CHECKSTYLE] Successfully parsed file <https://builds.apache.org/job/Atlas-master-IntegrationTests/ws/graphdb/janus/target/checkstyle-result.xml> with 5767 unique warnings and 0 duplicates.
[CHECKSTYLE] Successfully parsed file <https://builds.apache.org/job/Atlas-master-IntegrationTests/ws/graphdb/target/checkstyle-result.xml> with 5767 unique warnings and 0 duplicates.
[CHECKSTYLE] Successfully parsed file <https://builds.apache.org/job/Atlas-master-IntegrationTests/ws/graphdb/titan0/target/checkstyle-result.xml> with 8271 unique warnings and 0 duplicates.
[CHECKSTYLE] Successfully parsed file <https://builds.apache.org/job/Atlas-master-IntegrationTests/ws/intg/target/checkstyle-result.xml> with 20092 unique warnings and 0 duplicates.
[CHECKSTYLE] Successfully parsed file <https://builds.apache.org/job/Atlas-master-IntegrationTests/ws/notification/target/checkstyle-result.xml> with 21328 unique warnings and 0 duplicates.
[CHECKSTYLE] Successfully parsed file <https://builds.apache.org/job/Atlas-master-IntegrationTests/ws/om-fwk-ocf/target/checkstyle-result.xml> with 26369 unique warnings and 0 duplicates.
[CHECKSTYLE] Successfully parsed file <https://builds.apache.org/job/Atlas-master-IntegrationTests/ws/omag-api/target/checkstyle-result.xml> with 27924 unique warnings and 0 duplicates.
[CHECKSTYLE] Successfully parsed file <https://builds.apache.org/job/Atlas-master-IntegrationTests/ws/omag-server/target/checkstyle-result.xml> with 27933 unique warnings and 0 duplicates.
[CHECKSTYLE] Successfully parsed file <https://builds.apache.org/job/Atlas-master-IntegrationTests/ws/omas-assetconsumer/target/checkstyle-result.xml> with 30772 unique warnings and 0 duplicates.
[CHECKSTYLE] Successfully parsed file <https://builds.apache.org/job/Atlas-master-IntegrationTests/ws/omas-connectedasset/target/checkstyle-result.xml> with 34185 unique warnings and 0 duplicates.
[CHECKSTYLE] Successfully parsed file <https://builds.apache.org/job/Atlas-master-IntegrationTests/ws/omrs/target/checkstyle-result.xml> with 73728 unique warnings and 0 duplicates.
[CHECKSTYLE] Successfully parsed file <https://builds.apache.org/job/Atlas-master-IntegrationTests/ws/repository/target/checkstyle-result.xml> with 93905 unique warnings and 0 duplicates.
[CHECKSTYLE] Successfully parsed file <https://builds.apache.org/job/Atlas-master-IntegrationTests/ws/server-api/target/checkstyle-result.xml> with 94071 unique warnings and 0 duplicates.
[CHECKSTYLE] Successfully parsed file <https://builds.apache.org/job/Atlas-master-IntegrationTests/ws/shaded/hbase-client-shaded/target/checkstyle-result.xml> with 94071 unique warnings and 0 duplicates.
[CHECKSTYLE] Successfully parsed file <https://builds.apache.org/job/Atlas-master-IntegrationTests/ws/shaded/hbase-server-shaded/target/checkstyle-result.xml> with 94071 unique warnings and 0 duplicates.
[CHECKSTYLE] Successfully parsed file <https://builds.apache.org/job/Atlas-master-IntegrationTests/ws/target/checkstyle-result.xml> with 94071 unique warnings and 0 duplicates.
[CHECKSTYLE] Successfully parsed file <https://builds.apache.org/job/Atlas-master-IntegrationTests/ws/test-tools/target/checkstyle-result.xml> with 94109 unique warnings and 0 duplicates.
<Git Blamer> Using GitBlamer to create author and commit information for all warnings.
<Git Blamer> GIT_COMMIT=3f7c5811faa9c9c9b61f9e6760904aeafb221224, workspace=<https://builds.apache.org/job/Atlas-master-IntegrationTests/ws/>
 > git rev-parse 3f7c5811faa9c9c9b61f9e6760904aeafb221224^{commit} # timeout=10
<Git Blamer> Skipping file <https://builds.apache.org/job/Atlas-master-IntegrationTests/ws/graphdb/janus/src/main/java/org/apache/atlas/repository/graphdb/janus/graphson/AtlasGraphSONMode.java,> no result found.
[CHECKSTYLE] Computing warning deltas based on reference build #1179
[FINDBUGS] Collecting findbugs analysis files...
[FINDBUGS] Searching for all files in <https://builds.apache.org/job/Atlas-master-IntegrationTests/ws/> that match the pattern **/target/findbugs.xml
[FINDBUGS] Parsing 20 files in <https://builds.apache.org/job/Atlas-master-IntegrationTests/ws/>
[FINDBUGS] Successfully parsed file <https://builds.apache.org/job/Atlas-master-IntegrationTests/ws/authorization/target/findbugs.xml> with 0 unique warnings and 0 duplicates.
[FINDBUGS] Successfully parsed file <https://builds.apache.org/job/Atlas-master-IntegrationTests/ws/client/client-v1/target/findbugs.xml> with 0 unique warnings and 0 duplicates.
[FINDBUGS] Successfully parsed file <https://builds.apache.org/job/Atlas-master-IntegrationTests/ws/client/client-v2/target/findbugs.xml> with 0 unique warnings and 0 duplicates.
[FINDBUGS] Successfully parsed file <https://builds.apache.org/job/Atlas-master-IntegrationTests/ws/client/common/target/findbugs.xml> with 0 unique warnings and 0 duplicates.
[FINDBUGS] Successfully parsed file <https://builds.apache.org/job/Atlas-master-IntegrationTests/ws/common/target/findbugs.xml> with 0 unique warnings and 0 duplicates.
[FINDBUGS] Successfully parsed file <https://builds.apache.org/job/Atlas-master-IntegrationTests/ws/graphdb/api/target/findbugs.xml> with 0 unique warnings and 0 duplicates.
[FINDBUGS] Successfully parsed file <https://builds.apache.org/job/Atlas-master-IntegrationTests/ws/graphdb/common/target/findbugs.xml> with 0 unique warnings and 0 duplicates.
[FINDBUGS] Successfully parsed file <https://builds.apache.org/job/Atlas-master-IntegrationTests/ws/graphdb/janus/target/findbugs.xml> with 0 unique warnings and 0 duplicates.
[FINDBUGS] Successfully parsed file <https://builds.apache.org/job/Atlas-master-IntegrationTests/ws/graphdb/titan0/target/findbugs.xml> with 0 unique warnings and 0 duplicates.
[FINDBUGS] Successfully parsed file <https://builds.apache.org/job/Atlas-master-IntegrationTests/ws/intg/target/findbugs.xml> with 0 unique warnings and 0 duplicates.
[FINDBUGS] Successfully parsed file <https://builds.apache.org/job/Atlas-master-IntegrationTests/ws/notification/target/findbugs.xml> with 0 unique warnings and 0 duplicates.
[FINDBUGS] Successfully parsed file <https://builds.apache.org/job/Atlas-master-IntegrationTests/ws/om-fwk-ocf/target/findbugs.xml> with 0 unique warnings and 0 duplicates.
[FINDBUGS] Successfully parsed file <https://builds.apache.org/job/Atlas-master-IntegrationTests/ws/omag-api/target/findbugs.xml> with 0 unique warnings and 0 duplicates.
[FINDBUGS] Successfully parsed file <https://builds.apache.org/job/Atlas-master-IntegrationTests/ws/omag-server/target/findbugs.xml> with 0 unique warnings and 0 duplicates.
[FINDBUGS] Successfully parsed file <https://builds.apache.org/job/Atlas-master-IntegrationTests/ws/omas-assetconsumer/target/findbugs.xml> with 0 unique warnings and 0 duplicates.
[FINDBUGS] Successfully parsed file <https://builds.apache.org/job/Atlas-master-IntegrationTests/ws/omas-connectedasset/target/findbugs.xml> with 0 unique warnings and 0 duplicates.
[FINDBUGS] Successfully parsed file <https://builds.apache.org/job/Atlas-master-IntegrationTests/ws/omrs/target/findbugs.xml> with 0 unique warnings and 0 duplicates.
[FINDBUGS] Successfully parsed file <https://builds.apache.org/job/Atlas-master-IntegrationTests/ws/repository/target/findbugs.xml> with 0 unique warnings and 0 duplicates.
[FINDBUGS] Successfully parsed file <https://builds.apache.org/job/Atlas-master-IntegrationTests/ws/server-api/target/findbugs.xml> with 0 unique warnings and 0 duplicates.
[FINDBUGS] Successfully parsed file <https://builds.apache.org/job/Atlas-master-IntegrationTests/ws/test-tools/target/findbugs.xml> with 0 unique warnings and 0 duplicates.
<Git Blamer> Using GitBlamer to create author and commit information for all warnings.
<Git Blamer> GIT_COMMIT=3f7c5811faa9c9c9b61f9e6760904aeafb221224, workspace=<https://builds.apache.org/job/Atlas-master-IntegrationTests/ws/>
[FINDBUGS] Computing warning deltas based on reference build #1179
Archiving artifacts
[Fast Archiver] Compressed 165.40 MB of artifacts by 84.2% relative to #1179
TestNG Reports Processing: START
Looking for TestNG results report in workspace using pattern: **/target/surefire-reports/testng-results.xml,**/target/failsafe-reports/testng-results.xml
Saving reports...
Processing '/x1/jenkins/jenkins-home/jobs/Atlas-master-IntegrationTests/builds/1185/testng/testng-results.xml'
3.174603% of tests failed, which exceeded threshold of 0%. Marking build as UNSTABLE
TestNG Reports Processing: FINISH

Build failed in Jenkins: Atlas-master-IntegrationTests #1186

Posted by Apache Jenkins Server <je...@builds.apache.org>.
See <https://builds.apache.org/job/Atlas-master-IntegrationTests/1186/display/redirect>

------------------------------------------
[...truncated 582.65 KB...]
127.0.0.1 - - [28/Apr/2018:06:43:51 +0000] "GET //localhost:31000/api/atlas/discovery/search?query=DB_v1+as+db1+Table+where+(db1.name+%3D+%22Reporting%22)&limit=10&offset=0 HTTP/1.1" 200 192 "-" "Java/1.8.0_172"
127.0.0.1 - - [28/Apr/2018:06:43:51 +0000] "GET //localhost:31000/api/atlas/discovery/search?query=DB_v1+where+(name+%3D+%22Reporting%22)+select+name+as+_col_0,+(createTime+%2B+1)+as+_col_1+&limit=10&offset=0 HTTP/1.1" 200 1136 "-" "Java/1.8.0_172"
127.0.0.1 - - [28/Apr/2018:06:43:51 +0000] "GET //localhost:31000/api/atlas/discovery/search?query=Dimension_v1&limit=10&offset=0 HTTP/1.1" 200 15961 "-" "Java/1.8.0_172"
127.0.0.1 - - [28/Apr/2018:06:43:51 +0000] "GET //localhost:31000/api/atlas/discovery/search?query=JdbcAccess_v1&limit=10&offset=0 HTTP/1.1" 200 1551 "-" "Java/1.8.0_172"
127.0.0.1 - - [28/Apr/2018:06:43:52 +0000] "GET //localhost:31000/api/atlas/discovery/search?query=ETL_v1&limit=10&offset=0 HTTP/1.1" 200 11306 "-" "Java/1.8.0_172"
127.0.0.1 - - [28/Apr/2018:06:43:52 +0000] "GET //localhost:31000/api/atlas/discovery/search?query=Metric_v1&limit=10&offset=0 HTTP/1.1" 200 7918 "-" "Java/1.8.0_172"
127.0.0.1 - - [28/Apr/2018:06:43:53 +0000] "GET //localhost:31000/api/atlas/discovery/search?query=PII_v1&limit=10&offset=0 HTTP/1.1" 200 2528 "-" "Java/1.8.0_172"
127.0.0.1 - - [28/Apr/2018:06:43:53 +0000] "GET //localhost:31000/api/atlas/discovery/search?query=%60Log+Data_v1%60&limit=10&offset=0 HTTP/1.1" 200 7149 "-" "Java/1.8.0_172"
127.0.0.1 - - [28/Apr/2018:06:43:53 +0000] "GET //localhost:31000/api/atlas/discovery/search?query=Table_v1+where+name%3D%22sales_fact%22,+columns&limit=10&offset=0 HTTP/1.1" 200 1669 "-" "Java/1.8.0_172"
127.0.0.1 - - [28/Apr/2018:06:43:54 +0000] "GET //localhost:31000/api/atlas/discovery/search?query=Table_v1+where+name%3D%22sales_fact%22,+columns+as+column+select+column.name,+column.dataType,+column.comment&limit=10&offset=0 HTTP/1.1" 200 569 "-" "Java/1.8.0_172"
127.0.0.1 - - [28/Apr/2018:06:43:54 +0000] "GET //localhost:31000/api/atlas/discovery/search?query=from+DataSet&limit=10&offset=0 HTTP/1.1" 200 23252 "-" "Java/1.8.0_172"
127.0.0.1 - - [28/Apr/2018:06:43:54 +0000] "GET //localhost:31000/api/atlas/discovery/search?query=from+Process&limit=10&offset=0 HTTP/1.1" 200 9754 "-" "Java/1.8.0_172"
127.0.0.1 - - [28/Apr/2018:06:43:55 +0000] "GET //localhost:31000/api/atlas/entities?type=DB_v1&property=name&value=Sales HTTP/1.1" 200 687 "-" "Java/1.8.0_172"
127.0.0.1 - - [28/Apr/2018:06:43:55 +0000] "GET //localhost:31000/api/atlas/entities?type=Table_v1&property=qualifiedName&value=sales_fact HTTP/1.1" 200 4109 "-" "Java/1.8.0_172"
127.0.0.1 - - [28/Apr/2018:06:43:55 +0000] "GET //localhost:31000/api/atlas/entities?type=Table_v1&property=qualifiedName&value=time_dim HTTP/1.1" 200 3333 "-" "Java/1.8.0_172"
127.0.0.1 - - [28/Apr/2018:06:43:55 +0000] "GET //localhost:31000/api/atlas/entities?type=Table_v1&property=qualifiedName&value=sales_fact_daily_mv HTTP/1.1" 200 4568 "-" "Java/1.8.0_172"
127.0.0.1 - - [28/Apr/2018:06:43:55 +0000] "GET //localhost:31000/api/atlas/lineage/3a04dd12-d884-4a25-a72b-beb77dc15034/inputs/graph HTTP/1.1" 200 1721 "-" "Java/1.8.0_172"
127.0.0.1 - - [28/Apr/2018:06:43:55 +0000] "GET //localhost:31000/api/atlas/entities?type=LoadProcess_v1&property=qualifiedName&value=loadSalesDaily HTTP/1.1" 200 1778 "-" "Java/1.8.0_172"
127.0.0.1 - - [28/Apr/2018:06:43:55 +0000] "GET //localhost:31000/api/atlas/entities?type=Table_v1&property=qualifiedName&value=sales_fact HTTP/1.1" 200 4109 "-" "Java/1.8.0_172"
127.0.0.1 - - [28/Apr/2018:06:43:55 +0000] "GET //localhost:31000/api/atlas/entities?type=Table_v1&property=qualifiedName&value=time_dim HTTP/1.1" 200 3333 "-" "Java/1.8.0_172"
127.0.0.1 - - [28/Apr/2018:06:43:55 +0000] "GET //localhost:31000/api/atlas/entities?type=Table_v1&property=qualifiedName&value=sales_fact_daily_mv HTTP/1.1" 200 4568 "-" "Java/1.8.0_172"
127.0.0.1 - - [28/Apr/2018:06:43:55 +0000] "GET //localhost:31000/api/atlas/entities?type=Table_v1&property=qualifiedName&value=sales_fact HTTP/1.1" 200 4109 "-" "Java/1.8.0_172"
127.0.0.1 - - [28/Apr/2018:06:43:55 +0000] "GET //localhost:31000/api/atlas/entities?type=DB_v1&property=name&value=Sales HTTP/1.1" 200 687 "-" "Java/1.8.0_172"
127.0.0.1 - - [28/Apr/2018:06:43:55 +0000] "GET //localhost:31000/api/atlas/entities?type=View_v1&property=qualifiedName&value=product_dim_view HTTP/1.1" 200 1295 "-" "Java/1.8.0_172"
127.0.0.1 - - [28/Apr/2018:06:43:55 +0000] "GET //localhost:31000/api/atlas/entities?type=Table_v1&property=qualifiedName&value=product_dim HTTP/1.1" 200 3359 "-" "Java/1.8.0_172"
Apr 28, 2018 6:43:56 AM java.io.ObjectInputStream filterCheck
INFO: ObjectInputFilter REJECTED: null, array length: -1, nRefs: 1, depth: 1, bytes: 70, ex: n/a
Apr 28, 2018 6:43:57 AM java.io.ObjectInputStream filterCheck
INFO: ObjectInputFilter REJECTED: null, array length: -1, nRefs: 1, depth: 1, bytes: 70, ex: n/a
Apr 28, 2018 6:43:57 AM java.io.ObjectInputStream filterCheck
INFO: ObjectInputFilter REJECTED: null, array length: -1, nRefs: 1, depth: 1, bytes: 70, ex: n/a
Apr 28, 2018 6:43:58 AM java.io.ObjectInputStream filterCheck
INFO: ObjectInputFilter REJECTED: null, array length: -1, nRefs: 1, depth: 1, bytes: 70, ex: n/a
Tests run: 126, Failures: 4, Errors: 0, Skipped: 0, Time elapsed: 156.498 sec <<< FAILURE! - in TestSuite
testEnterEmptyValues(org.apache.atlas.CredentialProviderUtilityIT)  Time elapsed: 0.836 sec  <<< FAILURE!
java.io.IOException: Invalid secret key format
	at com.sun.crypto.provider.JceKeyStore.engineLoad(JceKeyStore.java:856)
	at java.security.KeyStore.load(KeyStore.java:1445)
	at org.apache.hadoop.security.alias.AbstractJavaKeyStoreProvider.<init>(AbstractJavaKeyStoreProvider.java:106)
	at org.apache.hadoop.security.alias.JavaKeyStoreProvider.<init>(JavaKeyStoreProvider.java:49)
	at org.apache.hadoop.security.alias.JavaKeyStoreProvider.<init>(JavaKeyStoreProvider.java:41)
	at org.apache.hadoop.security.alias.JavaKeyStoreProvider$Factory.createProvider(JavaKeyStoreProvider.java:100)
	at org.apache.hadoop.security.alias.CredentialProviderFactory.getProviders(CredentialProviderFactory.java:58)
	at org.apache.atlas.CredentialProviderUtilityIT.testEnterEmptyValues(CredentialProviderUtilityIT.java:138)

testEnterValidValues(org.apache.atlas.CredentialProviderUtilityIT)  Time elapsed: 0.604 sec  <<< FAILURE!
java.io.IOException: Invalid secret key format
	at com.sun.crypto.provider.JceKeyStore.engineLoad(JceKeyStore.java:856)
	at java.security.KeyStore.load(KeyStore.java:1445)
	at org.apache.hadoop.security.alias.AbstractJavaKeyStoreProvider.<init>(AbstractJavaKeyStoreProvider.java:106)
	at org.apache.hadoop.security.alias.JavaKeyStoreProvider.<init>(JavaKeyStoreProvider.java:49)
	at org.apache.hadoop.security.alias.JavaKeyStoreProvider.<init>(JavaKeyStoreProvider.java:41)
	at org.apache.hadoop.security.alias.JavaKeyStoreProvider$Factory.createProvider(JavaKeyStoreProvider.java:100)
	at org.apache.hadoop.security.alias.CredentialProviderFactory.getProviders(CredentialProviderFactory.java:58)
	at org.apache.atlas.CredentialProviderUtilityIT.testEnterValidValues(CredentialProviderUtilityIT.java:76)

testOverwriteValues(org.apache.atlas.CredentialProviderUtilityIT)  Time elapsed: 0.591 sec  <<< FAILURE!
java.io.IOException: Invalid secret key format
	at com.sun.crypto.provider.JceKeyStore.engineLoad(JceKeyStore.java:856)
	at java.security.KeyStore.load(KeyStore.java:1445)
	at org.apache.hadoop.security.alias.AbstractJavaKeyStoreProvider.<init>(AbstractJavaKeyStoreProvider.java:106)
	at org.apache.hadoop.security.alias.JavaKeyStoreProvider.<init>(JavaKeyStoreProvider.java:49)
	at org.apache.hadoop.security.alias.JavaKeyStoreProvider.<init>(JavaKeyStoreProvider.java:41)
	at org.apache.hadoop.security.alias.JavaKeyStoreProvider$Factory.createProvider(JavaKeyStoreProvider.java:100)
	at org.apache.hadoop.security.alias.CredentialProviderFactory.getProviders(CredentialProviderFactory.java:58)
	at org.apache.atlas.util.CredentialProviderUtility.getCredentialProvider(CredentialProviderUtility.java:150)
	at org.apache.atlas.util.CredentialProviderUtility.main(CredentialProviderUtility.java:75)
	at org.apache.atlas.CredentialProviderUtilityIT.testOverwriteValues(CredentialProviderUtilityIT.java:251)

testEnterMismatchedValues(org.apache.atlas.CredentialProviderUtilityIT)  Time elapsed: 0.586 sec  <<< FAILURE!
java.io.IOException: Invalid secret key format
	at com.sun.crypto.provider.JceKeyStore.engineLoad(JceKeyStore.java:856)
	at java.security.KeyStore.load(KeyStore.java:1445)
	at org.apache.hadoop.security.alias.AbstractJavaKeyStoreProvider.<init>(AbstractJavaKeyStoreProvider.java:106)
	at org.apache.hadoop.security.alias.JavaKeyStoreProvider.<init>(JavaKeyStoreProvider.java:49)
	at org.apache.hadoop.security.alias.JavaKeyStoreProvider.<init>(JavaKeyStoreProvider.java:41)
	at org.apache.hadoop.security.alias.JavaKeyStoreProvider$Factory.createProvider(JavaKeyStoreProvider.java:100)
	at org.apache.hadoop.security.alias.CredentialProviderFactory.getProviders(CredentialProviderFactory.java:58)
	at org.apache.atlas.CredentialProviderUtilityIT.testEnterMismatchedValues(CredentialProviderUtilityIT.java:192)


Results :

Failed tests: 
  CredentialProviderUtilityIT.testEnterEmptyValues:138 » IO Invalid secret key f...
  CredentialProviderUtilityIT.testEnterMismatchedValues:192 » IO Invalid secret ...
  CredentialProviderUtilityIT.testEnterValidValues:76 » IO Invalid secret key fo...
  CredentialProviderUtilityIT.testOverwriteValues:251 » IO Invalid secret key fo...

Tests run: 126, Failures: 4, Errors: 0, Skipped: 0

[INFO] 
[INFO] --- jetty-maven-plugin:9.3.14.v20161028:stop (stop-jetty) @ atlas-webapp ---
[INFO] Waiting 10 seconds for jetty to stop
[INFO] Stopped ServerConnector@396e8785{HTTP/1.1,[http/1.1]}{0.0.0.0:31000}
[INFO] Closing Spring root WebApplicationContext
[INFO] Shutting down log4j
[INFO] Stopped o.e.j.m.p.JettyWebAppContext@337bbb3{/,file://<https://builds.apache.org/job/Atlas-master-IntegrationTests/ws/webapp/target/atlas-webapp-1.0.0-SNAPSHOT/,UNAVAILABLE}{/home/jenkins/jenkins-slave/workspace/Atlas-master-IntegrationTests/webapp/target/atlas-webapp-1.0.0-SNAPSHOT.war}>
[INFO] Server reports itself as stopped
[INFO] 
[INFO] --- maven-source-plugin:2.4:jar-no-fork (attach-sources) @ atlas-webapp ---
[INFO] Building jar: <https://builds.apache.org/job/Atlas-master-IntegrationTests/ws/webapp/target/atlas-webapp-1.0.0-SNAPSHOT-sources.jar>
log4j:WARN No appenders could be found for logger (org.apache.zookeeper.ClientCnxn).
log4j:WARN Please initialize the log4j system properly.
log4j:WARN See http://logging.apache.org/log4j/1.2/faq.html#noconfig for more info.
[INFO] 
[INFO] --- maven-source-plugin:2.4:test-jar-no-fork (attach-sources) @ atlas-webapp ---
[INFO] Building jar: <https://builds.apache.org/job/Atlas-master-IntegrationTests/ws/webapp/target/atlas-webapp-1.0.0-SNAPSHOT-test-sources.jar>
[INFO] 
[INFO] --- maven-failsafe-plugin:2.18.1:verify (verify) @ atlas-webapp ---
[INFO] Failsafe report directory: <https://builds.apache.org/job/Atlas-master-IntegrationTests/ws/webapp/target/failsafe-reports>
[INFO] ------------------------------------------------------------------------
[INFO] Reactor Summary:
[INFO] 
[INFO] Apache Atlas Server Build Tools .................... SUCCESS [  0.680 s]
[INFO] apache-atlas ....................................... SUCCESS [  4.278 s]
[INFO] Apache Atlas Test Utility Tools .................... SUCCESS [ 10.195 s]
[INFO] Open Connector Framework (OCF) ..................... SUCCESS [ 10.267 s]
[INFO] Open Metadata Repository Services (OMRS) ........... SUCCESS [ 32.177 s]
[INFO] Open Metadata and Governance (OMAG) Server APIs .... SUCCESS [  8.587 s]
[INFO] Connected Asset Open Metadata Access Service (OMAS)  SUCCESS [  8.123 s]
[INFO] Asset Consumer Open Metadata Access Service (OMAS) . SUCCESS [  8.190 s]
[INFO] Open Metadata and Governance (OMAG) Server ......... SUCCESS [  4.405 s]
[INFO] Apache Atlas Integration ........................... SUCCESS [ 19.308 s]
[INFO] Apache Atlas Common ................................ SUCCESS [  7.631 s]
[INFO] Apache Atlas Client ................................ SUCCESS [  0.504 s]
[INFO] atlas-client-common ................................ SUCCESS [  6.969 s]
[INFO] atlas-client-v1 .................................... SUCCESS [  7.144 s]
[INFO] Apache Atlas Server API ............................ SUCCESS [  5.411 s]
[INFO] Apache Atlas Notification .......................... SUCCESS [  9.217 s]
[INFO] atlas-client-v2 .................................... SUCCESS [  5.928 s]
[INFO] Apache Atlas Graph Database Projects ............... SUCCESS [  0.493 s]
[INFO] Apache Atlas Graph Database API .................... SUCCESS [  4.959 s]
[INFO] Graph Database Common Code ......................... SUCCESS [  5.268 s]
[INFO] Apache Atlas JanusGraph DB Impl .................... SUCCESS [ 14.287 s]
[INFO] Apache Atlas Graph Database Implementation Dependencies SUCCESS [  2.335 s]
[INFO] Shaded version of Apache hbase client .............. SUCCESS [  8.103 s]
[INFO] Apache Atlas Titan 0.5.4 Graph DB Impl ............. SUCCESS [ 39.568 s]
[INFO] Shaded version of Apache hbase server .............. SUCCESS [ 21.025 s]
[INFO] Apache Atlas Authorization ......................... SUCCESS [  6.493 s]
[INFO] Apache Atlas Repository ............................ SUCCESS [ 33.082 s]
[INFO] Apache Atlas UI .................................... SUCCESS [01:49 min]
[INFO] Apache Atlas Web Application ....................... FAILURE [03:58 min]
[INFO] Apache Atlas Documentation ......................... SKIPPED
[INFO] Apache Atlas FileSystem Model ...................... SKIPPED
[INFO] Apache Atlas Plugin Classloader .................... SKIPPED
[INFO] Apache Atlas Hive Bridge Shim ...................... SKIPPED
[INFO] Apache Atlas Hive Bridge ........................... SKIPPED
[INFO] Apache Atlas Falcon Bridge Shim .................... SKIPPED
[INFO] Apache Atlas Falcon Bridge ......................... SKIPPED
[INFO] Apache Atlas Sqoop Bridge Shim ..................... SKIPPED
[INFO] Apache Atlas Sqoop Bridge .......................... SKIPPED
[INFO] Apache Atlas Storm Bridge Shim ..................... SKIPPED
[INFO] Apache Atlas Storm Bridge .......................... SKIPPED
[INFO] Apache Atlas Hbase Bridge Shim ..................... SKIPPED
[INFO] Apache Atlas Hbase Bridge .......................... SKIPPED
[INFO] Apache Atlas Kafka Bridge .......................... SKIPPED
[INFO] Apache Atlas Migration Exporter .................... SKIPPED
[INFO] Apache Atlas Distribution .......................... SKIPPED
[INFO] ------------------------------------------------------------------------
[INFO] BUILD FAILURE
[INFO] ------------------------------------------------------------------------
[INFO] Total time: 10:34 min
[INFO] Finished at: 2018-04-28T06:44:03Z
[INFO] Final Memory: 390M/2195M
[INFO] ------------------------------------------------------------------------
[ERROR] Failed to execute goal org.apache.maven.plugins:maven-failsafe-plugin:2.18.1:verify (verify) on project atlas-webapp: There are test failures.
[ERROR] 
[ERROR] Please refer to <https://builds.apache.org/job/Atlas-master-IntegrationTests/ws/webapp/target/failsafe-reports> for the individual test results.
[ERROR] -> [Help 1]
[ERROR] 
[ERROR] To see the full stack trace of the errors, re-run Maven with the -e switch.
[ERROR] Re-run Maven using the -X switch to enable full debug logging.
[ERROR] 
[ERROR] For more information about the errors and possible solutions, please read the following articles:
[ERROR] [Help 1] http://cwiki.apache.org/confluence/display/MAVEN/MojoFailureException
[ERROR] 
[ERROR] After correcting the problems, you can resume the build with the command
[ERROR]   mvn <goals> -rf :atlas-webapp
Build step 'Execute shell' marked build as failure
[CHECKSTYLE] Collecting checkstyle analysis files...
[CHECKSTYLE] Searching for all files in <https://builds.apache.org/job/Atlas-master-IntegrationTests/ws/> that match the pattern **/target/checkstyle-result.xml
[CHECKSTYLE] Parsing 27 files in <https://builds.apache.org/job/Atlas-master-IntegrationTests/ws/>
[CHECKSTYLE] Successfully parsed file <https://builds.apache.org/job/Atlas-master-IntegrationTests/ws/authorization/target/checkstyle-result.xml> with 669 unique warnings and 0 duplicates.
[CHECKSTYLE] Successfully parsed file <https://builds.apache.org/job/Atlas-master-IntegrationTests/ws/client/client-v1/target/checkstyle-result.xml> with 1556 unique warnings and 0 duplicates.
[CHECKSTYLE] Successfully parsed file <https://builds.apache.org/job/Atlas-master-IntegrationTests/ws/client/client-v2/target/checkstyle-result.xml> with 1915 unique warnings and 0 duplicates.
[CHECKSTYLE] Successfully parsed file <https://builds.apache.org/job/Atlas-master-IntegrationTests/ws/client/common/target/checkstyle-result.xml> with 2406 unique warnings and 0 duplicates.
[CHECKSTYLE] Successfully parsed file <https://builds.apache.org/job/Atlas-master-IntegrationTests/ws/client/target/checkstyle-result.xml> with 2406 unique warnings and 0 duplicates.
[CHECKSTYLE] Successfully parsed file <https://builds.apache.org/job/Atlas-master-IntegrationTests/ws/common/target/checkstyle-result.xml> with 3463 unique warnings and 0 duplicates.
[CHECKSTYLE] Successfully parsed file <https://builds.apache.org/job/Atlas-master-IntegrationTests/ws/dashboardv2/target/checkstyle-result.xml> with 3463 unique warnings and 0 duplicates.
[CHECKSTYLE] Successfully parsed file <https://builds.apache.org/job/Atlas-master-IntegrationTests/ws/graphdb/api/target/checkstyle-result.xml> with 3763 unique warnings and 0 duplicates.
[CHECKSTYLE] Successfully parsed file <https://builds.apache.org/job/Atlas-master-IntegrationTests/ws/graphdb/common/target/checkstyle-result.xml> with 3989 unique warnings and 0 duplicates.
[CHECKSTYLE] Successfully parsed file <https://builds.apache.org/job/Atlas-master-IntegrationTests/ws/graphdb/graphdb-impls/target/checkstyle-result.xml> with 3989 unique warnings and 0 duplicates.
[CHECKSTYLE] Successfully parsed file <https://builds.apache.org/job/Atlas-master-IntegrationTests/ws/graphdb/janus/target/checkstyle-result.xml> with 5767 unique warnings and 0 duplicates.
[CHECKSTYLE] Successfully parsed file <https://builds.apache.org/job/Atlas-master-IntegrationTests/ws/graphdb/target/checkstyle-result.xml> with 5767 unique warnings and 0 duplicates.
[CHECKSTYLE] Successfully parsed file <https://builds.apache.org/job/Atlas-master-IntegrationTests/ws/graphdb/titan0/target/checkstyle-result.xml> with 8271 unique warnings and 0 duplicates.
[CHECKSTYLE] Successfully parsed file <https://builds.apache.org/job/Atlas-master-IntegrationTests/ws/intg/target/checkstyle-result.xml> with 20092 unique warnings and 0 duplicates.
[CHECKSTYLE] Successfully parsed file <https://builds.apache.org/job/Atlas-master-IntegrationTests/ws/notification/target/checkstyle-result.xml> with 21328 unique warnings and 0 duplicates.
[CHECKSTYLE] Successfully parsed file <https://builds.apache.org/job/Atlas-master-IntegrationTests/ws/om-fwk-ocf/target/checkstyle-result.xml> with 26369 unique warnings and 0 duplicates.
[CHECKSTYLE] Successfully parsed file <https://builds.apache.org/job/Atlas-master-IntegrationTests/ws/omag-api/target/checkstyle-result.xml> with 27924 unique warnings and 0 duplicates.
[CHECKSTYLE] Successfully parsed file <https://builds.apache.org/job/Atlas-master-IntegrationTests/ws/omag-server/target/checkstyle-result.xml> with 27933 unique warnings and 0 duplicates.
[CHECKSTYLE] Successfully parsed file <https://builds.apache.org/job/Atlas-master-IntegrationTests/ws/omas-assetconsumer/target/checkstyle-result.xml> with 30772 unique warnings and 0 duplicates.
[CHECKSTYLE] Successfully parsed file <https://builds.apache.org/job/Atlas-master-IntegrationTests/ws/omas-connectedasset/target/checkstyle-result.xml> with 34185 unique warnings and 0 duplicates.
[CHECKSTYLE] Successfully parsed file <https://builds.apache.org/job/Atlas-master-IntegrationTests/ws/omrs/target/checkstyle-result.xml> with 73728 unique warnings and 0 duplicates.
[CHECKSTYLE] Successfully parsed file <https://builds.apache.org/job/Atlas-master-IntegrationTests/ws/repository/target/checkstyle-result.xml> with 93905 unique warnings and 0 duplicates.
[CHECKSTYLE] Successfully parsed file <https://builds.apache.org/job/Atlas-master-IntegrationTests/ws/server-api/target/checkstyle-result.xml> with 94071 unique warnings and 0 duplicates.
[CHECKSTYLE] Successfully parsed file <https://builds.apache.org/job/Atlas-master-IntegrationTests/ws/shaded/hbase-client-shaded/target/checkstyle-result.xml> with 94071 unique warnings and 0 duplicates.
[CHECKSTYLE] Successfully parsed file <https://builds.apache.org/job/Atlas-master-IntegrationTests/ws/shaded/hbase-server-shaded/target/checkstyle-result.xml> with 94071 unique warnings and 0 duplicates.
[CHECKSTYLE] Successfully parsed file <https://builds.apache.org/job/Atlas-master-IntegrationTests/ws/target/checkstyle-result.xml> with 94071 unique warnings and 0 duplicates.
[CHECKSTYLE] Successfully parsed file <https://builds.apache.org/job/Atlas-master-IntegrationTests/ws/test-tools/target/checkstyle-result.xml> with 94109 unique warnings and 0 duplicates.
<Git Blamer> Using GitBlamer to create author and commit information for all warnings.
<Git Blamer> GIT_COMMIT=3f7c5811faa9c9c9b61f9e6760904aeafb221224, workspace=<https://builds.apache.org/job/Atlas-master-IntegrationTests/ws/>
 > git rev-parse 3f7c5811faa9c9c9b61f9e6760904aeafb221224^{commit} # timeout=10
<Git Blamer> Skipping file <https://builds.apache.org/job/Atlas-master-IntegrationTests/ws/graphdb/janus/src/main/java/org/apache/atlas/repository/graphdb/janus/graphson/AtlasGraphSONMode.java,> no result found.
[CHECKSTYLE] Computing warning deltas based on reference build #1179
[FINDBUGS] Collecting findbugs analysis files...
[FINDBUGS] Searching for all files in <https://builds.apache.org/job/Atlas-master-IntegrationTests/ws/> that match the pattern **/target/findbugs.xml
[FINDBUGS] Parsing 20 files in <https://builds.apache.org/job/Atlas-master-IntegrationTests/ws/>
[FINDBUGS] Successfully parsed file <https://builds.apache.org/job/Atlas-master-IntegrationTests/ws/authorization/target/findbugs.xml> with 0 unique warnings and 0 duplicates.
[FINDBUGS] Successfully parsed file <https://builds.apache.org/job/Atlas-master-IntegrationTests/ws/client/client-v1/target/findbugs.xml> with 0 unique warnings and 0 duplicates.
[FINDBUGS] Successfully parsed file <https://builds.apache.org/job/Atlas-master-IntegrationTests/ws/client/client-v2/target/findbugs.xml> with 0 unique warnings and 0 duplicates.
[FINDBUGS] Successfully parsed file <https://builds.apache.org/job/Atlas-master-IntegrationTests/ws/client/common/target/findbugs.xml> with 0 unique warnings and 0 duplicates.
[FINDBUGS] Successfully parsed file <https://builds.apache.org/job/Atlas-master-IntegrationTests/ws/common/target/findbugs.xml> with 0 unique warnings and 0 duplicates.
[FINDBUGS] Successfully parsed file <https://builds.apache.org/job/Atlas-master-IntegrationTests/ws/graphdb/api/target/findbugs.xml> with 0 unique warnings and 0 duplicates.
[FINDBUGS] Successfully parsed file <https://builds.apache.org/job/Atlas-master-IntegrationTests/ws/graphdb/common/target/findbugs.xml> with 0 unique warnings and 0 duplicates.
[FINDBUGS] Successfully parsed file <https://builds.apache.org/job/Atlas-master-IntegrationTests/ws/graphdb/janus/target/findbugs.xml> with 0 unique warnings and 0 duplicates.
[FINDBUGS] Successfully parsed file <https://builds.apache.org/job/Atlas-master-IntegrationTests/ws/graphdb/titan0/target/findbugs.xml> with 0 unique warnings and 0 duplicates.
[FINDBUGS] Successfully parsed file <https://builds.apache.org/job/Atlas-master-IntegrationTests/ws/intg/target/findbugs.xml> with 0 unique warnings and 0 duplicates.
[FINDBUGS] Successfully parsed file <https://builds.apache.org/job/Atlas-master-IntegrationTests/ws/notification/target/findbugs.xml> with 0 unique warnings and 0 duplicates.
[FINDBUGS] Successfully parsed file <https://builds.apache.org/job/Atlas-master-IntegrationTests/ws/om-fwk-ocf/target/findbugs.xml> with 0 unique warnings and 0 duplicates.
[FINDBUGS] Successfully parsed file <https://builds.apache.org/job/Atlas-master-IntegrationTests/ws/omag-api/target/findbugs.xml> with 0 unique warnings and 0 duplicates.
[FINDBUGS] Successfully parsed file <https://builds.apache.org/job/Atlas-master-IntegrationTests/ws/omag-server/target/findbugs.xml> with 0 unique warnings and 0 duplicates.
[FINDBUGS] Successfully parsed file <https://builds.apache.org/job/Atlas-master-IntegrationTests/ws/omas-assetconsumer/target/findbugs.xml> with 0 unique warnings and 0 duplicates.
[FINDBUGS] Successfully parsed file <https://builds.apache.org/job/Atlas-master-IntegrationTests/ws/omas-connectedasset/target/findbugs.xml> with 0 unique warnings and 0 duplicates.
[FINDBUGS] Successfully parsed file <https://builds.apache.org/job/Atlas-master-IntegrationTests/ws/omrs/target/findbugs.xml> with 0 unique warnings and 0 duplicates.
[FINDBUGS] Successfully parsed file <https://builds.apache.org/job/Atlas-master-IntegrationTests/ws/repository/target/findbugs.xml> with 0 unique warnings and 0 duplicates.
[FINDBUGS] Successfully parsed file <https://builds.apache.org/job/Atlas-master-IntegrationTests/ws/server-api/target/findbugs.xml> with 0 unique warnings and 0 duplicates.
[FINDBUGS] Successfully parsed file <https://builds.apache.org/job/Atlas-master-IntegrationTests/ws/test-tools/target/findbugs.xml> with 0 unique warnings and 0 duplicates.
<Git Blamer> Using GitBlamer to create author and commit information for all warnings.
<Git Blamer> GIT_COMMIT=3f7c5811faa9c9c9b61f9e6760904aeafb221224, workspace=<https://builds.apache.org/job/Atlas-master-IntegrationTests/ws/>
[FINDBUGS] Computing warning deltas based on reference build #1179
Archiving artifacts
[Fast Archiver] Compressed 165.40 MB of artifacts by 84.2% relative to #1179
TestNG Reports Processing: START
Looking for TestNG results report in workspace using pattern: **/target/surefire-reports/testng-results.xml,**/target/failsafe-reports/testng-results.xml
Saving reports...
Processing '/x1/jenkins/jenkins-home/jobs/Atlas-master-IntegrationTests/builds/1186/testng/testng-results.xml'
3.174603% of tests failed, which exceeded threshold of 0%. Marking build as UNSTABLE
TestNG Reports Processing: FINISH