You are viewing a plain text version of this content. The canonical link for it is here.
Posted to notifications@cxf.apache.org by Apache Jenkins Server <je...@builds.apache.org> on 2012/08/02 10:39:19 UTC
Build failed in Jenkins: CXF-2.4-deploy #254
See <https://builds.apache.org/job/CXF-2.4-deploy/254/changes>
Changes:
[dkulp] Blocking revisions 1368164 via git from
https://svn.apache.org/repos/asf/cxf/branches/2.5.x-fixes
........
r1368164 | dkulp | 2012-08-01 14:28:03 -0400 (Wed, 01 Aug 2012) | 18 lines
Merged revisions 1368110 via git cherry-pick from
https://svn.apache.org/repos/asf/cxf/branches/2.6.x-fixes
........
r1368110 | dkulp | 2012-08-01 12:42:22 -0400 (Wed, 01 Aug 2012) | 10 lines
Merged revisions 1367836 via git cherry-pick from
https://svn.apache.org/repos/asf/cxf/trunk
........
r1367836 | bimargulies | 2012-07-31 21:18:21 -0400 (Tue, 31 Jul 2012) | 2 lines
Javadoc fixes to a CORS class.
........
........
........
[dkulp] Recording revisions 1368165,1368166,1368167,1368168,1368169,1368170,1368171 via git from
https://svn.apache.org/repos/asf/cxf/branches/2.5.x-fixes
[dkulp] Merged revisions 1368171 via git cherry-pick from
https://svn.apache.org/repos/asf/cxf/branches/2.5.x-fixes
........
r1368171 | dkulp | 2012-08-01 14:28:33 -0400 (Wed, 01 Aug 2012) | 18 lines
Merged revisions 1368161 via git cherry-pick from
https://svn.apache.org/repos/asf/cxf/branches/2.6.x-fixes
........
r1368161 | dkulp | 2012-08-01 14:23:49 -0400 (Wed, 01 Aug 2012) | 10 lines
Merged revisions 1368156 via git cherry-pick from
https://svn.apache.org/repos/asf/cxf/trunk
........
r1368156 | dkulp | 2012-08-01 14:18:23 -0400 (Wed, 01 Aug 2012) | 2 lines
Newer version of ws-t uses a response collection
........
........
........
[dkulp] Merged revisions 1368170 via git cherry-pick from
https://svn.apache.org/repos/asf/cxf/branches/2.5.x-fixes
........
r1368170 | dkulp | 2012-08-01 14:28:29 -0400 (Wed, 01 Aug 2012) | 18 lines
Merged revisions 1368160 via git cherry-pick from
https://svn.apache.org/repos/asf/cxf/branches/2.6.x-fixes
........
r1368160 | dkulp | 2012-08-01 14:23:45 -0400 (Wed, 01 Aug 2012) | 10 lines
Merged revisions 1368155 via git cherry-pick from
https://svn.apache.org/repos/asf/cxf/trunk
........
r1368155 | dkulp | 2012-08-01 14:18:18 -0400 (Wed, 01 Aug 2012) | 2 lines
Fix some tests that are using an invalid wsdl
........
........
........
[dkulp] Merged revisions 1368169 via git cherry-pick from
https://svn.apache.org/repos/asf/cxf/branches/2.5.x-fixes
........
r1368169 | dkulp | 2012-08-01 14:28:24 -0400 (Wed, 01 Aug 2012) | 19 lines
Merged revisions 1368159 via git cherry-pick from
https://svn.apache.org/repos/asf/cxf/branches/2.6.x-fixes
........
r1368159 | dkulp | 2012-08-01 14:23:41 -0400 (Wed, 01 Aug 2012) | 11 lines
Merged revisions 1368154 via git cherry-pick from
https://svn.apache.org/repos/asf/cxf/trunk
........
r1368154 | dkulp | 2012-08-01 14:18:14 -0400 (Wed, 01 Aug 2012) | 3 lines
If creating the STS endpoint for SecConv, adjust some of the names and
actions and such to match the SecConv spec
........
........
........
[dkulp] Merged revisions 1368168 via git cherry-pick from
https://svn.apache.org/repos/asf/cxf/branches/2.5.x-fixes
........
r1368168 | dkulp | 2012-08-01 14:28:20 -0400 (Wed, 01 Aug 2012) | 18 lines
Merged revisions 1368114 via git cherry-pick from
https://svn.apache.org/repos/asf/cxf/branches/2.6.x-fixes
........
r1368114 | dkulp | 2012-08-01 12:42:38 -0400 (Wed, 01 Aug 2012) | 10 lines
Merged revisions 1368103 via git cherry-pick from
https://svn.apache.org/repos/asf/cxf/trunk
........
r1368103 | dkulp | 2012-08-01 12:24:24 -0400 (Wed, 01 Aug 2012) | 2 lines
Make sure the test case wires the message parts into the messageinfo
........
........
........
[dkulp] Merged revisions 1368167 via git cherry-pick from
https://svn.apache.org/repos/asf/cxf/branches/2.5.x-fixes
........
r1368167 | dkulp | 2012-08-01 14:28:16 -0400 (Wed, 01 Aug 2012) | 18 lines
Merged revisions 1368113 via git cherry-pick from
https://svn.apache.org/repos/asf/cxf/branches/2.6.x-fixes
........
r1368113 | dkulp | 2012-08-01 12:42:34 -0400 (Wed, 01 Aug 2012) | 10 lines
Merged revisions 1368101 via git cherry-pick from
https://svn.apache.org/repos/asf/cxf/trunk
........
r1368101 | dkulp | 2012-08-01 12:24:20 -0400 (Wed, 01 Aug 2012) | 2 lines
[CXF-4450] Evaluate the wsam:Action attributes as well
........
........
........
[dkulp] Merged revisions 1368166 via git cherry-pick from
https://svn.apache.org/repos/asf/cxf/branches/2.5.x-fixes
........
r1368166 | dkulp | 2012-08-01 14:28:11 -0400 (Wed, 01 Aug 2012) | 18 lines
Merged revisions 1368112 via git cherry-pick from
https://svn.apache.org/repos/asf/cxf/branches/2.6.x-fixes
........
r1368112 | dkulp | 2012-08-01 12:42:30 -0400 (Wed, 01 Aug 2012) | 10 lines
Merged revisions 1368100 via git cherry-pick from
https://svn.apache.org/repos/asf/cxf/trunk
........
r1368100 | dkulp | 2012-08-01 12:24:16 -0400 (Wed, 01 Aug 2012) | 2 lines
[CXF-4448] Generate valid SOAP messages with @XmlList on doc/lit/bare
........
........
........
[dkulp] Merged revisions 1368165 via git cherry-pick from
https://svn.apache.org/repos/asf/cxf/branches/2.5.x-fixes
........
r1368165 | dkulp | 2012-08-01 14:28:07 -0400 (Wed, 01 Aug 2012) | 18 lines
Merged revisions 1368111 via git cherry-pick from
https://svn.apache.org/repos/asf/cxf/branches/2.6.x-fixes
........
r1368111 | dkulp | 2012-08-01 12:42:26 -0400 (Wed, 01 Aug 2012) | 10 lines
Merged revisions 1368099 via git cherry-pick from
https://svn.apache.org/repos/asf/cxf/trunk
........
r1368099 | dkulp | 2012-08-01 12:24:12 -0400 (Wed, 01 Aug 2012) | 2 lines
[CXF-4449] Make sure the xmlbinding root elements are qualified
........
........
........
[coheigea] Recording revisions 1368039,1368049 via git from
https://svn.apache.org/repos/asf/cxf/branches/2.5.x-fixes
[coheigea] Merged revisions 1368015 via git cherry-pick from
https://svn.apache.org/repos/asf/cxf/trunk
........
r1368015 | coheigea | 2012-08-01 15:24:01 +0100 (Wed, 01 Aug 2012) | 2 lines
More updates to WS-SecurityPolicy configuration
........
Conflicts:
rt/ws/security/src/main/java/org/apache/cxf/ws/security/SecurityConstants.java
Conflicts:
rt/ws/security/src/main/java/org/apache/cxf/ws/security/SecurityConstants.java
[coheigea] Recording revisions 1367929,1367930 via git from
https://svn.apache.org/repos/asf/cxf/branches/2.5.x-fixes
[coheigea] Merged revisions 1367929 via git cherry-pick from
https://svn.apache.org/repos/asf/cxf/branches/2.5.x-fixes
........
r1367929 | coheigea | 2012-08-01 12:42:18 +0100 (Wed, 01 Aug 2012) | 18 lines
Merged revisions 1367922 via git cherry-pick from
https://svn.apache.org/repos/asf/cxf/branches/2.6.x-fixes
........
r1367922 | coheigea | 2012-08-01 12:15:48 +0100 (Wed, 01 Aug 2012) | 10 lines
Merged revisions 1367920 via git cherry-pick from
https://svn.apache.org/repos/asf/cxf/trunk
........
r1367920 | coheigea | 2012-08-01 12:09:05 +0100 (Wed, 01 Aug 2012) | 2 lines
Upgrading to WSS4J 1.6.7
........
........
........
[coheigea] Blocking revisions 1367913,1367914 via git from
https://svn.apache.org/repos/asf/cxf/branches/2.5.x-fixes
........
r1367913 | coheigea | 2012-08-01 11:43:54 +0100 (Wed, 01 Aug 2012) | 18 lines
Merged revisions 1367908 via git cherry-pick from
https://svn.apache.org/repos/asf/cxf/branches/2.6.x-fixes
........
r1367908 | coheigea | 2012-08-01 11:19:25 +0100 (Wed, 01 Aug 2012) | 10 lines
Merged revisions 1367906 via git cherry-pick from
https://svn.apache.org/repos/asf/cxf/trunk
........
r1367906 | coheigea | 2012-08-01 11:14:48 +0100 (Wed, 01 Aug 2012) | 2 lines
Updated SOAPAction urls in the wsdl for SecureConversation
........
........
........
........
r1367914 | coheigea | 2012-08-01 11:44:06 +0100 (Wed, 01 Aug 2012) | 3 lines
Recording revisions 1367908,1367909 via git from
https://svn.apache.org/repos/asf/cxf/branches/2.6.x-fixes
........
------------------------------------------
[...truncated 13703 lines...]
[INFO] ------------------------------------------------------------------------
[INFO] Building Java First demo service using the JAXWSFactoryBeans
[INFO] task-segment: [clean, deploy]
[INFO] ------------------------------------------------------------------------
[INFO] [clean:clean {execution: default-clean}]
[INFO] Deleting directory <https://builds.apache.org/job/CXF-2.4-deploy/ws/cxf-2.4.x-fixes/distribution/src/main/release/samples/java_first_jaxws_factory_bean/target>
[INFO] [resources:resources {execution: default-resources}]
[INFO] Using 'UTF-8' encoding to copy filtered resources.
[INFO] skip non existing resourceDirectory <https://builds.apache.org/job/CXF-2.4-deploy/ws/cxf-2.4.x-fixes/distribution/src/main/release/samples/java_first_jaxws_factory_bean/src/main/resources>
[INFO] [compiler:compile {execution: default-compile}]
[INFO] Compiling 4 source files to <https://builds.apache.org/job/CXF-2.4-deploy/ws/cxf-2.4.x-fixes/distribution/src/main/release/samples/java_first_jaxws_factory_bean/target/classes>
[INFO] [resources:testResources {execution: default-testResources}]
[INFO] Using 'UTF-8' encoding to copy filtered resources.
[INFO] skip non existing resourceDirectory <https://builds.apache.org/job/CXF-2.4-deploy/ws/cxf-2.4.x-fixes/distribution/src/main/release/samples/java_first_jaxws_factory_bean/src/test/resources>
[INFO] [compiler:testCompile {execution: default-testCompile}]
[INFO] No sources to compile
[INFO] [surefire:test {execution: default-test}]
[INFO] Tests are skipped.
[INFO] [jar:jar {execution: default-jar}]
[INFO] Building jar: <https://builds.apache.org/job/CXF-2.4-deploy/ws/cxf-2.4.x-fixes/distribution/src/main/release/samples/java_first_jaxws_factory_bean/target/java_first_jaxws_factory_bean-2.4.9-SNAPSHOT.jar>
[INFO] [install:install {execution: default-install}]
[INFO] Installing <https://builds.apache.org/job/CXF-2.4-deploy/ws/cxf-2.4.x-fixes/distribution/src/main/release/samples/java_first_jaxws_factory_bean/target/java_first_jaxws_factory_bean-2.4.9-SNAPSHOT.jar> to /home/jenkins/jenkins-slave/maven-repositories/1/org/apache/cxf/samples/java_first_jaxws_factory_bean/2.4.9-SNAPSHOT/java_first_jaxws_factory_bean-2.4.9-SNAPSHOT.jar
[INFO] [deploy:deploy {execution: default-deploy}]
[INFO] skipping artifact deployement
[JENKINS] Archiving <https://builds.apache.org/job/CXF-2.4-deploy/ws/cxf-2.4.x-fixes/distribution/src/main/release/samples/java_first_jaxws_factory_bean/pom.xml> to /home/hudson/hudson/jobs/CXF-2.4-deploy/modules/org.apache.cxf.samples$java_first_jaxws_factory_bean/builds/2012-08-02_08-05-06/archive/org.apache.cxf.samples/java_first_jaxws_factory_bean/2.4.9-SNAPSHOT/java_first_jaxws_factory_bean-2.4.9-SNAPSHOT.pom
[JENKINS] Archiving <https://builds.apache.org/job/CXF-2.4-deploy/ws/cxf-2.4.x-fixes/distribution/src/main/release/samples/java_first_jaxws_factory_bean/target/java_first_jaxws_factory_bean-2.4.9-SNAPSHOT.jar> to /home/hudson/hudson/jobs/CXF-2.4-deploy/modules/org.apache.cxf.samples$java_first_jaxws_factory_bean/builds/2012-08-02_08-05-06/archive/org.apache.cxf.samples/java_first_jaxws_factory_bean/2.4.9-SNAPSHOT/java_first_jaxws_factory_bean-2.4.9-SNAPSHOT.jar
[INFO] ------------------------------------------------------------------------
[INFO] Building Java First demo using JAX-WS and JMS
[INFO] task-segment: [clean, deploy]
[INFO] ------------------------------------------------------------------------
[INFO] [clean:clean {execution: default-clean}]
[INFO] Deleting directory <https://builds.apache.org/job/CXF-2.4-deploy/ws/cxf-2.4.x-fixes/distribution/src/main/release/samples/java_first_jms/target>
[INFO] [resources:resources {execution: default-resources}]
[INFO] Using 'UTF-8' encoding to copy filtered resources.
[INFO] skip non existing resourceDirectory <https://builds.apache.org/job/CXF-2.4-deploy/ws/cxf-2.4.x-fixes/distribution/src/main/release/samples/java_first_jms/src/main/resources>
[INFO] [compiler:compile {execution: default-compile}]
[INFO] Compiling 4 source files to <https://builds.apache.org/job/CXF-2.4-deploy/ws/cxf-2.4.x-fixes/distribution/src/main/release/samples/java_first_jms/target/classes>
[INFO] [resources:testResources {execution: default-testResources}]
[INFO] Using 'UTF-8' encoding to copy filtered resources.
[INFO] Copying 1 resource
[INFO] [compiler:testCompile {execution: default-testCompile}]
[INFO] No sources to compile
[INFO] [surefire:test {execution: default-test}]
[INFO] Tests are skipped.
[INFO] [jar:jar {execution: default-jar}]
[INFO] Building jar: <https://builds.apache.org/job/CXF-2.4-deploy/ws/cxf-2.4.x-fixes/distribution/src/main/release/samples/java_first_jms/target/java_first_jaxws_jms-2.4.9-SNAPSHOT.jar>
[INFO] [install:install {execution: default-install}]
[INFO] Installing <https://builds.apache.org/job/CXF-2.4-deploy/ws/cxf-2.4.x-fixes/distribution/src/main/release/samples/java_first_jms/target/java_first_jaxws_jms-2.4.9-SNAPSHOT.jar> to /home/jenkins/jenkins-slave/maven-repositories/1/org/apache/cxf/samples/java_first_jaxws_jms/2.4.9-SNAPSHOT/java_first_jaxws_jms-2.4.9-SNAPSHOT.jar
[INFO] [deploy:deploy {execution: default-deploy}]
[INFO] skipping artifact deployement
[JENKINS] Archiving <https://builds.apache.org/job/CXF-2.4-deploy/ws/cxf-2.4.x-fixes/distribution/src/main/release/samples/java_first_jms/pom.xml> to /home/hudson/hudson/jobs/CXF-2.4-deploy/modules/org.apache.cxf.samples$java_first_jaxws_jms/builds/2012-08-02_08-05-06/archive/org.apache.cxf.samples/java_first_jaxws_jms/2.4.9-SNAPSHOT/java_first_jaxws_jms-2.4.9-SNAPSHOT.pom
[JENKINS] Archiving <https://builds.apache.org/job/CXF-2.4-deploy/ws/cxf-2.4.x-fixes/distribution/src/main/release/samples/java_first_jms/target/java_first_jaxws_jms-2.4.9-SNAPSHOT.jar> to /home/hudson/hudson/jobs/CXF-2.4-deploy/modules/org.apache.cxf.samples$java_first_jaxws_jms/builds/2012-08-02_08-05-06/archive/org.apache.cxf.samples/java_first_jaxws_jms/2.4.9-SNAPSHOT/java_first_jaxws_jms-2.4.9-SNAPSHOT.jar
[INFO] ------------------------------------------------------------------------
[INFO] Building JAX-RS Content Negotiation Demo
[INFO] task-segment: [clean, deploy]
[INFO] ------------------------------------------------------------------------
[INFO] [clean:clean {execution: default-clean}]
[INFO] Deleting directory <https://builds.apache.org/job/CXF-2.4-deploy/ws/cxf-2.4.x-fixes/distribution/src/main/release/samples/jax_rs/content_negotiation/target>
[INFO] [resources:resources {execution: default-resources}]
[INFO] Using 'UTF-8' encoding to copy filtered resources.
[INFO] skip non existing resourceDirectory <https://builds.apache.org/job/CXF-2.4-deploy/ws/cxf-2.4.x-fixes/distribution/src/main/release/samples/jax_rs/content_negotiation/src/main/resources>
[INFO] [compiler:compile {execution: default-compile}]
[INFO] Compiling 4 source files to <https://builds.apache.org/job/CXF-2.4-deploy/ws/cxf-2.4.x-fixes/distribution/src/main/release/samples/jax_rs/content_negotiation/target/classes>
[INFO] [resources:testResources {execution: default-testResources}]
[INFO] Using 'UTF-8' encoding to copy filtered resources.
[INFO] skip non existing resourceDirectory <https://builds.apache.org/job/CXF-2.4-deploy/ws/cxf-2.4.x-fixes/distribution/src/main/release/samples/jax_rs/content_negotiation/src/test/resources>
[INFO] [compiler:testCompile {execution: default-testCompile}]
[INFO] No sources to compile
[INFO] [surefire:test {execution: default-test}]
[INFO] Tests are skipped.
[INFO] [jar:jar {execution: default-jar}]
[INFO] Building jar: <https://builds.apache.org/job/CXF-2.4-deploy/ws/cxf-2.4.x-fixes/distribution/src/main/release/samples/jax_rs/content_negotiation/target/jax_rs_content_negotiation-2.4.9-SNAPSHOT.jar>
[INFO] [install:install {execution: default-install}]
[INFO] Installing <https://builds.apache.org/job/CXF-2.4-deploy/ws/cxf-2.4.x-fixes/distribution/src/main/release/samples/jax_rs/content_negotiation/target/jax_rs_content_negotiation-2.4.9-SNAPSHOT.jar> to /home/jenkins/jenkins-slave/maven-repositories/1/org/apache/cxf/samples/jax_rs_content_negotiation/2.4.9-SNAPSHOT/jax_rs_content_negotiation-2.4.9-SNAPSHOT.jar
[INFO] [deploy:deploy {execution: default-deploy}]
[INFO] skipping artifact deployement
[JENKINS] Archiving <https://builds.apache.org/job/CXF-2.4-deploy/ws/cxf-2.4.x-fixes/distribution/src/main/release/samples/jax_rs/content_negotiation/pom.xml> to /home/hudson/hudson/jobs/CXF-2.4-deploy/modules/org.apache.cxf.samples$jax_rs_content_negotiation/builds/2012-08-02_08-05-06/archive/org.apache.cxf.samples/jax_rs_content_negotiation/2.4.9-SNAPSHOT/jax_rs_content_negotiation-2.4.9-SNAPSHOT.pom
[JENKINS] Archiving <https://builds.apache.org/job/CXF-2.4-deploy/ws/cxf-2.4.x-fixes/distribution/src/main/release/samples/jax_rs/content_negotiation/target/jax_rs_content_negotiation-2.4.9-SNAPSHOT.jar> to /home/hudson/hudson/jobs/CXF-2.4-deploy/modules/org.apache.cxf.samples$jax_rs_content_negotiation/builds/2012-08-02_08-05-06/archive/org.apache.cxf.samples/jax_rs_content_negotiation/2.4.9-SNAPSHOT/jax_rs_content_negotiation-2.4.9-SNAPSHOT.jar
[INFO] ------------------------------------------------------------------------
[INFO] Building JAX-RS Basic Demo With HTTPS communications
[INFO] task-segment: [clean, deploy]
[INFO] ------------------------------------------------------------------------
[INFO] [clean:clean {execution: default-clean}]
[INFO] Deleting directory <https://builds.apache.org/job/CXF-2.4-deploy/ws/cxf-2.4.x-fixes/distribution/src/main/release/samples/jax_rs/basic_https/target>
[INFO] [resources:resources {execution: default-resources}]
[INFO] Using 'UTF-8' encoding to copy filtered resources.
[INFO] Copying 2 resources
[INFO] [compiler:compile {execution: default-compile}]
[INFO] Compiling 8 source files to <https://builds.apache.org/job/CXF-2.4-deploy/ws/cxf-2.4.x-fixes/distribution/src/main/release/samples/jax_rs/basic_https/target/classes>
[INFO] [resources:testResources {execution: default-testResources}]
[INFO] Using 'UTF-8' encoding to copy filtered resources.
[INFO] skip non existing resourceDirectory <https://builds.apache.org/job/CXF-2.4-deploy/ws/cxf-2.4.x-fixes/distribution/src/main/release/samples/jax_rs/basic_https/src/test/resources>
[INFO] [compiler:testCompile {execution: default-testCompile}]
[INFO] No sources to compile
[INFO] [surefire:test {execution: default-test}]
[INFO] Tests are skipped.
[INFO] [jar:jar {execution: default-jar}]
[INFO] Building jar: <https://builds.apache.org/job/CXF-2.4-deploy/ws/cxf-2.4.x-fixes/distribution/src/main/release/samples/jax_rs/basic_https/target/jax_rs_basic_https-2.4.9-SNAPSHOT.jar>
[INFO] [install:install {execution: default-install}]
[INFO] Installing <https://builds.apache.org/job/CXF-2.4-deploy/ws/cxf-2.4.x-fixes/distribution/src/main/release/samples/jax_rs/basic_https/target/jax_rs_basic_https-2.4.9-SNAPSHOT.jar> to /home/jenkins/jenkins-slave/maven-repositories/1/org/apache/cxf/samples/jax_rs_basic_https/2.4.9-SNAPSHOT/jax_rs_basic_https-2.4.9-SNAPSHOT.jar
[INFO] [deploy:deploy {execution: default-deploy}]
[INFO] skipping artifact deployement
[JENKINS] Archiving <https://builds.apache.org/job/CXF-2.4-deploy/ws/cxf-2.4.x-fixes/distribution/src/main/release/samples/jax_rs/basic_https/pom.xml> to /home/hudson/hudson/jobs/CXF-2.4-deploy/modules/org.apache.cxf.samples$jax_rs_basic_https/builds/2012-08-02_08-05-07/archive/org.apache.cxf.samples/jax_rs_basic_https/2.4.9-SNAPSHOT/jax_rs_basic_https-2.4.9-SNAPSHOT.pom
[JENKINS] Archiving <https://builds.apache.org/job/CXF-2.4-deploy/ws/cxf-2.4.x-fixes/distribution/src/main/release/samples/jax_rs/basic_https/target/jax_rs_basic_https-2.4.9-SNAPSHOT.jar> to /home/hudson/hudson/jobs/CXF-2.4-deploy/modules/org.apache.cxf.samples$jax_rs_basic_https/builds/2012-08-02_08-05-07/archive/org.apache.cxf.samples/jax_rs_basic_https/2.4.9-SNAPSHOT/jax_rs_basic_https-2.4.9-SNAPSHOT.jar
[INFO] ------------------------------------------------------------------------
[INFO] Building JAX-RS Basic Demo
[INFO] task-segment: [clean, deploy]
[INFO] ------------------------------------------------------------------------
[INFO] [clean:clean {execution: default-clean}]
[INFO] Deleting directory <https://builds.apache.org/job/CXF-2.4-deploy/ws/cxf-2.4.x-fixes/distribution/src/main/release/samples/jax_rs/basic/target>
[INFO] [antrun:run {execution: copyxmlfiles}]
project.artifactId
[INFO] Executing tasks
[copy] Copying 1 file to <https://builds.apache.org/job/CXF-2.4-deploy/ws/cxf-2.4.x-fixes/distribution/src/main/release/samples/jax_rs/basic/target/classes/demo/jaxrs/client>
[copy] Copying 1 file to <https://builds.apache.org/job/CXF-2.4-deploy/ws/cxf-2.4.x-fixes/distribution/src/main/release/samples/jax_rs/basic/target/classes/demo/jaxrs/client>
[INFO] Executed tasks
[INFO] [resources:resources {execution: default-resources}]
[INFO] Using 'UTF-8' encoding to copy filtered resources.
[INFO] skip non existing resourceDirectory <https://builds.apache.org/job/CXF-2.4-deploy/ws/cxf-2.4.x-fixes/distribution/src/main/release/samples/jax_rs/basic/src/main/resources>
[INFO] [compiler:compile {execution: default-compile}]
[INFO] Compiling 6 source files to <https://builds.apache.org/job/CXF-2.4-deploy/ws/cxf-2.4.x-fixes/distribution/src/main/release/samples/jax_rs/basic/target/classes>
[INFO] [resources:testResources {execution: default-testResources}]
[INFO] Using 'UTF-8' encoding to copy filtered resources.
[INFO] skip non existing resourceDirectory <https://builds.apache.org/job/CXF-2.4-deploy/ws/cxf-2.4.x-fixes/distribution/src/main/release/samples/jax_rs/basic/src/test/resources>
[INFO] [compiler:testCompile {execution: default-testCompile}]
[INFO] No sources to compile
[INFO] [surefire:test {execution: default-test}]
[INFO] Tests are skipped.
[INFO] [jar:jar {execution: default-jar}]
[INFO] Building jar: <https://builds.apache.org/job/CXF-2.4-deploy/ws/cxf-2.4.x-fixes/distribution/src/main/release/samples/jax_rs/basic/target/jax_rs_basic-2.4.9-SNAPSHOT.jar>
[INFO] [install:install {execution: default-install}]
[INFO] Installing <https://builds.apache.org/job/CXF-2.4-deploy/ws/cxf-2.4.x-fixes/distribution/src/main/release/samples/jax_rs/basic/target/jax_rs_basic-2.4.9-SNAPSHOT.jar> to /home/jenkins/jenkins-slave/maven-repositories/1/org/apache/cxf/samples/jax_rs_basic/2.4.9-SNAPSHOT/jax_rs_basic-2.4.9-SNAPSHOT.jar
[INFO] [deploy:deploy {execution: default-deploy}]
[INFO] skipping artifact deployement
[JENKINS] Archiving <https://builds.apache.org/job/CXF-2.4-deploy/ws/cxf-2.4.x-fixes/distribution/src/main/release/samples/jax_rs/basic/pom.xml> to /home/hudson/hudson/jobs/CXF-2.4-deploy/modules/org.apache.cxf.samples$jax_rs_basic/builds/2012-08-02_08-05-07/archive/org.apache.cxf.samples/jax_rs_basic/2.4.9-SNAPSHOT/jax_rs_basic-2.4.9-SNAPSHOT.pom
[JENKINS] Archiving <https://builds.apache.org/job/CXF-2.4-deploy/ws/cxf-2.4.x-fixes/distribution/src/main/release/samples/jax_rs/basic/target/jax_rs_basic-2.4.9-SNAPSHOT.jar> to /home/hudson/hudson/jobs/CXF-2.4-deploy/modules/org.apache.cxf.samples$jax_rs_basic/builds/2012-08-02_08-05-07/archive/org.apache.cxf.samples/jax_rs_basic/2.4.9-SNAPSHOT/jax_rs_basic-2.4.9-SNAPSHOT.jar
[INFO] ------------------------------------------------------------------------
[INFO] Building CXF sample using a callbak object
[INFO] task-segment: [clean, deploy]
[INFO] ------------------------------------------------------------------------
[INFO] [clean:clean {execution: default-clean}]
[INFO] Deleting directory <https://builds.apache.org/job/CXF-2.4-deploy/ws/cxf-2.4.x-fixes/distribution/src/main/release/samples/callback/target>
[INFO] [cxf-codegen:wsdl2java {execution: generate-CallbackService}]
[INFO] [cxf-codegen:wsdl2java {execution: generate-SOAPService}]
[INFO] [antrun:run {execution: prepare-transform}]
project.artifactId
[INFO] Executing tasks
[copy] Copying 1 file to <https://builds.apache.org/job/CXF-2.4-deploy/ws/cxf-2.4.x-fixes/distribution/src/main/release/samples/callback/target/classes/demo/callback/client>
[INFO] Executed tasks
[INFO] [resources:resources {execution: default-resources}]
[INFO] Using 'UTF-8' encoding to copy filtered resources.
[INFO] skip non existing resourceDirectory <https://builds.apache.org/job/CXF-2.4-deploy/ws/cxf-2.4.x-fixes/distribution/src/main/release/samples/callback/src/main/resources>
[INFO] [compiler:compile {execution: default-compile}]
[INFO] Compiling 9 source files to <https://builds.apache.org/job/CXF-2.4-deploy/ws/cxf-2.4.x-fixes/distribution/src/main/release/samples/callback/target/classes>
[INFO] [resources:testResources {execution: default-testResources}]
[INFO] Using 'UTF-8' encoding to copy filtered resources.
[INFO] skip non existing resourceDirectory <https://builds.apache.org/job/CXF-2.4-deploy/ws/cxf-2.4.x-fixes/distribution/src/main/release/samples/callback/src/test/resources>
[INFO] [compiler:testCompile {execution: default-testCompile}]
[INFO] No sources to compile
[INFO] [surefire:test {execution: default-test}]
[INFO] Tests are skipped.
[INFO] [jar:jar {execution: default-jar}]
[INFO] Building jar: <https://builds.apache.org/job/CXF-2.4-deploy/ws/cxf-2.4.x-fixes/distribution/src/main/release/samples/callback/target/callback-2.4.9-SNAPSHOT.jar>
[INFO] [install:install {execution: default-install}]
[INFO] Installing <https://builds.apache.org/job/CXF-2.4-deploy/ws/cxf-2.4.x-fixes/distribution/src/main/release/samples/callback/target/callback-2.4.9-SNAPSHOT.jar> to /home/jenkins/jenkins-slave/maven-repositories/1/org/apache/cxf/samples/callback/2.4.9-SNAPSHOT/callback-2.4.9-SNAPSHOT.jar
[INFO] [deploy:deploy {execution: default-deploy}]
[INFO] skipping artifact deployement
[JENKINS] Archiving <https://builds.apache.org/job/CXF-2.4-deploy/ws/cxf-2.4.x-fixes/distribution/src/main/release/samples/callback/pom.xml> to /home/hudson/hudson/jobs/CXF-2.4-deploy/modules/org.apache.cxf.samples$callback/builds/2012-08-02_08-05-07/archive/org.apache.cxf.samples/callback/2.4.9-SNAPSHOT/callback-2.4.9-SNAPSHOT.pom
[JENKINS] Archiving <https://builds.apache.org/job/CXF-2.4-deploy/ws/cxf-2.4.x-fixes/distribution/src/main/release/samples/callback/target/callback-2.4.9-SNAPSHOT.jar> to /home/hudson/hudson/jobs/CXF-2.4-deploy/modules/org.apache.cxf.samples$callback/builds/2012-08-02_08-05-07/archive/org.apache.cxf.samples/callback/2.4.9-SNAPSHOT/callback-2.4.9-SNAPSHOT.jar
[INFO] ------------------------------------------------------------------------
[INFO] Building WSDL first demo using BARE Style in XML Binding (pure XML over HTTP)
[INFO] task-segment: [clean, deploy]
[INFO] ------------------------------------------------------------------------
[INFO] [clean:clean {execution: default-clean}]
[INFO] Deleting directory <https://builds.apache.org/job/CXF-2.4-deploy/ws/cxf-2.4.x-fixes/distribution/src/main/release/samples/wsdl_first_pure_xml/target>
[INFO] [cxf-codegen:wsdl2java {execution: generate-sources}]
[JENKINS] Archiving <https://builds.apache.org/job/CXF-2.4-deploy/ws/cxf-2.4.x-fixes/distribution/src/main/release/samples/wsdl_first_pure_xml/pom.xml> to /home/hudson/hudson/jobs/CXF-2.4-deploy/modules/org.apache.cxf.samples$wsdl_first_pure_xml/builds/2012-08-02_08-05-07/archive/org.apache.cxf.samples/wsdl_first_pure_xml/2.4.9-SNAPSHOT/wsdl_first_pure_xml-2.4.9-SNAPSHOT.pom
[INFO] ------------------------------------------------------------------------
[ERROR] BUILD ERROR
[INFO] ------------------------------------------------------------------------
[INFO] Failed to create java return paramter for part [out] in method [sayHi] - this wsdl is invalid, please use the wsdlvalidator tool to validate this wsdl
[INFO] ------------------------------------------------------------------------
[INFO] Trace
org.apache.maven.lifecycle.LifecycleExecutionException: Failed to create java return paramter for part [out] in method [sayHi] - this wsdl is invalid, please use the wsdlvalidator tool to validate this wsdl
at org.apache.maven.lifecycle.DefaultLifecycleExecutor.executeGoals(DefaultLifecycleExecutor.java:719)
at org.apache.maven.lifecycle.DefaultLifecycleExecutor.executeGoalWithLifecycle(DefaultLifecycleExecutor.java:556)
at org.apache.maven.lifecycle.DefaultLifecycleExecutor.executeGoal(DefaultLifecycleExecutor.java:535)
at org.apache.maven.lifecycle.DefaultLifecycleExecutor.executeGoalAndHandleFailures(DefaultLifecycleExecutor.java:387)
at org.apache.maven.lifecycle.DefaultLifecycleExecutor.executeTaskSegments(DefaultLifecycleExecutor.java:348)
at org.apache.maven.lifecycle.DefaultLifecycleExecutor.execute(DefaultLifecycleExecutor.java:180)
at org.apache.maven.lifecycle.LifecycleExecutorInterceptor.execute(LifecycleExecutorInterceptor.java:65)
at org.apache.maven.DefaultMaven.doExecute(DefaultMaven.java:328)
at org.apache.maven.DefaultMaven.execute(DefaultMaven.java:138)
at org.apache.maven.cli.MavenCli.main(MavenCli.java:362)
at sun.reflect.NativeMethodAccessorImpl.invoke0(Native Method)
at sun.reflect.NativeMethodAccessorImpl.invoke(NativeMethodAccessorImpl.java:39)
at sun.reflect.DelegatingMethodAccessorImpl.invoke(DelegatingMethodAccessorImpl.java:25)
at java.lang.reflect.Method.invoke(Method.java:592)
at org.codehaus.classworlds.Launcher.launchEnhanced(Launcher.java:315)
at org.codehaus.classworlds.Launcher.launch(Launcher.java:255)
at hudson.maven.agent.Main.launch(Main.java:185)
at hudson.maven.MavenBuilder.call(MavenBuilder.java:151)
at hudson.maven.Maven2Builder.call(Maven2Builder.java:77)
at hudson.maven.Maven2Builder.call(Maven2Builder.java:53)
at hudson.remoting.UserRequest.perform(UserRequest.java:118)
at hudson.remoting.UserRequest.perform(UserRequest.java:48)
at hudson.remoting.Request$2.run(Request.java:326)
at hudson.remoting.InterceptingExecutorService$1.call(InterceptingExecutorService.java:72)
at java.util.concurrent.FutureTask$Sync.innerRun(FutureTask.java:269)
at java.util.concurrent.FutureTask.run(FutureTask.java:123)
at java.util.concurrent.ThreadPoolExecutor$Worker.runTask(ThreadPoolExecutor.java:651)
at java.util.concurrent.ThreadPoolExecutor$Worker.run(ThreadPoolExecutor.java:676)
at java.lang.Thread.run(Thread.java:595)
Caused by: org.apache.maven.plugin.MojoExecutionException: Failed to create java return paramter for part [out] in method [sayHi] - this wsdl is invalid, please use the wsdlvalidator tool to validate this wsdl
at org.apache.cxf.maven_plugin.WSDL2JavaMojo.callWsdl2Java(WSDL2JavaMojo.java:619)
at org.apache.cxf.maven_plugin.WSDL2JavaMojo.execute(WSDL2JavaMojo.java:442)
at org.apache.maven.plugin.DefaultPluginManager.executeMojo(DefaultPluginManager.java:490)
at hudson.maven.agent.PluginManagerInterceptor.executeMojo(PluginManagerInterceptor.java:182)
at org.apache.maven.lifecycle.DefaultLifecycleExecutor.executeGoals(DefaultLifecycleExecutor.java:694)
... 28 more
Caused by: org.apache.cxf.tools.common.ToolException: Failed to create java return paramter for part [out] in method [sayHi] - this wsdl is invalid, please use the wsdlvalidator tool to validate this wsdl
at org.apache.cxf.tools.common.model.JavaMethod.setReturn(JavaMethod.java:136)
at org.apache.cxf.tools.wsdlto.frontend.jaxws.processor.internal.ParameterProcessor.processReturn(ParameterProcessor.java:160)
at org.apache.cxf.tools.wsdlto.frontend.jaxws.processor.internal.ParameterProcessor.processOutput(ParameterProcessor.java:333)
at org.apache.cxf.tools.wsdlto.frontend.jaxws.processor.internal.ParameterProcessor.buildParamModelsWithoutOrdering(ParameterProcessor.java:664)
at org.apache.cxf.tools.wsdlto.frontend.jaxws.processor.internal.ParameterProcessor.process(ParameterProcessor.java:87)
at org.apache.cxf.tools.wsdlto.frontend.jaxws.processor.internal.OperationProcessor.processMethod(OperationProcessor.java:141)
at org.apache.cxf.tools.wsdlto.frontend.jaxws.processor.internal.OperationProcessor.process(OperationProcessor.java:62)
at org.apache.cxf.tools.wsdlto.frontend.jaxws.processor.internal.PortTypeProcessor.process(PortTypeProcessor.java:149)
at org.apache.cxf.tools.wsdlto.frontend.jaxws.processor.WSDLToJavaProcessor.wsdlDefinitionToJavaModel(WSDLToJavaProcessor.java:88)
at org.apache.cxf.tools.wsdlto.frontend.jaxws.processor.WSDLToJavaProcessor.process(WSDLToJavaProcessor.java:60)
at org.apache.cxf.tools.wsdlto.WSDLToJavaContainer.processWsdl(WSDLToJavaContainer.java:253)
at org.apache.cxf.tools.wsdlto.WSDLToJavaContainer.execute(WSDLToJavaContainer.java:138)
at org.apache.cxf.tools.wsdlto.WSDLToJavaContainer.execute(WSDLToJavaContainer.java:286)
at org.apache.cxf.tools.common.toolspec.ToolRunner.runTool(ToolRunner.java:103)
at org.apache.cxf.tools.wsdlto.WSDLToJava.run(WSDLToJava.java:113)
at org.apache.cxf.tools.wsdlto.WSDLToJava.run(WSDLToJava.java:86)
at org.apache.cxf.maven_plugin.WSDL2JavaMojo.callWsdl2Java(WSDL2JavaMojo.java:616)
... 32 more
[INFO] ------------------------------------------------------------------------
[INFO] Total time: 33 minutes 37 seconds
[INFO] Finished at: Thu Aug 02 08:39:15 UTC 2012
[INFO] Final Memory: 320M/425M
[INFO] ------------------------------------------------------------------------
Sending e-mails to: notifications@cxf.apache.org
channel stopped
[locks-and-latches] Releasing all the locks
[locks-and-latches] All the locks released
Jenkins build is back to normal : CXF-2.4-deploy #255
Posted by Apache Jenkins Server <je...@builds.apache.org>.
See <https://builds.apache.org/job/CXF-2.4-deploy/255/changes>