You are viewing a plain text version of this content. The canonical link for it is here.
Posted to builds@solr.apache.org by Apache Jenkins Server <je...@builds.apache.org> on 2023/08/06 15:58:05 UTC

[JENKINS] Solr » Solr-Smoketest-9.3 - Build # 30 - Failure!

Build: https://ci-builds.apache.org/job/Solr/job/Solr-Smoketest-9.3/30/

Log: 
Started by timer
Running as SYSTEM
[EnvInject] - Loading node environment variables.
Building remotely on lucene-solr-2 (solr lucene) in workspace /home/jenkins/jenkins-slave/workspace/Solr/Solr-Smoketest-9.3
The recommended git tool is: NONE
No credentials specified
 > git rev-parse --resolve-git-dir /home/jenkins/jenkins-slave/workspace/Solr/Solr-Smoketest-9.3/.git # timeout=10
Fetching changes from the remote Git repository
 > git config remote.origin.url https://github.com/apache/solr.git # timeout=10
Cleaning workspace
 > git rev-parse --verify HEAD # timeout=10
Resetting working tree
 > git reset --hard # timeout=10
 > git clean -fdx # timeout=10
Fetching upstream changes from https://github.com/apache/solr.git
 > git --version # timeout=10
 > git --version # 'git version 2.25.1'
 > git fetch --tags --force --progress -- https://github.com/apache/solr.git +refs/heads/*:refs/remotes/origin/* # timeout=10
 > git rev-parse origin/branch_9_3^{commit} # timeout=10
Checking out Revision 72346aab9e63fb071f617b9c01f807429da2e7d0 (origin/branch_9_3)
 > git config core.sparsecheckout # timeout=10
 > git checkout -f 72346aab9e63fb071f617b9c01f807429da2e7d0 # timeout=10
Commit message: "Fix a typo in move-replica API documentation (#1801)"
 > git rev-list --no-walk 72346aab9e63fb071f617b9c01f807429da2e7d0 # timeout=10
No emails were triggered.
provisioning config files...
copy managed file [gradle.properties] to file:/home/jenkins/jenkins-slave/workspace/Solr/Solr-Smoketest-9.3/gradle.properties
[Gradle] - Launching build.
[Solr-Smoketest-9.3] $ /home/jenkins/jenkins-slave/workspace/Solr/Solr-Smoketest-9.3/gradlew -Dversion.suffix= -Dgradle.user.home=/home/jenkins/jenkins-slave/workspace/Solr/.gradle -Porg.gradle.daemon=false -Pvalidation.git.failOnModified=false --continue -x signJarsPublication clean assembleRelease
Downloading gradle-wrapper.jar from https://raw.githubusercontent.com/gradle/gradle/v7.6.0/gradle/wrapper/gradle-wrapper.jar
To honour the JVM settings for this build a single-use Daemon process will be forked. See https://docs.gradle.org/7.6/userguide/gradle_daemon.html#sec:disabling_the_daemon.
Daemon will be stopped at the end of the build 
> Task :buildSrc:compileJava
> Task :buildSrc:compileGroovy NO-SOURCE
> Task :buildSrc:processResources NO-SOURCE
> Task :buildSrc:classes
> Task :buildSrc:jar
> Task :buildSrc:assemble
> Task :buildSrc:compileTestJava NO-SOURCE
> Task :buildSrc:compileTestGroovy NO-SOURCE
> Task :buildSrc:processTestResources NO-SOURCE
> Task :buildSrc:testClasses UP-TO-DATE
> Task :buildSrc:test NO-SOURCE
> Task :buildSrc:check UP-TO-DATE
> Task :buildSrc:build
> Task :clean
> Task :solr:clean UP-TO-DATE
> Task :solr:benchmark:clean
> Task :solr:core:clean
> Task :solr:distribution:clean UP-TO-DATE
> Task :solr:docker:clean UP-TO-DATE
> Task :solr:documentation:clean UP-TO-DATE
> Task :solr:example:clean UP-TO-DATE
> Task :solr:modules:clean UP-TO-DATE
> Task :solr:packaging:clean UP-TO-DATE
> Task :solr:prometheus-exporter:clean
> Task :solr:server:clean
> Task :solr:solr-ref-guide:clean
> Task :solr:solrj:clean
> Task :solr:solrj-streaming:clean
> Task :solr:solrj-zookeeper:clean
> Task :solr:test-framework:clean
> Task :solr:webapp:clean
> Task :solr:modules:analysis-extras:clean
> Task :solr:modules:analytics:clean
> Task :solr:modules:clustering:clean
> Task :solr:modules:extraction:clean
> Task :solr:modules:gcs-repository:clean
> Task :solr:modules:hadoop-auth:clean
> Task :solr:modules:hdfs:clean
> Task :solr:modules:jaegertracer-configurator:clean
> Task :solr:modules:jwt-auth:clean
> Task :solr:modules:langid:clean
> Task :solr:modules:ltr:clean
> Task :solr:modules:opentelemetry:clean
> Task :solr:modules:s3-repository:clean
> Task :solr:modules:scripting:clean
> Task :solr:modules:sql:clean
> Task :mavenLocalClean UP-TO-DATE
> Task :solr-missing-doclet:compileJava
> Task :solr-missing-doclet:processResources NO-SOURCE
> Task :solr-missing-doclet:classes
> Task :solr-missing-doclet:jar
> Task :gitStatus
> Task :checkJdkInternalsExportedToGradle

> Task :solr:solrj:compileJava
Note: Some input files use or override a deprecated API.
Note: Recompile with -Xlint:deprecation for details.

> Task :solr:solrj-streaming:compileJava
Note: Some input files use or override a deprecated API.
Note: Recompile with -Xlint:deprecation for details.

> Task :solr:solrj-zookeeper:compileJava
Note: Some input files use or override a deprecated API.
Note: Recompile with -Xlint:deprecation for details.

> Task :solr:core:compileJava
Note: Some input files use or override a deprecated API.
Note: Recompile with -Xlint:deprecation for details.

> Task :solr:core:processResources
> Task :solr:core:classes
> Task :solr:core:jar
> Task :solr:core:generateMetadataFileForJarsPublication SKIPPED
> Task :solr:core:generatePomFileForJarsPublication
> Task :solr:solrj:renderJavadoc
> Task :solr:solrj-streaming:renderJavadoc
> Task :solr:solrj-zookeeper:renderJavadoc
> Task :solr:core:renderJavadoc
> Task :solr:core:javadoc SKIPPED
> Task :solr:core:javadocJar
> Task :solr:core:sourcesJar
> Task :solr:core:publishJarsPublicationToBuildRepository

> Task :solr:prometheus-exporter:compileJava
Note: Some input files use or override a deprecated API.
Note: Recompile with -Xlint:deprecation for details.

> Task :solr:prometheus-exporter:processResources NO-SOURCE
> Task :solr:prometheus-exporter:classes
> Task :solr:prometheus-exporter:jar
> Task :solr:prometheus-exporter:generateMetadataFileForJarsPublication SKIPPED
> Task :solr:prometheus-exporter:generatePomFileForJarsPublication
> Task :solr:prometheus-exporter:renderJavadoc
> Task :solr:prometheus-exporter:javadoc SKIPPED
> Task :solr:prometheus-exporter:javadocJar
> Task :solr:prometheus-exporter:sourcesJar
> Task :solr:prometheus-exporter:publishJarsPublicationToBuildRepository
> Task :solr:solrj:processResources NO-SOURCE
> Task :solr:solrj:classes
> Task :solr:solrj:jar
> Task :solr:solrj:generateMetadataFileForJarsPublication SKIPPED
> Task :solr:solrj:generatePomFileForJarsPublication
> Task :solr:solrj:javadoc SKIPPED
> Task :solr:solrj:javadocJar
> Task :solr:solrj:sourcesJar
> Task :solr:solrj:publishJarsPublicationToBuildRepository
> Task :solr:solrj-streaming:processResources
> Task :solr:solrj-streaming:classes
> Task :solr:solrj-streaming:jar
> Task :solr:solrj-streaming:generateMetadataFileForJarsPublication SKIPPED
> Task :solr:solrj-streaming:generatePomFileForJarsPublication
> Task :solr:solrj-streaming:javadoc SKIPPED
> Task :solr:solrj-streaming:javadocJar
> Task :solr:solrj-streaming:sourcesJar
> Task :solr:solrj-streaming:publishJarsPublicationToBuildRepository
> Task :solr:solrj-zookeeper:processResources NO-SOURCE
> Task :solr:solrj-zookeeper:classes
> Task :solr:solrj-zookeeper:jar
> Task :solr:solrj-zookeeper:generateMetadataFileForJarsPublication SKIPPED
> Task :solr:solrj-zookeeper:generatePomFileForJarsPublication
> Task :solr:solrj-zookeeper:javadoc SKIPPED
> Task :solr:solrj-zookeeper:javadocJar
> Task :solr:solrj-zookeeper:sourcesJar
> Task :solr:solrj-zookeeper:publishJarsPublicationToBuildRepository

> Task :solr:test-framework:compileJava
Note: Some input files use or override a deprecated API.
Note: Recompile with -Xlint:deprecation for details.

> Task :solr:test-framework:processResources
> Task :solr:test-framework:classes
> Task :solr:test-framework:jar
> Task :solr:test-framework:generateMetadataFileForJarsPublication SKIPPED
> Task :solr:test-framework:generatePomFileForJarsPublication
> Task :solr:test-framework:renderJavadoc
> Task :solr:test-framework:javadoc SKIPPED
> Task :solr:test-framework:javadocJar
> Task :solr:test-framework:sourcesJar
> Task :solr:test-framework:publishJarsPublicationToBuildRepository

> Task :solr:modules:analysis-extras:compileJava
Note: /home/jenkins/jenkins-slave/workspace/Solr/Solr-Smoketest-9.3/solr/modules/analysis-extras/src/java/org/apache/solr/schema/ICUCollationField.java uses or overrides a deprecated API.
Note: Recompile with -Xlint:deprecation for details.

> Task :solr:modules:analysis-extras:processResources NO-SOURCE
> Task :solr:modules:analysis-extras:classes
> Task :solr:modules:analysis-extras:jar
> Task :solr:modules:analysis-extras:generateMetadataFileForJarsPublication SKIPPED
> Task :solr:modules:analysis-extras:generatePomFileForJarsPublication
> Task :solr:modules:analysis-extras:renderJavadoc
> Task :solr:modules:analysis-extras:javadoc SKIPPED
> Task :solr:modules:analysis-extras:javadocJar
> Task :solr:modules:analysis-extras:sourcesJar
> Task :solr:modules:analysis-extras:publishJarsPublicationToBuildRepository

> Task :solr:modules:analytics:compileJava
Note: Some input files use or override a deprecated API.
Note: Recompile with -Xlint:deprecation for details.

> Task :solr:modules:analytics:processResources NO-SOURCE
> Task :solr:modules:analytics:classes
> Task :solr:modules:analytics:jar
> Task :solr:modules:analytics:generateMetadataFileForJarsPublication SKIPPED
> Task :solr:modules:analytics:generatePomFileForJarsPublication
> Task :solr:modules:analytics:renderJavadoc
> Task :solr:modules:analytics:javadoc SKIPPED
> Task :solr:modules:analytics:javadocJar
> Task :solr:modules:analytics:sourcesJar
> Task :solr:modules:analytics:publishJarsPublicationToBuildRepository
> Task :solr:modules:clustering:compileJava
> Task :solr:modules:clustering:processResources NO-SOURCE
> Task :solr:modules:clustering:classes
> Task :solr:modules:clustering:jar
> Task :solr:modules:clustering:generateMetadataFileForJarsPublication SKIPPED
> Task :solr:modules:clustering:generatePomFileForJarsPublication
> Task :solr:modules:clustering:renderJavadoc
> Task :solr:modules:clustering:javadoc SKIPPED
> Task :solr:modules:clustering:javadocJar
> Task :solr:modules:clustering:sourcesJar
> Task :solr:modules:clustering:publishJarsPublicationToBuildRepository

> Task :solr:modules:extraction:compileJava
Note: /home/jenkins/jenkins-slave/workspace/Solr/Solr-Smoketest-9.3/solr/modules/extraction/src/java/org/apache/solr/handler/extraction/ExtractingDocumentLoader.java uses or overrides a deprecated API.
Note: Recompile with -Xlint:deprecation for details.

> Task :solr:modules:extraction:processResources
> Task :solr:modules:extraction:classes
> Task :solr:modules:extraction:jar
> Task :solr:modules:extraction:generateMetadataFileForJarsPublication SKIPPED
> Task :solr:modules:extraction:generatePomFileForJarsPublication
> Task :solr:modules:extraction:renderJavadoc
> Task :solr:modules:extraction:javadoc SKIPPED
> Task :solr:modules:extraction:javadocJar
> Task :solr:modules:extraction:sourcesJar
> Task :solr:modules:extraction:publishJarsPublicationToBuildRepository

> Task :solr:modules:gcs-repository:compileJava
Note: /home/jenkins/jenkins-slave/workspace/Solr/Solr-Smoketest-9.3/solr/modules/gcs-repository/src/java/org/apache/solr/gcs/GCSConfigParser.java uses or overrides a deprecated API.
Note: Recompile with -Xlint:deprecation for details.

> Task :solr:modules:gcs-repository:processResources NO-SOURCE
> Task :solr:modules:gcs-repository:classes
> Task :solr:modules:gcs-repository:jar
> Task :solr:modules:gcs-repository:generateMetadataFileForJarsPublication SKIPPED
> Task :solr:modules:gcs-repository:generatePomFileForJarsPublication
> Task :solr:modules:gcs-repository:renderJavadoc
> Task :solr:modules:gcs-repository:javadoc SKIPPED
> Task :solr:modules:gcs-repository:javadocJar
> Task :solr:modules:gcs-repository:sourcesJar
> Task :solr:modules:gcs-repository:publishJarsPublicationToBuildRepository

> Task :solr:modules:hadoop-auth:compileJava
Note: Some input files use or override a deprecated API.
Note: Recompile with -Xlint:deprecation for details.

> Task :solr:modules:hadoop-auth:processResources NO-SOURCE
> Task :solr:modules:hadoop-auth:classes
> Task :solr:modules:hadoop-auth:jar
> Task :solr:modules:hadoop-auth:generateMetadataFileForJarsPublication SKIPPED
> Task :solr:modules:hadoop-auth:generatePomFileForJarsPublication
> Task :solr:modules:hadoop-auth:renderJavadoc
> Task :solr:modules:hadoop-auth:javadoc SKIPPED
> Task :solr:modules:hadoop-auth:javadocJar
> Task :solr:modules:hadoop-auth:sourcesJar
> Task :solr:modules:hadoop-auth:publishJarsPublicationToBuildRepository

> Task :solr:modules:hdfs:compileJava
Note: Some input files use or override a deprecated API.
Note: Recompile with -Xlint:deprecation for details.

> Task :solr:modules:hdfs:processResources NO-SOURCE
> Task :solr:modules:hdfs:classes
> Task :solr:modules:hdfs:jar
> Task :solr:modules:hdfs:generateMetadataFileForJarsPublication SKIPPED
> Task :solr:modules:hdfs:generatePomFileForJarsPublication
> Task :solr:modules:hdfs:renderJavadoc
> Task :solr:modules:hdfs:javadoc SKIPPED
> Task :solr:modules:hdfs:javadocJar
> Task :solr:modules:hdfs:sourcesJar
> Task :solr:modules:hdfs:publishJarsPublicationToBuildRepository
> Task :solr:modules:jaegertracer-configurator:compileJava
> Task :solr:modules:jaegertracer-configurator:processResources NO-SOURCE
> Task :solr:modules:jaegertracer-configurator:classes
> Task :solr:modules:jaegertracer-configurator:jar
> Task :solr:modules:jaegertracer-configurator:generateMetadataFileForJarsPublication SKIPPED
> Task :solr:modules:jaegertracer-configurator:generatePomFileForJarsPublication
> Task :solr:modules:jaegertracer-configurator:renderJavadoc
> Task :solr:modules:jaegertracer-configurator:javadoc SKIPPED
> Task :solr:modules:jaegertracer-configurator:javadocJar
> Task :solr:modules:jaegertracer-configurator:sourcesJar
> Task :solr:modules:jaegertracer-configurator:publishJarsPublicationToBuildRepository

> Task :solr:modules:jwt-auth:compileJava
Note: /home/jenkins/jenkins-slave/workspace/Solr/Solr-Smoketest-9.3/solr/modules/jwt-auth/src/java/org/apache/solr/security/jwt/JWTAuthPlugin.java uses or overrides a deprecated API.
Note: Recompile with -Xlint:deprecation for details.

> Task :solr:modules:jwt-auth:processResources NO-SOURCE
> Task :solr:modules:jwt-auth:classes
> Task :solr:modules:jwt-auth:jar
> Task :solr:modules:jwt-auth:generateMetadataFileForJarsPublication SKIPPED
> Task :solr:modules:jwt-auth:generatePomFileForJarsPublication
> Task :solr:modules:jwt-auth:renderJavadoc
> Task :solr:modules:jwt-auth:javadoc SKIPPED
> Task :solr:modules:jwt-auth:javadocJar
> Task :solr:modules:jwt-auth:sourcesJar
> Task :solr:modules:jwt-auth:publishJarsPublicationToBuildRepository

> Task :solr:modules:langid:compileJava
Note: Some input files use or override a deprecated API.
Note: Recompile with -Xlint:deprecation for details.

> Task :solr:modules:langid:processResources
> Task :solr:modules:langid:classes
> Task :solr:modules:langid:jar
> Task :solr:modules:langid:generateMetadataFileForJarsPublication SKIPPED
> Task :solr:modules:langid:generatePomFileForJarsPublication
> Task :solr:modules:langid:renderJavadoc
> Task :solr:modules:langid:javadoc SKIPPED
> Task :solr:modules:langid:javadocJar
> Task :solr:modules:langid:sourcesJar
> Task :solr:modules:langid:publishJarsPublicationToBuildRepository

> Task :solr:modules:ltr:compileJava
Note: /home/jenkins/jenkins-slave/workspace/Solr/Solr-Smoketest-9.3/solr/modules/ltr/src/java/org/apache/solr/ltr/feature/FieldValueFeature.java uses or overrides a deprecated API.
Note: Recompile with -Xlint:deprecation for details.

> Task :solr:modules:ltr:processResources NO-SOURCE
> Task :solr:modules:ltr:classes
> Task :solr:modules:ltr:jar
> Task :solr:modules:ltr:generateMetadataFileForJarsPublication SKIPPED
> Task :solr:modules:ltr:generatePomFileForJarsPublication
> Task :solr:modules:ltr:renderJavadoc
> Task :solr:modules:ltr:javadoc SKIPPED
> Task :solr:modules:ltr:javadocJar
> Task :solr:modules:ltr:sourcesJar
> Task :solr:modules:ltr:publishJarsPublicationToBuildRepository
> Task :solr:modules:opentelemetry:compileJava
> Task :solr:modules:opentelemetry:processResources NO-SOURCE
> Task :solr:modules:opentelemetry:classes
> Task :solr:modules:opentelemetry:jar
> Task :solr:modules:opentelemetry:generateMetadataFileForJarsPublication SKIPPED
> Task :solr:modules:opentelemetry:generatePomFileForJarsPublication
> Task :solr:modules:opentelemetry:renderJavadoc
> Task :solr:modules:opentelemetry:javadoc SKIPPED
> Task :solr:modules:opentelemetry:javadocJar
> Task :solr:modules:opentelemetry:sourcesJar
> Task :solr:modules:opentelemetry:publishJarsPublicationToBuildRepository
> Task :solr:modules:s3-repository:compileJava
> Task :solr:modules:s3-repository:processResources NO-SOURCE
> Task :solr:modules:s3-repository:classes
> Task :solr:modules:s3-repository:jar
> Task :solr:modules:s3-repository:generateMetadataFileForJarsPublication SKIPPED
> Task :solr:modules:s3-repository:generatePomFileForJarsPublication
> Task :solr:modules:s3-repository:renderJavadoc
> Task :solr:modules:s3-repository:javadoc SKIPPED
> Task :solr:modules:s3-repository:javadocJar
> Task :solr:modules:s3-repository:sourcesJar
> Task :solr:modules:s3-repository:publishJarsPublicationToBuildRepository

> Task :solr:modules:scripting:compileJava
Note: /home/jenkins/jenkins-slave/workspace/Solr/Solr-Smoketest-9.3/solr/modules/scripting/src/java/org/apache/solr/scripting/xslt/XSLTUpdateRequestHandler.java uses or overrides a deprecated API.
Note: Recompile with -Xlint:deprecation for details.

> Task :solr:modules:scripting:processResources NO-SOURCE
> Task :solr:modules:scripting:classes
> Task :solr:modules:scripting:jar
> Task :solr:modules:scripting:generateMetadataFileForJarsPublication SKIPPED
> Task :solr:modules:scripting:generatePomFileForJarsPublication
> Task :solr:modules:scripting:renderJavadoc
> Task :solr:modules:scripting:javadoc SKIPPED
> Task :solr:modules:scripting:javadocJar
> Task :solr:modules:scripting:sourcesJar
> Task :solr:modules:scripting:publishJarsPublicationToBuildRepository

> Task :solr:modules:sql:compileJava
Note: Some input files use or override a deprecated API.
Note: Recompile with -Xlint:deprecation for details.

> Task :solr:modules:sql:processResources
> Task :solr:modules:sql:classes
> Task :solr:modules:sql:jar
> Task :solr:modules:sql:generateMetadataFileForJarsPublication SKIPPED
> Task :solr:modules:sql:generatePomFileForJarsPublication
> Task :solr:modules:sql:renderJavadoc
> Task :solr:modules:sql:javadoc SKIPPED
> Task :solr:modules:sql:javadocJar
> Task :solr:modules:sql:sourcesJar
> Task :solr:modules:sql:publishJarsPublicationToBuildRepository

> Task :mavenToLocalFolder
Local maven artifacts (poms, jars) created at: /home/jenkins/jenkins-slave/workspace/Solr/Solr-Smoketest-9.3/build/maven-local

> Task :checkWorkingCopyClean
> Task :solr:distribution:assembleSourceTgz
> Task :solr:docker:createBodySnippetDockerfile
> Task :solr:docker:createDockerfileLocal
> Task :solr:docker:assemblePackaging
> Task :solr:documentation:changesToHtml
> Task :solr:documentation:copyDocumentationAssets
> Task :solr:documentation:markdownToHtml
> Task :solr:documentation:copyChangesToHtmlForMiniSite
> Task :solr:documentation:copyMiniDocumentationAssets
> Task :solr:documentation:createMiniDocumentationIndex
> Task :solr:documentation:documentationMinimal
> Task :solr:core:assemblePostJar
> Task :solr:example:assemblePackaging
> Task :solr:prometheus-exporter:assemblePackaging
> Task :solr:webapp:compileJava NO-SOURCE
> Task :solr:webapp:processResources NO-SOURCE
> Task :solr:webapp:classes UP-TO-DATE
> Task :solr:webapp:war
> Task :solr:server:assemblePackaging
> Task :solr:modules:analysis-extras:assemblePackaging
> Task :solr:modules:analytics:assemblePackaging
> Task :solr:modules:clustering:assemblePackaging
> Task :solr:modules:extraction:assemblePackaging
> Task :solr:modules:gcs-repository:assemblePackaging
> Task :solr:modules:hadoop-auth:assemblePackaging
> Task :solr:modules:hdfs:assemblePackaging
> Task :solr:modules:jaegertracer-configurator:assemblePackaging
> Task :solr:modules:jwt-auth:assemblePackaging
> Task :solr:modules:langid:assemblePackaging
> Task :solr:modules:ltr:assemblePackaging
> Task :solr:modules:opentelemetry:assemblePackaging
> Task :solr:modules:s3-repository:assemblePackaging
> Task :solr:modules:scripting:assemblePackaging
> Task :solr:modules:sql:assemblePackaging
> Task :solr:packaging:fullDistTar
> Task :solr:packaging:slimDistTar
> Task :solr:distribution:computeChecksums
> Task :solr:distribution:prepareGitRev
> Task :solr:docker:createDockerfileOfficialFull
> Task :solr:docker:createDockerfileOfficialSlim
> Task :solr:distribution:assembleRelease

Deprecated Gradle features were used in this build, making it incompatible with Gradle 8.0.

You can use '--warning-mode all' to show the individual deprecation warnings and determine if they come from your own scripts or plugins.

See https://docs.gradle.org/7.6/userguide/command_line_interface.html#sec:command_line_warnings

BUILD SUCCESSFUL in 3m 42s
232 actionable tasks: 224 executed, 8 up-to-date
Build step 'Invoke Gradle script' changed build result to SUCCESS
Run condition [Always] enabling perform for step [Execute shell]
[Solr-Smoketest-9.3] $ /bin/bash /tmp/jenkins5408852552592168917.sh
Installing Python script requirements
Defaulting to user installation because normal site-packages is not writeable
Requirement already satisfied: six~=1.16.0 in /home/jenkins/.local/lib/python3.8/site-packages (from -r dev-tools/scripts/requirements.txt (line 1)) (1.16.0)
Requirement already satisfied: Jinja2~=3.1.1 in /home/jenkins/.local/lib/python3.8/site-packages (from -r dev-tools/scripts/requirements.txt (line 2)) (3.1.2)
Requirement already satisfied: PyYAML~=6.0 in /home/jenkins/.local/lib/python3.8/site-packages (from -r dev-tools/scripts/requirements.txt (line 3)) (6.0)
Requirement already satisfied: holidays~=0.16 in /home/jenkins/.local/lib/python3.8/site-packages (from -r dev-tools/scripts/requirements.txt (line 4)) (0.21)
Requirement already satisfied: ics~=0.7.2 in /home/jenkins/.local/lib/python3.8/site-packages (from -r dev-tools/scripts/requirements.txt (line 5)) (0.7.2)
Requirement already satisfied: console-menu~=0.7.1 in /home/jenkins/.local/lib/python3.8/site-packages (from -r dev-tools/scripts/requirements.txt (line 6)) (0.7.1)
Requirement already satisfied: PyGithub~=1.56 in /home/jenkins/.local/lib/python3.8/site-packages (from -r dev-tools/scripts/requirements.txt (line 7)) (1.58.0)
Requirement already satisfied: jira~=3.4.1 in /home/jenkins/.local/lib/python3.8/site-packages (from -r dev-tools/scripts/requirements.txt (line 8)) (3.4.1)
Requirement already satisfied: MarkupSafe>=2.0 in /home/jenkins/.local/lib/python3.8/site-packages (from Jinja2~=3.1.1->-r dev-tools/scripts/requirements.txt (line 2)) (2.1.2)
Requirement already satisfied: PyMeeus in /home/jenkins/.local/lib/python3.8/site-packages (from holidays~=0.16->-r dev-tools/scripts/requirements.txt (line 4)) (0.5.11)
Requirement already satisfied: convertdate>=2.3.0 in /home/jenkins/.local/lib/python3.8/site-packages (from holidays~=0.16->-r dev-tools/scripts/requirements.txt (line 4)) (2.4.0)
Requirement already satisfied: hijri-converter in /home/jenkins/.local/lib/python3.8/site-packages (from holidays~=0.16->-r dev-tools/scripts/requirements.txt (line 4)) (2.2.3)
Requirement already satisfied: korean-lunar-calendar in /home/jenkins/.local/lib/python3.8/site-packages (from holidays~=0.16->-r dev-tools/scripts/requirements.txt (line 4)) (0.2.1)
Requirement already satisfied: python-dateutil in /usr/lib/python3/dist-packages (from holidays~=0.16->-r dev-tools/scripts/requirements.txt (line 4)) (2.7.3)
Requirement already satisfied: backports.zoneinfo in /home/jenkins/.local/lib/python3.8/site-packages (from holidays~=0.16->-r dev-tools/scripts/requirements.txt (line 4)) (0.2.1)
Requirement already satisfied: arrow>=0.11 in /home/jenkins/.local/lib/python3.8/site-packages (from ics~=0.7.2->-r dev-tools/scripts/requirements.txt (line 5)) (0.14.7)
Requirement already satisfied: tatsu>4.2 in /home/jenkins/.local/lib/python3.8/site-packages (from ics~=0.7.2->-r dev-tools/scripts/requirements.txt (line 5)) (5.6.1)
Requirement already satisfied: attrs>=19.1.0 in /usr/lib/python3/dist-packages (from ics~=0.7.2->-r dev-tools/scripts/requirements.txt (line 5)) (19.3.0)
Requirement already satisfied: ansiwrap in /home/jenkins/.local/lib/python3.8/site-packages (from console-menu~=0.7.1->-r dev-tools/scripts/requirements.txt (line 6)) (0.8.4)
Requirement already satisfied: deprecated in /home/jenkins/.local/lib/python3.8/site-packages (from PyGithub~=1.56->-r dev-tools/scripts/requirements.txt (line 7)) (1.2.13)
Requirement already satisfied: pyjwt>=2.4.0 in /home/jenkins/.local/lib/python3.8/site-packages (from PyGithub~=1.56->-r dev-tools/scripts/requirements.txt (line 7)) (2.6.0)
Requirement already satisfied: pynacl>=1.4.0 in /home/jenkins/.local/lib/python3.8/site-packages (from PyGithub~=1.56->-r dev-tools/scripts/requirements.txt (line 7)) (1.5.0)
Requirement already satisfied: requests>=2.14.0 in /usr/lib/python3/dist-packages (from PyGithub~=1.56->-r dev-tools/scripts/requirements.txt (line 7)) (2.22.0)
Requirement already satisfied: defusedxml in /home/jenkins/.local/lib/python3.8/site-packages (from jira~=3.4.1->-r dev-tools/scripts/requirements.txt (line 8)) (0.7.1)
Requirement already satisfied: packaging in /home/jenkins/.local/lib/python3.8/site-packages (from jira~=3.4.1->-r dev-tools/scripts/requirements.txt (line 8)) (23.0)
Requirement already satisfied: requests-oauthlib>=1.1.0 in /home/jenkins/.local/lib/python3.8/site-packages (from jira~=3.4.1->-r dev-tools/scripts/requirements.txt (line 8)) (1.3.1)
Requirement already satisfied: requests-toolbelt in /home/jenkins/.local/lib/python3.8/site-packages (from jira~=3.4.1->-r dev-tools/scripts/requirements.txt (line 8)) (0.9.1)
Requirement already satisfied: typing-extensions>=3.7.4.2 in /home/jenkins/.local/lib/python3.8/site-packages (from jira~=3.4.1->-r dev-tools/scripts/requirements.txt (line 8)) (4.5.0)
Requirement already satisfied: cffi>=1.4.1 in /usr/local/lib/python3.8/dist-packages (from pynacl>=1.4.0->PyGithub~=1.56->-r dev-tools/scripts/requirements.txt (line 7)) (1.14.2)
Requirement already satisfied: oauthlib>=3.0.0 in /usr/lib/python3/dist-packages (from requests-oauthlib>=1.1.0->jira~=3.4.1->-r dev-tools/scripts/requirements.txt (line 8)) (3.1.0)
Requirement already satisfied: textwrap3>=0.9.2 in /home/jenkins/.local/lib/python3.8/site-packages (from ansiwrap->console-menu~=0.7.1->-r dev-tools/scripts/requirements.txt (line 6)) (0.9.2)
Requirement already satisfied: wrapt<2,>=1.10 in /home/jenkins/.local/lib/python3.8/site-packages (from deprecated->PyGithub~=1.56->-r dev-tools/scripts/requirements.txt (line 7)) (1.13.3)
Requirement already satisfied: pycparser in /usr/local/lib/python3.8/dist-packages (from cffi>=1.4.1->pynacl>=1.4.0->PyGithub~=1.56->-r dev-tools/scripts/requirements.txt (line 7)) (2.20)
DEPRECATION: dblatex 0.3.11py3 has a non-standard version number. pip 23.3 will enforce this behaviour change. A possible replacement is to upgrade to a newer version of dblatex or contact the author to suggest that they release a version with a conforming version number. Discussion can be found at https://github.com/pypa/pip/issues/12063
DEPRECATION: devscripts 2.20.2ubuntu2 has a non-standard version number. pip 23.3 will enforce this behaviour change. A possible replacement is to upgrade to a newer version of devscripts or contact the author to suggest that they release a version with a conforming version number. Discussion can be found at https://github.com/pypa/pip/issues/12063
Starting Smoke tester in folder /home/jenkins/jenkins-slave/workspace/Solr/Solr-Smoketest-9.3
Java 11 JAVA_HOME=/home/jenkins/tools/java/latest11
NOTE: output encoding is utf-8
NOTE: Not running @Nightly or @BadApple tests. Please verify that recent Jenkins runs have passed.

Load release URL "file:///home/jenkins/jenkins-slave/workspace/Solr/Solr-Smoketest-9.3/solr/distribution/build/release"...

Get KEYS...
    Downloading online KEYS file https://archive.apache.org/dist/solr/KEYS
Downloading https://archive.apache.org/dist/solr/KEYS
    0.3 MB in 1.15 sec (0.3 MB/sec)

Test Solr...
  test basics...
  check changes HTML...
  download solr-9.3.1-slim.tgz...
Downloading file:///home/jenkins/jenkins-slave/workspace/Solr/Solr-Smoketest-9.3/solr/distribution/build/release/solr-9.3.1-slim.tgz
    59.5 MB in 0.05 sec (1305.2 MB/sec)
    verify sha512 digest
  download solr-9.3.1-src.tgz...
Downloading file:///home/jenkins/jenkins-slave/workspace/Solr/Solr-Smoketest-9.3/solr/distribution/build/release/solr-9.3.1-src.tgz
    85.9 MB in 0.07 sec (1248.0 MB/sec)
    verify sha512 digest
  download solr-9.3.1.tgz...
Downloading file:///home/jenkins/jenkins-slave/workspace/Solr/Solr-Smoketest-9.3/solr/distribution/build/release/solr-9.3.1.tgz
    264.4 MB in 0.21 sec (1242.8 MB/sec)
    verify sha512 digest
  unpack solr-9.3.1.tgz...
  solr-9.3.1.tgz
    Checking LICENSE.txt
    Checking NOTICE.txt
    Checking README.txt
    Checking CHANGES.txt
    Checking bin
    Checking modules
    Checking docker
    Checking prometheus-exporter
    Checking docs
    Checking example
    Checking licenses
    Checking server
    Checking lib
    verify JAR metadata/identity/no javax.* or java.* classes...
      **WARNING**: skipping check of /home/jenkins/jenkins-slave/workspace/Solr/Solr-Smoketest-9.3/_tmp/smoke_1691335159/unpack/solr-9.3.1/modules/extraction/lib/unit-api-1.0.jar: it has javax.* classes
      **WARNING**: skipping check of /home/jenkins/jenkins-slave/workspace/Solr/Solr-Smoketest-9.3/_tmp/smoke_1691335159/unpack/solr-9.3.1/modules/extraction/lib/jakarta.activation-1.2.2.jar: it has javax.* classes
      **WARNING**: skipping check of /home/jenkins/jenkins-slave/workspace/Solr/Solr-Smoketest-9.3/_tmp/smoke_1691335159/unpack/solr-9.3.1/server/solr-webapp/webapp/WEB-INF/lib/jakarta.inject-2.6.1.jar: it has javax.* classes
      **WARNING**: skipping check of /home/jenkins/jenkins-slave/workspace/Solr/Solr-Smoketest-9.3/_tmp/smoke_1691335159/unpack/solr-9.3.1/server/solr-webapp/webapp/WEB-INF/lib/jakarta.activation-api-1.2.2.jar: it has javax.* classes
      **WARNING**: skipping check of /home/jenkins/jenkins-slave/workspace/Solr/Solr-Smoketest-9.3/_tmp/smoke_1691335159/unpack/solr-9.3.1/server/solr-webapp/webapp/WEB-INF/lib/jakarta.validation-api-2.0.2.jar: it has javax.* classes
      **WARNING**: skipping check of /home/jenkins/jenkins-slave/workspace/Solr/Solr-Smoketest-9.3/_tmp/smoke_1691335159/unpack/solr-9.3.1/server/solr-webapp/webapp/WEB-INF/lib/jakarta.annotation-api-1.3.5.jar: it has javax.* classes
      **WARNING**: skipping check of /home/jenkins/jenkins-slave/workspace/Solr/Solr-Smoketest-9.3/_tmp/smoke_1691335159/unpack/solr-9.3.1/server/solr-webapp/webapp/WEB-INF/lib/jakarta.ws.rs-api-2.1.6.jar: it has javax.* classes
      **WARNING**: skipping check of /home/jenkins/jenkins-slave/workspace/Solr/Solr-Smoketest-9.3/_tmp/smoke_1691335159/unpack/solr-9.3.1/server/solr-webapp/webapp/WEB-INF/lib/jakarta.xml.bind-api-2.3.3.jar: it has javax.* classes
      **WARNING**: skipping check of /home/jenkins/jenkins-slave/workspace/Solr/Solr-Smoketest-9.3/_tmp/smoke_1691335159/unpack/solr-9.3.1/server/lib/ext/jetty-servlet-api-4.0.6.jar: it has javax.* classes
    copying unpacked distribution for Java 11 ...
    test solr example w/ Java 11...
      start Solr instance (log=/home/jenkins/jenkins-slave/workspace/Solr/Solr-Smoketest-9.3/_tmp/smoke_1691335159/unpack/solr-9.3.1-java11/solr-example.log)...
No process found for Solr node running on port 8983
      Running techproducts example on port 8983 from /home/jenkins/jenkins-slave/workspace/Solr/Solr-Smoketest-9.3/_tmp/smoke_1691335159/unpack/solr-9.3.1-java11
*** [WARN] *** Your open file limit is currently 60000.  
 It should be set to 65000 to avoid operational disruption. 
 If you no longer wish to see this warning, set SOLR_ULIMIT_CHECKS to false in your profile or solr.in.sh
*** [WARN] ***  Your Max Processes Limit is currently 30000. 
 It should be set to 65000 to avoid operational disruption. 
 If you no longer wish to see this warning, set SOLR_ULIMIT_CHECKS to false in your profile or solr.in.sh
Creating Solr home directory /home/jenkins/jenkins-slave/workspace/Solr/Solr-Smoketest-9.3/_tmp/smoke_1691335159/unpack/solr-9.3.1-java11/example/techproducts/solr

Starting up Solr on port 8983 using command:
"bin/solr" start -p 8983 -s "example/techproducts/solr"

*** [WARN] *** Your open file limit is currently 60000.  
 It should be set to 65000 to avoid operational disruption. 
 If you no longer wish to see this warning, set SOLR_ULIMIT_CHECKS to false in your profile or solr.in.sh
*** [WARN] ***  Your Max Processes Limit is currently 30000. 
 It should be set to 65000 to avoid operational disruption. 
 If you no longer wish to see this warning, set SOLR_ULIMIT_CHECKS to false in your profile or solr.in.sh
Warning: Available entropy is low. As a result, use of the UUIDField, SSL, or any other features that require
RNG might not work properly. To check for the amount of available entropy, use 'cat /proc/sys/kernel/random/entropy_avail'.

Waiting up to 180 seconds to see Solr running on port 8983 [|]   [/]   [-]   [\]   [|]  
Started Solr server on port 8983 (pid=1393725). Happy searching!

    
Created new core 'techproducts'
Indexing tech product example docs from /home/jenkins/jenkins-slave/workspace/Solr/Solr-Smoketest-9.3/_tmp/smoke_1691335159/unpack/solr-9.3.1-java11/example/exampledocs
SimplePostTool version 5.0.0
Posting files to [base] url http://localhost:8983/solr/techproducts/update using content-type application/xml...
POSTing file solr.xml to [base]
POSTing file sd500.xml to [base]
POSTing file hd.xml to [base]
POSTing file manufacturers.xml to [base]
POSTing file ipod_other.xml to [base]
POSTing file gb18030-example.xml to [base]
POSTing file mp500.xml to [base]
POSTing file vidcard.xml to [base]
POSTing file utf8-example.xml to [base]
POSTing file monitor2.xml to [base]
POSTing file money.xml to [base]
POSTing file monitor.xml to [base]
POSTing file ipod_video.xml to [base]
POSTing file mem.xml to [base]
14 files indexed.
COMMITting Solr index changes to http://localhost:8983/solr/techproducts/update...
Time spent: 0:00:00.401
      test utf8...
      run query...
      stop server using: bin/solr stop -p 8983
Sending stop command to Solr running on port 8983 ... waiting up to 180 seconds to allow Jetty process 1393725 to stop gracefully.
 [|]   [/]   [-]   [\]        unpack solr-9.3.1-slim.tgz...
  solr-9.3.1-slim.tgz
    Checking LICENSE.txt
    Checking NOTICE.txt
    Checking README.txt
    Checking CHANGES.txt
    Checking bin
    Checking docker
    Checking docs
    Checking example
    Checking licenses
    Checking server
    Checking lib
    verify JAR metadata/identity/no javax.* or java.* classes...
      **WARNING**: skipping check of /home/jenkins/jenkins-slave/workspace/Solr/Solr-Smoketest-9.3/_tmp/smoke_1691335159/unpack/solr-9.3.1-slim/server/solr-webapp/webapp/WEB-INF/lib/jakarta.inject-2.6.1.jar: it has javax.* classes
      **WARNING**: skipping check of /home/jenkins/jenkins-slave/workspace/Solr/Solr-Smoketest-9.3/_tmp/smoke_1691335159/unpack/solr-9.3.1-slim/server/solr-webapp/webapp/WEB-INF/lib/jakarta.activation-api-1.2.2.jar: it has javax.* classes
      **WARNING**: skipping check of /home/jenkins/jenkins-slave/workspace/Solr/Solr-Smoketest-9.3/_tmp/smoke_1691335159/unpack/solr-9.3.1-slim/server/solr-webapp/webapp/WEB-INF/lib/jakarta.validation-api-2.0.2.jar: it has javax.* classes
      **WARNING**: skipping check of /home/jenkins/jenkins-slave/workspace/Solr/Solr-Smoketest-9.3/_tmp/smoke_1691335159/unpack/solr-9.3.1-slim/server/solr-webapp/webapp/WEB-INF/lib/jakarta.annotation-api-1.3.5.jar: it has javax.* classes
      **WARNING**: skipping check of /home/jenkins/jenkins-slave/workspace/Solr/Solr-Smoketest-9.3/_tmp/smoke_1691335159/unpack/solr-9.3.1-slim/server/solr-webapp/webapp/WEB-INF/lib/jakarta.ws.rs-api-2.1.6.jar: it has javax.* classes
      **WARNING**: skipping check of /home/jenkins/jenkins-slave/workspace/Solr/Solr-Smoketest-9.3/_tmp/smoke_1691335159/unpack/solr-9.3.1-slim/server/solr-webapp/webapp/WEB-INF/lib/jakarta.xml.bind-api-2.3.3.jar: it has javax.* classes
      **WARNING**: skipping check of /home/jenkins/jenkins-slave/workspace/Solr/Solr-Smoketest-9.3/_tmp/smoke_1691335159/unpack/solr-9.3.1-slim/server/lib/ext/jetty-servlet-api-4.0.6.jar: it has javax.* classes
    copying unpacked distribution for Java 11 ...
    test solr example w/ Java 11...
      start Solr instance (log=/home/jenkins/jenkins-slave/workspace/Solr/Solr-Smoketest-9.3/_tmp/smoke_1691335159/unpack/solr-9.3.1-slim-java11/solr-example.log)...
No process found for Solr node running on port 8983
      Running techproducts example on port 8983 from /home/jenkins/jenkins-slave/workspace/Solr/Solr-Smoketest-9.3/_tmp/smoke_1691335159/unpack/solr-9.3.1-slim-java11
*** [WARN] *** Your open file limit is currently 60000.  
 It should be set to 65000 to avoid operational disruption. 
 If you no longer wish to see this warning, set SOLR_ULIMIT_CHECKS to false in your profile or solr.in.sh
*** [WARN] ***  Your Max Processes Limit is currently 30000. 
 It should be set to 65000 to avoid operational disruption. 
 If you no longer wish to see this warning, set SOLR_ULIMIT_CHECKS to false in your profile or solr.in.sh
Creating Solr home directory /home/jenkins/jenkins-slave/workspace/Solr/Solr-Smoketest-9.3/_tmp/smoke_1691335159/unpack/solr-9.3.1-slim-java11/example/techproducts/solr

Starting up Solr on port 8983 using command:
"bin/solr" start -p 8983 -s "example/techproducts/solr"

*** [WARN] *** Your open file limit is currently 60000.  
 It should be set to 65000 to avoid operational disruption. 
 If you no longer wish to see this warning, set SOLR_ULIMIT_CHECKS to false in your profile or solr.in.sh
*** [WARN] ***  Your Max Processes Limit is currently 30000. 
 It should be set to 65000 to avoid operational disruption. 
 If you no longer wish to see this warning, set SOLR_ULIMIT_CHECKS to false in your profile or solr.in.sh
Warning: Available entropy is low. As a result, use of the UUIDField, SSL, or any other features that require
RNG might not work properly. To check for the amount of available entropy, use 'cat /proc/sys/kernel/random/entropy_avail'.

Waiting up to 180 seconds to see Solr running on port 8983 [|]   [/]   [-]   [\]   [|]  
Started Solr server on port 8983 (pid=1394183). Happy searching!

    
Created new core 'techproducts'
Indexing tech product example docs from /home/jenkins/jenkins-slave/workspace/Solr/Solr-Smoketest-9.3/_tmp/smoke_1691335159/unpack/solr-9.3.1-slim-java11/example/exampledocs
SimplePostTool version 5.0.0
Posting files to [base] url http://localhost:8983/solr/techproducts/update using content-type application/xml...
POSTing file solr.xml to [base]
POSTing file sd500.xml to [base]
POSTing file hd.xml to [base]
POSTing file manufacturers.xml to [base]
POSTing file ipod_other.xml to [base]
POSTing file gb18030-example.xml to [base]
POSTing file mp500.xml to [base]
POSTing file vidcard.xml to [base]
POSTing file utf8-example.xml to [base]
POSTing file monitor2.xml to [base]
POSTing file money.xml to [base]
POSTing file monitor.xml to [base]
POSTing file ipod_video.xml to [base]
POSTing file mem.xml to [base]
14 files indexed.
COMMITting Solr index changes to http://localhost:8983/solr/techproducts/update...
Time spent: 0:00:00.771
      test utf8...
      run query...
      stop server using: bin/solr stop -p 8983
Sending stop command to Solr running on port 8983 ... waiting up to 180 seconds to allow Jetty process 1394183 to stop gracefully.
 [|]   [/]   [-]   [\]   [|]        unpack solr-9.3.1-src.tgz...
  solr-9.3.1-src.tgz
    Checking LICENSE.txt
    Checking NOTICE.txt
    Checking README.md
    Checking CONTRIBUTING.md
    Checking CHANGES.txt
    Checking README.adoc
    Checking buildSrc
    Checking dev-docs
    Checking dev-tools
    Checking gradle
    Checking help
    Checking solr
    Checking build.gradle
    Checking gradlew
    Checking gradlew.bat
    Checking settings.gradle
    Checking versions.lock
    Checking versions.props
    Checking benchmark
    Checking bin
    Checking modules
    Checking core
    Checking docker
    Checking documentation
    Checking example
    Checking licenses
    Checking packaging
    Checking distribution
    Checking prometheus-exporter
    Checking server
    Checking solr-ref-guide
    Checking solrj
    Checking solrj-streaming
    Checking solrj-zookeeper
    Checking test-framework
    Checking webapp
    Checking .gitignore
    Checking .gitattributes
    Checking build.gradle
    make sure no JARs/WARs in src dist...
    run "./gradlew --no-daemon check -p solr/documentation"
    run tests w/ Java 11 and testArgs='-Dtests.nightly=false -Dtests.badapples=false '...

command "export JAVA_HOME="/home/jenkins/tools/java/latest11" PATH="/home/jenkins/tools/java/latest11/bin:$PATH" JAVACMD="/home/jenkins/tools/java/latest11/bin/java"; ./gradlew --no-daemon test -Dtests.nightly=false -Dtests.badapples=false " failed:
To honour the JVM settings for this build a single-use Daemon process will be forked. See https://docs.gradle.org/7.6/userguide/gradle_daemon.html#sec:disabling_the_daemon.
Daemon will be stopped at the end of the build 
Gradle Enterprise plugins resolution: https://plugins.gradle.org/m2
Applying com.gradle.enterprise.gradleplugin.GradleEnterprisePlugin via init script
Connection to Gradle Enterprise: https://ge.apache.org, allowUntrustedServer: false
Enforcing Gradle Enterprise: https://ge.apache.org, allowUntrustedServer: false
Applying com.gradle.CommonCustomUserDataGradlePlugin via init script
> Task :buildSrc:compileJava UP-TO-DATE
> Task :buildSrc:compileGroovy NO-SOURCE
> Task :buildSrc:processResources NO-SOURCE
> Task :buildSrc:classes UP-TO-DATE
> Task :buildSrc:jar UP-TO-DATE
> Task :buildSrc:assemble UP-TO-DATE
> Task :buildSrc:compileTestJava NO-SOURCE
> Task :buildSrc:compileTestGroovy NO-SOURCE
> Task :buildSrc:processTestResources NO-SOURCE
> Task :buildSrc:testClasses UP-TO-DATE
> Task :buildSrc:test NO-SOURCE
> Task :buildSrc:check UP-TO-DATE
> Task :buildSrc:build UP-TO-DATE

> Task :randomizationInfo
Running tests with randomization seed: tests.seed=721ECF030168CACB

> Task :checkJdkInternalsExportedToGradle
> Task :solr:benchmark:processResources
> Task :solr:benchmark:processTestResources
> Task :solr:solrj:compileJava UP-TO-DATE
> Task :solr:solrj-streaming:compileJava UP-TO-DATE
> Task :solr:solrj-zookeeper:compileJava UP-TO-DATE
> Task :gitStatus
> Task :solr:solrj:processResources NO-SOURCE
> Task :solr:solrj:classes UP-TO-DATE
> Task :solr:solrj:jar UP-TO-DATE
> Task :solr:solrj-streaming:processResources UP-TO-DATE
> Task :solr:solrj-streaming:classes UP-TO-DATE
> Task :solr:solrj-streaming:jar UP-TO-DATE
> Task :solr:solrj-zookeeper:processResources NO-SOURCE
> Task :solr:solrj-zookeeper:classes UP-TO-DATE
> Task :solr:solrj-zookeeper:jar UP-TO-DATE
> Task :solr:core:compileJava UP-TO-DATE
> Task :solr:test-framework:processResources
> Task :solr:core:processResources UP-TO-DATE
> Task :solr:core:classes UP-TO-DATE
> Task :solr:core:jar UP-TO-DATE
> Task :solr:test-framework:compileJava UP-TO-DATE
> Task :solr:core:processTestResources
> Task :solr:test-framework:classes
> Task :solr:test-framework:jar
> Task :solr:benchmark:compileJava
> Task :solr:benchmark:classes
> Task :solr:benchmark:compileTestJava
> Task :solr:benchmark:testClasses
> Task :solr:core:compileTestJava
> Task :solr:benchmark:test

> Task :solr:core:compileTestJava
Note: Some input files use or override a deprecated API.
Note: Recompile with -Xlint:deprecation for details.

> Task :solr:core:testClasses

> Task :solr:modules:analysis-extras:compileJava
Note: /home/jenkins/jenkins-slave/workspace/Solr/Solr-Smoketest-9.3/_tmp/smoke_1691335159/unpack/solr-9.3.1/solr/modules/analysis-extras/src/java/org/apache/solr/schema/ICUCollationField.java uses or overrides a deprecated API.
Note: Recompile with -Xlint:deprecation for details.

> Task :solr:modules:analysis-extras:processResources NO-SOURCE
> Task :solr:modules:analysis-extras:classes
> Task :solr:modules:analysis-extras:jar
> Task :solr:core:test
WARNING: Test org.apache.solr.TestRandomFaceting wrote 11,491,559 bytes of output.

org.apache.solr.cloud.OverseerTest > testShardLeaderChange FAILED
    com.carrotsearch.randomizedtesting.UncaughtExceptionError: Captured an uncaught exception in thread: Thread[id=11468, name=OverseerCollectionConfigSetProcessor-72127657474392092-127.0.0.1:38659_solr-n_0000000000, state=RUNNABLE, group=Overseer collection creation process.]
        at __randomizedtesting.SeedInfo.seed([721ECF030168CACB:AC4D48F41BF03F3A]:0)

        Caused by:
        org.apache.solr.common.AlreadyClosedException
            at __randomizedtesting.SeedInfo.seed([721ECF030168CACB]:0)
            at app//org.apache.solr.common.cloud.ZkCmdExecutor.retryOperation(ZkCmdExecutor.java:70)
            at app//org.apache.solr.common.cloud.SolrZkClient.getData(SolrZkClient.java:437)
            at app//org.apache.solr.cloud.OverseerTaskProcessor.amILeader(OverseerTaskProcessor.java:486)
            at app//org.apache.solr.cloud.OverseerTaskProcessor.run(OverseerTaskProcessor.java:171)
            at java.base@11.0.16.1/java.lang.Thread.run(Thread.java:829)

org.apache.solr.cloud.OverseerTest > test suite's output saved to /home/jenkins/jenkins-slave/workspace/Solr/Solr-Smoketest-9.3/_tmp/smoke_1691335159/unpack/solr-9.3.1/solr/core/build/test-results/test/outputs/OUTPUT-org.apache.solr.cloud.OverseerTest.txt, copied below:
  2> 439678 INFO  (SUITE-OverseerTest-seed#[721ECF030168CACB]-worker) [] o.a.s.SolrTestCase Setting 'solr.default.confdir' system property to test-framework derived value of '/home/jenkins/jenkins-slave/workspace/Solr/Solr-Smoketest-9.3/_tmp/smoke_1691335159/unpack/solr-9.3.1/solr/server/solr/configsets/_default/conf'
  2> 439679 INFO  (SUITE-OverseerTest-seed#[721ECF030168CACB]-worker) [] o.a.s.u.ErrorLogMuter Closing ErrorLogMuter-regex-131 after mutting 0 log messages
  2> 439679 INFO  (SUITE-OverseerTest-seed#[721ECF030168CACB]-worker) [] o.a.s.u.ErrorLogMuter Creating ErrorLogMuter-regex-132 for ERROR logs matching regex: ignore_exception
  2> 439679 INFO  (SUITE-OverseerTest-seed#[721ECF030168CACB]-worker) [] o.a.s.SolrTestCaseJ4 Created dataDir: /home/jenkins/jenkins-slave/workspace/Solr/Solr-Smoketest-9.3/_tmp/smoke_1691335159/unpack/solr-9.3.1/solr/core/build/tmp/tests-tmp/solr.cloud.OverseerTest_721ECF030168CACB-001/data-dir-50-001
  2> 439679 WARN  (SUITE-OverseerTest-seed#[721ECF030168CACB]-worker) [] o.a.s.SolrTestCaseJ4 startTrackingSearchers: numOpens=1 numCloses=1
  2> 439679 INFO  (SUITE-OverseerTest-seed#[721ECF030168CACB]-worker) [] o.a.s.SolrTestCaseJ4 Using PointFields (NUMERIC_POINTS_SYSPROP=true) w/NUMERIC_DOCVALUES_SYSPROP=true
  2> 439680 INFO  (SUITE-OverseerTest-seed#[721ECF030168CACB]-worker) [] o.a.s.SolrTestCaseJ4 Randomized ssl (false) and clientAuth (false) via: @org.apache.solr.SolrTestCaseJ4$SuppressSSL(bugUrl="None")
  2> 439680 INFO  (SUITE-OverseerTest-seed#[721ECF030168CACB]-worker) [] o.a.s.SolrTestCaseJ4 SecureRandom sanity checks: test.solr.allowed.securerandom=null & java.security.egd=file:/dev/./urandom
  2> 439680 INFO  (SUITE-OverseerTest-seed#[721ECF030168CACB]-worker) [] o.a.s.c.ZkTestServer STARTING ZK TEST SERVER
  2> 439680 INFO  (ZkTestServer Run Thread) [] o.a.s.c.ZkTestServer client port: 0.0.0.0/0.0.0.0:0
  2> 439680 INFO  (ZkTestServer Run Thread) [] o.a.s.c.ZkTestServer Starting server
  2> 439681 WARN  (ZkTestServer Run Thread) [] o.a.z.s.ServerCnxnFactory maxCnxns is not configured, using default value 0.
  2> 439780 INFO  (SUITE-OverseerTest-seed#[721ECF030168CACB]-worker) [] o.a.s.c.ZkTestServer start zk server on port: 38659
  2> 439781 WARN  (SUITE-OverseerTest-seed#[721ECF030168CACB]-worker) [] o.a.s.c.c.SolrZkClient Using default ZkCredentialsInjector. ZkCredentialsInjector is not secure, it creates an empty list of credentials which leads to 'OPEN_ACL_UNSAFE' ACLs to Zookeeper nodes
  2> 439782 INFO  (SUITE-OverseerTest-seed#[721ECF030168CACB]-worker) [] o.a.s.c.c.ConnectionManager Waiting up to 30000ms for client to connect to ZooKeeper
  2> 439783 INFO  (zkConnectionManagerCallback-6363-thread-1) [] o.a.s.c.c.ConnectionManager zkClient has connected
  2> 439783 INFO  (SUITE-OverseerTest-seed#[721ECF030168CACB]-worker) [] o.a.s.c.c.ConnectionManager Client is connected to ZooKeeper
  2> 439783 WARN  (SUITE-OverseerTest-seed#[721ECF030168CACB]-worker) [] o.a.s.c.c.SolrZkClient Using default ZkACLProvider. DefaultZkACLProvider is not secure, it creates 'OPEN_ACL_UNSAFE' ACLs to Zookeeper nodes
  2> 439784 WARN  (SUITE-OverseerTest-seed#[721ECF030168CACB]-worker) [] o.a.s.c.c.SolrZkClient Using default ZkCredentialsInjector. ZkCredentialsInjector is not secure, it creates an empty list of credentials which leads to 'OPEN_ACL_UNSAFE' ACLs to Zookeeper nodes
  2> 439785 INFO  (SUITE-OverseerTest-seed#[721ECF030168CACB]-worker) [] o.a.s.c.c.ConnectionManager Waiting up to 30000ms for client to connect to ZooKeeper
  2> 439786 INFO  (zkConnectionManagerCallback-6365-thread-1) [] o.a.s.c.c.ConnectionManager zkClient has connected
  2> 439786 INFO  (SUITE-OverseerTest-seed#[721ECF030168CACB]-worker) [] o.a.s.c.c.ConnectionManager Client is connected to ZooKeeper
  2> 439786 WARN  (SUITE-OverseerTest-seed#[721ECF030168CACB]-worker) [] o.a.s.c.c.SolrZkClient Using default ZkACLProvider. DefaultZkACLProvider is not secure, it creates 'OPEN_ACL_UNSAFE' ACLs to Zookeeper nodes
  2> 439786 INFO  (SUITE-OverseerTest-seed#[721ECF030168CACB]-worker) [] o.a.s.SolrTestCaseJ4 ####initCore
  2> 439786 INFO  (SUITE-OverseerTest-seed#[721ECF030168CACB]-worker) [] o.a.s.SolrTestCaseJ4 ####initCore end
  2> 439790 INFO  (TEST-OverseerTest.testLatchWatcher-seed#[721ECF030168CACB]) [] o.a.s.SolrTestCaseJ4 ###Starting testLatchWatcher
  2> 439892 INFO  (TEST-OverseerTest.testLatchWatcher-seed#[721ECF030168CACB]) [] o.a.s.SolrTestCaseJ4 ###Ending testLatchWatcher
  2> 439897 INFO  (TEST-OverseerTest.testDownNodeFailover-seed#[721ECF030168CACB]) [] o.a.s.SolrTestCaseJ4 ###Starting testDownNodeFailover
  2> 439910 WARN  (TEST-OverseerTest.testDownNodeFailover-seed#[721ECF030168CACB]) [] o.a.s.c.ZkController Contents of zookeeper /security.json are world-readable; consider setting up ACLs as described in https://solr.apache.org/guide/solr/latest/deployment-guide/zookeeper-access-control.html
  2> 439910 WARN  (TEST-OverseerTest.testDownNodeFailover-seed#[721ECF030168CACB]) [] o.a.s.c.c.SolrZkClient Using default ZkCredentialsInjector. ZkCredentialsInjector is not secure, it creates an empty list of credentials which leads to 'OPEN_ACL_UNSAFE' ACLs to Zookeeper nodes
  2> 439911 INFO  (TEST-OverseerTest.testDownNodeFailover-seed#[721ECF030168CACB]) [] o.a.s.c.c.ConnectionManager Waiting up to 30000ms for client to connect to ZooKeeper
  2> 439912 INFO  (zkConnectionManagerCallback-6369-thread-1) [] o.a.s.c.c.ConnectionManager zkClient has connected
  2> 439912 INFO  (TEST-OverseerTest.testDownNodeFailover-seed#[721ECF030168CACB]) [] o.a.s.c.c.ConnectionManager Client is connected to ZooKeeper
  2> 439912 WARN  (TEST-OverseerTest.testDownNodeFailover-seed#[721ECF030168CACB]) [] o.a.s.c.c.SolrZkClient Using default ZkACLProvider. DefaultZkACLProvider is not secure, it creates 'OPEN_ACL_UNSAFE' ACLs to Zookeeper nodes
  2> 439916 WARN  (TEST-OverseerTest.testDownNodeFailover-seed#[721ECF030168CACB]) [] o.a.s.c.c.SolrZkClient Using default ZkCredentialsInjector. ZkCredentialsInjector is not secure, it creates an empty list of credentials which leads to 'OPEN_ACL_UNSAFE' ACLs to Zookeeper nodes
  2> 439916 INFO  (TEST-OverseerTest.testDownNodeFailover-seed#[721ECF030168CACB]) [] o.a.s.c.c.ConnectionManager Waiting up to 30000ms for client to connect to ZooKeeper
  2> 439917 INFO  (zkConnectionManagerCallback-6377-thread-1) [] o.a.s.c.c.ConnectionManager zkClient has connected
  2> 439917 INFO  (TEST-OverseerTest.testDownNodeFailover-seed#[721ECF030168CACB]) [] o.a.s.c.c.ConnectionManager Client is connected to ZooKeeper
  2> 439917 WARN  (TEST-OverseerTest.testDownNodeFailover-seed#[721ECF030168CACB]) [] o.a.s.c.c.SolrZkClient Using default ZkACLProvider. DefaultZkACLProvider is not secure, it creates 'OPEN_ACL_UNSAFE' ACLs to Zookeeper nodes
  2> 439955 WARN  (TEST-OverseerTest.testDownNodeFailover-seed#[721ECF030168CACB]) [] o.a.s.c.c.SolrZkClient Using default ZkCredentialsInjector. ZkCredentialsInjector is not secure, it creates an empty list of credentials which leads to 'OPEN_ACL_UNSAFE' ACLs to Zookeeper nodes
  2> 439956 INFO  (TEST-OverseerTest.testDownNodeFailover-seed#[721ECF030168CACB]) [] o.a.s.c.c.ConnectionManager Waiting up to 15000ms for client to connect to ZooKeeper
  2> 439957 INFO  (zkConnectionManagerCallback-6382-thread-1) [] o.a.s.c.c.ConnectionManager zkClient has connected
  2> 439957 INFO  (TEST-OverseerTest.testDownNodeFailover-seed#[721ECF030168CACB]) [] o.a.s.c.c.ConnectionManager Client is connected to ZooKeeper
  2> 439957 WARN  (TEST-OverseerTest.testDownNodeFailover-seed#[721ECF030168CACB]) [] o.a.s.c.c.SolrZkClient Using default ZkACLProvider. DefaultZkACLProvider is not secure, it creates 'OPEN_ACL_UNSAFE' ACLs to Zookeeper nodes
  2> 439958 INFO  (TEST-OverseerTest.testDownNodeFailover-seed#[721ECF030168CACB]) [] o.a.s.c.s.i.ZkClientClusterStateProvider Cluster at 127.0.0.1:38659/solr ready
  2> 439959 INFO  (TEST-OverseerTest.testDownNodeFailover-seed#[721ECF030168CACB]) [] o.a.s.c.DistributedClusterStateUpdater Creating DistributedClusterStateUpdater with useDistributedStateUpdate=false. Solr will be using Overseer based cluster state updates.
  2> 439961 INFO  (TEST-OverseerTest.testDownNodeFailover-seed#[721ECF030168CACB]) [] o.a.s.c.OverseerElectionContext I am going to be the leader 127.0.0.1:38659_solr
  2> 439962 INFO  (TEST-OverseerTest.testDownNodeFailover-seed#[721ECF030168CACB]) [] o.a.s.c.Overseer Overseer (id=72127657474392066-127.0.0.1:38659_solr-n_0000000000) starting
  2> 439968 WARN  (TEST-OverseerTest.testDownNodeFailover-seed#[721ECF030168CACB]) [] o.a.s.c.Overseer Unable to check back-compat of .system collection - can't obtain ClusterState.
  2> 439969 INFO  (OverseerStateUpdate-72127657474392066-127.0.0.1:38659_solr-n_0000000000) [] o.a.s.c.Overseer Starting to work on the main queue : 127.0.0.1:38659_solr
  2> 439971 WARN  (TEST-OverseerTest.testDownNodeFailover-seed#[721ECF030168CACB]) [] o.a.s.c.c.SolrZkClient Using default ZkCredentialsInjector. ZkCredentialsInjector is not secure, it creates an empty list of credentials which leads to 'OPEN_ACL_UNSAFE' ACLs to Zookeeper nodes
  2> 439972 INFO  (TEST-OverseerTest.testDownNodeFailover-seed#[721ECF030168CACB]) [] o.a.s.c.c.ConnectionManager Waiting up to 30000ms for client to connect to ZooKeeper
  2> 439972 INFO  (zkConnectionManagerCallback-6388-thread-1) [] o.a.s.c.c.ConnectionManager zkClient has connected
  2> 439972 INFO  (TEST-OverseerTest.testDownNodeFailover-seed#[721ECF030168CACB]) [] o.a.s.c.c.ConnectionManager Client is connected to ZooKeeper
  2> 439972 WARN  (TEST-OverseerTest.testDownNodeFailover-seed#[721ECF030168CACB]) [] o.a.s.c.c.SolrZkClient Using default ZkACLProvider. DefaultZkACLProvider is not secure, it creates 'OPEN_ACL_UNSAFE' ACLs to Zookeeper nodes
  2> 439976 WARN  (TEST-OverseerTest.testDownNodeFailover-seed#[721ECF030168CACB]) [] o.a.s.c.ZkController Contents of zookeeper /security.json are world-readable; consider setting up ACLs as described in https://solr.apache.org/guide/solr/latest/deployment-guide/zookeeper-access-control.html
  2> 439981 INFO  (zkCallback-6368-thread-1) [] o.a.s.c.c.ZkStateReader Updated live nodes from ZooKeeper... (0) -> (1)
  2> 439981 INFO  (zkCallback-6381-thread-1) [] o.a.s.c.c.ZkStateReader Updated live nodes from ZooKeeper... (0) -> (1)
  2> 439981 INFO  (zkCallback-6364-thread-1) [] o.a.s.c.c.ZkStateReader Updated live nodes from ZooKeeper... (0) -> (1)
  2> 439981 WARN  (TEST-OverseerTest.testDownNodeFailover-seed#[721ECF030168CACB]) [] o.a.s.c.c.SolrZkClient Using default ZkCredentialsInjector. ZkCredentialsInjector is not secure, it creates an empty list of credentials which leads to 'OPEN_ACL_UNSAFE' ACLs to Zookeeper nodes
  2> 439981 INFO  (zkCallback-6387-thread-1) [] o.a.s.c.c.ZkStateReader Updated live nodes from ZooKeeper... (0) -> (1)
  2> 439981 INFO  (TEST-OverseerTest.testDownNodeFailover-seed#[721ECF030168CACB]) [] o.a.s.c.c.ConnectionManager Waiting up to 15000ms for client to connect to ZooKeeper
  2> 439982 INFO  (zkConnectionManagerCallback-6395-thread-1) [] o.a.s.c.c.ConnectionManager zkClient has connected
  2> 439982 INFO  (TEST-OverseerTest.testDownNodeFailover-seed#[721ECF030168CACB]) [] o.a.s.c.c.ConnectionManager Client is connected to ZooKeeper
  2> 439982 WARN  (TEST-OverseerTest.testDownNodeFailover-seed#[721ECF030168CACB]) [] o.a.s.c.c.SolrZkClient Using default ZkACLProvider. DefaultZkACLProvider is not secure, it creates 'OPEN_ACL_UNSAFE' ACLs to Zookeeper nodes
  2> 439983 INFO  (TEST-OverseerTest.testDownNodeFailover-seed#[721ECF030168CACB]) [] o.a.s.c.c.ZkStateReader Updated live nodes from ZooKeeper... (0) -> (1)
  2> 439984 INFO  (TEST-OverseerTest.testDownNodeFailover-seed#[721ECF030168CACB]) [] o.a.s.c.s.i.ZkClientClusterStateProvider Cluster at 127.0.0.1:38659/solr ready
  2> 440089 INFO  (zkCallback-6387-thread-1) [] o.a.s.c.c.ZkStateReader A cluster state change: [WatchedEvent state:SyncConnected type:NodeDataChanged path:/collections/collection0/state.json] for collection [collection0] has occurred - updating... (live nodes size: [1])
  2> 440094 INFO  (TEST-OverseerTest.testDownNodeFailover-seed#[721ECF030168CACB]) [] o.a.s.c.ShardLeaderElectionContextBase make sure parent is created /collections/collection0/leaders/shard1
  2> 440095 INFO  (TEST-OverseerTest.testDownNodeFailover-seed#[721ECF030168CACB]) [] o.a.s.c.ShardLeaderElectionContextBase Creating leader registration node /collections/collection0/leaders/shard1/leader after winning as /collections/collection0/leader_elect/shard1/election/72127657474392069-127.0.0.1:8983_solrcore1-n_0000000000
  2> 440100 INFO  (TEST-OverseerTest.testDownNodeFailover-seed#[721ECF030168CACB]) [] o.a.s.c.c.ZkStateReader /collections/collection1/state.json is deleted, stop watching children
  2> 440202 INFO  (zkCallback-6387-thread-1) [] o.a.s.c.c.ZkStateReader A cluster state change: [WatchedEvent state:SyncConnected type:NodeCreated path:/collections/collection1/state.json] for collection [collection1] has occurred - updating... (live nodes size: [1])
  2> 440205 INFO  (TEST-OverseerTest.testDownNodeFailover-seed#[721ECF030168CACB]) [] o.a.s.c.ShardLeaderElectionContextBase make sure parent is created /collections/collection1/leaders/shard1
  2> 440207 INFO  (TEST-OverseerTest.testDownNodeFailover-seed#[721ECF030168CACB]) [] o.a.s.c.ShardLeaderElectionContextBase Creating leader registration node /collections/collection1/leaders/shard1/leader after winning as /collections/collection1/leader_elect/shard1/election/72127657474392069-127.0.0.1:8983_solrcore1-n_0000000000
  2> 440213 INFO  (TEST-OverseerTest.testDownNodeFailover-seed#[721ECF030168CACB]) [] o.a.s.c.c.ZkStateReader /collections/collection2/state.json is deleted, stop watching children
  2> 440315 INFO  (zkCallback-6387-thread-1) [] o.a.s.c.c.ZkStateReader A cluster state change: [WatchedEvent state:SyncConnected type:NodeCreated path:/collections/collection2/state.json] for collection [collection2] has occurred - updating... (live nodes size: [1])
  2> 440318 INFO  (TEST-OverseerTest.testDownNodeFailover-seed#[721ECF030168CACB]) [] o.a.s.c.ShardLeaderElectionContextBase make sure parent is created /collections/collection2/leaders/shard1
  2> 440320 INFO  (TEST-OverseerTest.testDownNodeFailover-seed#[721ECF030168CACB]) [] o.a.s.c.ShardLeaderElectionContextBase Creating leader registration node /collections/collection2/leaders/shard1/leader after winning as /collections/collection2/leader_elect/shard1/election/72127657474392069-127.0.0.1:8983_solrcore1-n_0000000000
  2> 440325 INFO  (TEST-OverseerTest.testDownNodeFailover-seed#[721ECF030168CACB]) [] o.a.s.c.c.ZkStateReader /collections/collection3/state.json is deleted, stop watching children
  2> 440427 INFO  (zkCallback-6387-thread-1) [] o.a.s.c.c.ZkStateReader A cluster state change: [WatchedEvent state:SyncConnected type:NodeCreated path:/collections/collection3/state.json] for collection [collection3] has occurred - updating... (live nodes size: [1])
  2> 440430 INFO  (TEST-OverseerTest.testDownNodeFailover-seed#[721ECF030168CACB]) [] o.a.s.c.ShardLeaderElectionContextBase make sure parent is created /collections/collection3/leaders/shard1
  2> 440432 INFO  (TEST-OverseerTest.testDownNodeFailover-seed#[721ECF030168CACB]) [] o.a.s.c.ShardLeaderElectionContextBase Creating leader registration node /collections/collection3/leaders/shard1/leader after winning as /collections/collection3/leader_elect/shard1/election/72127657474392069-127.0.0.1:8983_solrcore1-n_0000000000
  2> 440437 INFO  (TEST-OverseerTest.testDownNodeFailover-seed#[721ECF030168CACB]) [] o.a.s.c.c.ZkStateReader /collections/collection4/state.json is deleted, stop watching children
  2> 440539 INFO  (zkCallback-6387-thread-1) [] o.a.s.c.c.ZkStateReader A cluster state change: [WatchedEvent state:SyncConnected type:NodeCreated path:/collections/collection4/state.json] for collection [collection4] has occurred - updating... (live nodes size: [1])
  2> 440543 INFO  (TEST-OverseerTest.testDownNodeFailover-seed#[721ECF030168CACB]) [] o.a.s.c.ShardLeaderElectionContextBase make sure parent is created /collections/collection4/leaders/shard1
  2> 440544 INFO  (TEST-OverseerTest.testDownNodeFailover-seed#[721ECF030168CACB]) [] o.a.s.c.ShardLeaderElectionContextBase Creating leader registration node /collections/collection4/leaders/shard1/leader after winning as /collections/collection4/leader_elect/shard1/election/72127657474392069-127.0.0.1:8983_solrcore1-n_0000000000
  2> 440550 INFO  (TEST-OverseerTest.testDownNodeFailover-seed#[721ECF030168CACB]) [] o.a.s.c.AbstractDistribZkTestBase verifyReplicaStatus (collection0) shard=shard1 coreNodeName=core_node1
  2> 440651 INFO  (zkCallback-6364-thread-1) [] o.a.s.c.c.ZkStateReader A cluster state change: [WatchedEvent state:SyncConnected type:NodeDataChanged path:/collections/collection0/state.json] for collection [collection0] has occurred - updating... (live nodes size: [1])
  2> 440754 WARN  (TEST-OverseerTest.testDownNodeFailover-seed#[721ECF030168CACB]) [] o.a.s.c.c.SolrZkClient Using default ZkCredentialsInjector. ZkCredentialsInjector is not secure, it creates an empty list of credentials which leads to 'OPEN_ACL_UNSAFE' ACLs to Zookeeper nodes
  2> 440754 INFO  (TEST-OverseerTest.testDownNodeFailover-seed#[721ECF030168CACB]) [] o.a.s.c.c.ConnectionManager Waiting up to 30000ms for client to connect to ZooKeeper
  2> 440755 INFO  (zkConnectionManagerCallback-6397-thread-1) [] o.a.s.c.c.ConnectionManager zkClient has connected
  2> 440755 INFO  (TEST-OverseerTest.testDownNodeFailover-seed#[721ECF030168CACB]) [] o.a.s.c.c.ConnectionManager Client is connected to ZooKeeper
  2> 440755 WARN  (TEST-OverseerTest.testDownNodeFailover-seed#[721ECF030168CACB]) [] o.a.s.c.c.SolrZkClient Using default ZkACLProvider. DefaultZkACLProvider is not secure, it creates 'OPEN_ACL_UNSAFE' ACLs to Zookeeper nodes
  2> 440755 INFO  (TEST-OverseerTest.testDownNodeFailover-seed#[721ECF030168CACB]) [] o.a.s.c.Overseer Overseer (id=72127657474392066-127.0.0.1:38659_solr-n_0000000000) closing
  2> 440756 INFO  (OverseerStateUpdate-72127657474392066-127.0.0.1:38659_solr-n_0000000000) [] o.a.s.c.Overseer Overseer Loop exiting : 127.0.0.1:38659_solr
  2> 440756 WARN  (OverseerExitThread) [] o.a.s.c.Overseer Error communicating with ZooKeeper
  2>           => org.apache.zookeeper.KeeperException$SessionExpiredException: KeeperErrorCode = Session expired for /overseer_elect/leader
  2> 	at org.apache.zookeeper.KeeperException.create(KeeperException.java:134)
  2> org.apache.zookeeper.KeeperException$SessionExpiredException: KeeperErrorCode = Session expired for /overseer_elect/leader
  2> 	at org.apache.zookeeper.KeeperException.create(KeeperException.java:134) ~[zookeeper-3.8.1.jar:3.8.1]
  2> 	at org.apache.zookeeper.KeeperException.create(KeeperException.java:54) ~[zookeeper-3.8.1.jar:3.8.1]
  2> 	at org.apache.zookeeper.ZooKeeper.getData(ZooKeeper.java:1972) ~[zookeeper-3.8.1.jar:3.8.1]
  2> 	at org.apache.solr.common.cloud.SolrZkClient.lambda$getData$6(SolrZkClient.java:437) ~[solr-solrj-zookeeper-9.3.1-SNAPSHOT.jar:9.3.1-SNAPSHOT (not a git checkout) [snapshot build, details omitted]]
  2> 	at org.apache.solr.common.cloud.ZkCmdExecutor.retryOperation(ZkCmdExecutor.java:72) ~[solr-solrj-zookeeper-9.3.1-SNAPSHOT.jar:9.3.1-SNAPSHOT (not a git checkout) [snapshot build, details omitted]]
  2> 	at org.apache.solr.common.cloud.SolrZkClient.getData(SolrZkClient.java:437) ~[solr-solrj-zookeeper-9.3.1-SNAPSHOT.jar:9.3.1-SNAPSHOT (not a git checkout) [snapshot build, details omitted]]
  2> 	at org.apache.solr.cloud.Overseer$ClusterStateUpdater.checkIfIamStillLeader(Overseer.java:482) [main/:9.3.1-SNAPSHOT (not a git checkout) [snapshot build, details omitted]]
  2> 	at java.lang.Thread.run(Thread.java:829) [?:?]
  2> 440760 WARN  (TEST-OverseerTest.testDownNodeFailover-seed#[721ECF030168CACB]) [] o.a.s.c.c.SolrZkClient Using default ZkCredentialsInjector. ZkCredentialsInjector is not secure, it creates an empty list of credentials which leads to 'OPEN_ACL_UNSAFE' ACLs to Zookeeper nodes
  2> 440762 INFO  (TEST-OverseerTest.testDownNodeFailover-seed#[721ECF030168CACB]) [] o.a.s.c.c.ConnectionManager Waiting up to 30000ms for client to connect to ZooKeeper
  2> 440762 INFO  (zkConnectionManagerCallback-6405-thread-1) [] o.a.s.c.c.ConnectionManager zkClient has connected
  2> 440762 INFO  (TEST-OverseerTest.testDownNodeFailover-seed#[721ECF030168CACB]) [] o.a.s.c.c.ConnectionManager Client is connected to ZooKeeper
  2> 440762 WARN  (TEST-OverseerTest.testDownNodeFailover-seed#[721ECF030168CACB]) [] o.a.s.c.c.SolrZkClient Using default ZkACLProvider. DefaultZkACLProvider is not secure, it creates 'OPEN_ACL_UNSAFE' ACLs to Zookeeper nodes
  2> 440763 WARN  (TEST-OverseerTest.testDownNodeFailover-seed#[721ECF030168CACB]) [] o.a.s.c.c.SolrZkClient Using default ZkCredentialsInjector. ZkCredentialsInjector is not secure, it creates an empty list of credentials which leads to 'OPEN_ACL_UNSAFE' ACLs to Zookeeper nodes
  2> 440764 INFO  (TEST-OverseerTest.testDownNodeFailover-seed#[721ECF030168CACB]) [] o.a.s.c.c.ConnectionManager Waiting up to 15000ms for client to connect to ZooKeeper
  2> 440765 INFO  (zkConnectionManagerCallback-6410-thread-1) [] o.a.s.c.c.ConnectionManager zkClient has connected
  2> 440765 INFO  (TEST-OverseerTest.testDownNodeFailover-seed#[721ECF030168CACB]) [] o.a.s.c.c.ConnectionManager Client is connected to ZooKeeper
  2> 440765 WARN  (TEST-OverseerTest.testDownNodeFailover-seed#[721ECF030168CACB]) [] o.a.s.c.c.SolrZkClient Using default ZkACLProvider. DefaultZkACLProvider is not secure, it creates 'OPEN_ACL_UNSAFE' ACLs to Zookeeper nodes
  2> 440766 INFO  (TEST-OverseerTest.testDownNodeFailover-seed#[721ECF030168CACB]) [] o.a.s.c.c.ZkStateReader Updated live nodes from ZooKeeper... (0) -> (1)
  2> 440766 INFO  (TEST-OverseerTest.testDownNodeFailover-seed#[721ECF030168CACB]) [] o.a.s.c.s.i.ZkClientClusterStateProvider Cluster at 127.0.0.1:38659/solr ready
  2> 440767 INFO  (TEST-OverseerTest.testDownNodeFailover-seed#[721ECF030168CACB]) [] o.a.s.c.DistributedClusterStateUpdater Creating DistributedClusterStateUpdater with useDistributedStateUpdate=false. Solr will be using Overseer based cluster state updates.
  2> 440768 INFO  (TEST-OverseerTest.testDownNodeFailover-seed#[721ECF030168CACB]) [] o.a.s.c.OverseerElectionContext I am going to be the leader 127.0.0.1:38659_solr
  2> 440769 INFO  (TEST-OverseerTest.testDownNodeFailover-seed#[721ECF030168CACB]) [] o.a.s.c.Overseer Overseer (id=72127657474392071-127.0.0.1:38659_solr-n_0000000001) starting
  2> 440771 WARN  (TEST-OverseerTest.testDownNodeFailover-seed#[721ECF030168CACB]) [] o.a.s.c.Overseer Unable to check back-compat of .system collection - can't obtain ClusterState.
  2> 440771 INFO  (TEST-OverseerTest.testDownNodeFailover-seed#[721ECF030168CACB]) [] o.a.s.c.AbstractDistribZkTestBase verifyReplicaStatus (collection0) shard=shard1 coreNodeName=core_node1
  2> 440772 INFO  (OverseerStateUpdate-72127657474392071-127.0.0.1:38659_solr-n_0000000001) [] o.a.s.c.Overseer Starting to work on the main queue : 127.0.0.1:38659_solr
  2> 440773 INFO  (OverseerStateUpdate-72127657474392071-127.0.0.1:38659_solr-n_0000000001) [] o.a.s.c.c.ZkStateReader Updated live nodes from ZooKeeper... (0) -> (1)
  2> 440773 INFO  (TEST-OverseerTest.testDownNodeFailover-seed#[721ECF030168CACB]) [] o.a.s.c.AbstractDistribZkTestBase verifyReplicaStatus (collection1) shard=shard1 coreNodeName=core_node1
  2> 440778 INFO  (TEST-OverseerTest.testDownNodeFailover-seed#[721ECF030168CACB]) [] o.a.s.c.AbstractDistribZkTestBase verifyReplicaStatus (collection2) shard=shard1 coreNodeName=core_node1
  2> 440780 INFO  (TEST-OverseerTest.testDownNodeFailover-seed#[721ECF030168CACB]) [] o.a.s.c.AbstractDistribZkTestBase verifyReplicaStatus (collection3) shard=shard1 coreNodeName=core_node1
  2> 440885 INFO  (zkCallback-6364-thread-2) [] o.a.s.c.c.ZkStateReader A cluster state change: [WatchedEvent state:SyncConnected type:NodeDataChanged path:/collections/collection3/state.json] for collection [collection3] has occurred - updating... (live nodes size: [1])
  2> 440886 INFO  (TEST-OverseerTest.testDownNodeFailover-seed#[721ECF030168CACB]) [] o.a.s.c.AbstractDistribZkTestBase verifyReplicaStatus (collection4) shard=shard1 coreNodeName=core_node1
  2> 440890 INFO  (zkCallback-6387-thread-1) [] o.a.s.c.c.ZkStateReader Updated live nodes from ZooKeeper... (1) -> (0)
  2> 440890 INFO  (zkCallback-6381-thread-1) [] o.a.s.c.c.ZkStateReader Updated live nodes from ZooKeeper... (1) -> (0)
  2> 440890 INFO  (zkCallback-6394-thread-1) [] o.a.s.c.c.ZkStateReader Updated live nodes from ZooKeeper... (1) -> (0)
  2> 440890 INFO  (zkCallback-6364-thread-2) [] o.a.s.c.c.ZkStateReader Updated live nodes from ZooKeeper... (1) -> (0)
  2> 440890 INFO  (zkCallback-6396-thread-1) [] o.a.s.c.c.ZkStateReader Updated live nodes from ZooKeeper... (1) -> (0)
  2> 440890 INFO  (zkCallback-6409-thread-1) [] o.a.s.c.c.ZkStateReader Updated live nodes from ZooKeeper... (1) -> (0)
  2> 441199 INFO  (closeThreadPool-6414-thread-1) [] o.a.s.c.Overseer Overseer (id=72127657474392066-127.0.0.1:38659_solr-n_0000000000) closing
  2> 441199 INFO  (closeThreadPool-6414-thread-2) [] o.a.s.c.Overseer Overseer (id=72127657474392071-127.0.0.1:38659_solr-n_0000000001) closing
  2> 441200 INFO  (OverseerStateUpdate-72127657474392071-127.0.0.1:38659_solr-n_0000000001) [] o.a.s.c.Overseer Overseer Loop exiting : 127.0.0.1:38659_solr
  2> 441201 WARN  (OverseerExitThread) [] o.a.s.c.Overseer Error communicating with ZooKeeper
  2>           => org.apache.zookeeper.KeeperException$SessionExpiredException: KeeperErrorCode = Session expired for /overseer_elect/leader
  2> 	at org.apache.zookeeper.KeeperException.create(KeeperException.java:134)
  2> org.apache.zookeeper.KeeperException$SessionExpiredException: KeeperErrorCode = Session expired for /overseer_elect/leader
  2> 	at org.apache.zookeeper.KeeperException.create(KeeperException.java:134) ~[zookeeper-3.8.1.jar:3.8.1]
  2> 	at org.apache.zookeeper.KeeperException.create(KeeperException.java:54) ~[zookeeper-3.8.1.jar:3.8.1]
  2> 	at org.apache.zookeeper.ZooKeeper.getData(ZooKeeper.java:1972) ~[zookeeper-3.8.1.jar:3.8.1]
  2> 	at org.apache.solr.common.cloud.SolrZkClient.lambda$getData$6(SolrZkClient.java:437) ~[solr-solrj-zookeeper-9.3.1-SNAPSHOT.jar:9.3.1-SNAPSHOT (not a git checkout) [snapshot build, details omitted]]
  2> 	at org.apache.solr.common.cloud.ZkCmdExecutor.retryOperation(ZkCmdExecutor.java:72) ~[solr-solrj-zookeeper-9.3.1-SNAPSHOT.jar:9.3.1-SNAPSHOT (not a git checkout) [snapshot build, details omitted]]
  2> 	at org.apache.solr.common.cloud.SolrZkClient.getData(SolrZkClient.java:437) ~[solr-solrj-zookeeper-9.3.1-SNAPSHOT.jar:9.3.1-SNAPSHOT (not a git checkout) [snapshot build, details omitted]]
  2> 	at org.apache.solr.cloud.Overseer$ClusterStateUpdater.checkIfIamStillLeader(Overseer.java:482) [main/:9.3.1-SNAPSHOT (not a git checkout) [snapshot build, details omitted]]
  2> 	at java.lang.Thread.run(Thread.java:829) [?:?]
  2> 441227 INFO  (TEST-OverseerTest.testDownNodeFailover-seed#[721ECF030168CACB]) [] o.a.s.SolrTestCaseJ4 ###Ending testDownNodeFailover
  2> 441232 INFO  (TEST-OverseerTest.testExceptionWhenFlushClusterState-seed#[721ECF030168CACB]) [] o.a.s.SolrTestCaseJ4 ###Starting testExceptionWhenFlushClusterState
  2> 441244 WARN  (TEST-OverseerTest.testExceptionWhenFlushClusterState-seed#[721ECF030168CACB]) [] o.a.s.c.ZkController Contents of zookeeper /security.json are world-readable; consider setting up ACLs as described in https://solr.apache.org/guide/solr/latest/deployment-guide/zookeeper-access-control.html
  2> 441247 WARN  (TEST-OverseerTest.testExceptionWhenFlushClusterState-seed#[721ECF030168CACB]) [] o.a.s.c.c.SolrZkClient Using default ZkCredentialsInjector. ZkCredentialsInjector is not secure, it creates an empty list of credentials which leads to 'OPEN_ACL_UNSAFE' ACLs to Zookeeper nodes
  2> 441247 INFO  (TEST-OverseerTest.testExceptionWhenFlushClusterState-seed#[721ECF030168CACB]) [] o.a.s.c.c.ConnectionManager Waiting up to 30000ms for client to connect to ZooKeeper
  2> 441248 INFO  (zkConnectionManagerCallback-6418-thread-1) [] o.a.s.c.c.ConnectionManager zkClient has connected
  2> 441248 INFO  (TEST-OverseerTest.testExceptionWhenFlushClusterState-seed#[721ECF030168CACB]) [] o.a.s.c.c.ConnectionManager Client is connected to ZooKeeper
  2> 441248 WARN  (TEST-OverseerTest.testExceptionWhenFlushClusterState-seed#[721ECF030168CACB]) [] o.a.s.c.c.SolrZkClient Using default ZkACLProvider. DefaultZkACLProvider is not secure, it creates 'OPEN_ACL_UNSAFE' ACLs to Zookeeper nodes
  2> 441252 WARN  (TEST-OverseerTest.testExceptionWhenFlushClusterState-seed#[721ECF030168CACB]) [] o.a.s.c.c.SolrZkClient Using default ZkCredentialsInjector. ZkCredentialsInjector is not secure, it creates an empty list of credentials which leads to 'OPEN_ACL_UNSAFE' ACLs to Zookeeper nodes
  2> 441252 INFO  (TEST-OverseerTest.testExceptionWhenFlushClusterState-seed#[721ECF030168CACB]) [] o.a.s.c.c.ConnectionManager Waiting up to 30000ms for client to connect to ZooKeeper
  2> 441253 INFO  (zkConnectionManagerCallback-6426-thread-1) [] o.a.s.c.c.ConnectionManager zkClient has connected
  2> 441253 INFO  (TEST-OverseerTest.testExceptionWhenFlushClusterState-seed#[721ECF030168CACB]) [] o.a.s.c.c.ConnectionManager Client is connected to ZooKeeper
  2> 441253 WARN  (TEST-OverseerTest.testExceptionWhenFlushClusterState-seed#[721ECF030168CACB]) [] o.a.s.c.c.SolrZkClient Using default ZkACLProvider. DefaultZkACLProvider is not secure, it creates 'OPEN_ACL_UNSAFE' ACLs to Zookeeper nodes
  2> 441255 WARN  (TEST-OverseerTest.testExceptionWhenFlushClusterState-seed#[721ECF030168CACB]) [] o.a.s.c.c.SolrZkClient Using default ZkCredentialsInjector. ZkCredentialsInjector is not secure, it creates an empty list of credentials which leads to 'OPEN_ACL_UNSAFE' ACLs to Zookeeper nodes
  2> 441255 INFO  (TEST-OverseerTest.testExceptionWhenFlushClusterState-seed#[721ECF030168CACB]) [] o.a.s.c.c.ConnectionManager Waiting up to 15000ms for client to connect to ZooKeeper
  2> 441256 INFO  (zkConnectionManagerCallback-6431-thread-1) [] o.a.s.c.c.ConnectionManager zkClient has connected
  2> 441256 INFO  (TEST-OverseerTest.testExceptionWhenFlushClusterState-seed#[721ECF030168CACB]) [] o.a.s.c.c.ConnectionManager Client is connected to ZooKeeper
  2> 441256 WARN  (TEST-OverseerTest.testExceptionWhenFlushClusterState-seed#[721ECF030168CACB]) [] o.a.s.c.c.SolrZkClient Using default ZkACLProvider. DefaultZkACLProvider is not secure, it creates 'OPEN_ACL_UNSAFE' ACLs to Zookeeper nodes
  2> 441258 INFO  (TEST-OverseerTest.testExceptionWhenFlushClusterState-seed#[721ECF030168CACB]) [] o.a.s.c.s.i.ZkClientClusterStateProvider Cluster at 127.0.0.1:38659/solr ready
  2> 441258 INFO  (TEST-OverseerTest.testExceptionWhenFlushClusterState-seed#[721ECF030168CACB]) [] o.a.s.c.DistributedClusterStateUpdater Creating DistributedClusterStateUpdater with useDistributedStateUpdate=false. Solr will be using Overseer based cluster state updates.
  2> 441260 INFO  (TEST-OverseerTest.testExceptionWhenFlushClusterState-seed#[721ECF030168CACB]) [] o.a.s.c.OverseerElectionContext I am going to be the leader 127.0.0.1:38659_solr
  2> 441260 INFO  (TEST-OverseerTest.testExceptionWhenFlushClusterState-seed#[721ECF030168CACB]) [] o.a.s.c.Overseer Overseer (id=72127657474392074-127.0.0.1:38659_solr-n_0000000000) starting
  2> 441265 WARN  (TEST-OverseerTest.testExceptionWhenFlushClusterState-seed#[721ECF030168CACB]) [] o.a.s.c.Overseer Unable to check back-compat of .system collection - can't obtain ClusterState.
  2> 441266 INFO  (OverseerStateUpdate-72127657474392074-127.0.0.1:38659_solr-n_0000000000) [] o.a.s.c.Overseer Starting to work on the main queue : 127.0.0.1:38659_solr
  2> 441269 WARN  (OverseerStateUpdate-72127657474392074-127.0.0.1:38659_solr-n_0000000000) [] o.a.s.c.Overseer Exception when process message = {
  2>   "name":"collection1",
  2>   "replicationFactor":"1",
  2>   "numShards":"1",
  2>   "createNodeSet":"",
  2>   "operation":"create"}, consider as bad message and poll out from the queue
  2> 441270 ERROR (OverseerStateUpdate-72127657474392074-127.0.0.1:38659_solr-n_0000000000) [] o.a.s.c.Overseer Exception in Overseer when process message from work queue, retrying
  2>           => org.apache.zookeeper.KeeperException$NoNodeException: KeeperErrorCode = NoNode for /collections/collection1/state.json
  2> 	at org.apache.zookeeper.KeeperException.create(KeeperException.java:118)
  2> org.apache.zookeeper.KeeperException$NoNodeException: KeeperErrorCode = NoNode for /collections/collection1/state.json
  2> 	at org.apache.zookeeper.KeeperException.create(KeeperException.java:118) ~[zookeeper-3.8.1.jar:3.8.1]
  2> 	at org.apache.zookeeper.KeeperException.create(KeeperException.java:54) ~[zookeeper-3.8.1.jar:3.8.1]
  2> 	at org.apache.zookeeper.ZooKeeper.create(ZooKeeper.java:1347) ~[zookeeper-3.8.1.jar:3.8.1]
  2> 	at org.apache.solr.common.cloud.SolrZkClient.lambda$create$9(SolrZkClient.java:527) ~[solr-solrj-zookeeper-9.3.1-SNAPSHOT.jar:9.3.1-SNAPSHOT (not a git checkout) [snapshot build, details omitted]]
  2> 	at org.apache.solr.common.cloud.ZkCmdExecutor.retryOperation(ZkCmdExecutor.java:72) ~[solr-solrj-zookeeper-9.3.1-SNAPSHOT.jar:9.3.1-SNAPSHOT (not a git checkout) [snapshot build, details omitted]]
  2> 	at org.apache.solr.common.cloud.SolrZkClient.create(SolrZkClient.java:526) ~[solr-solrj-zookeeper-9.3.1-SNAPSHOT.jar:9.3.1-SNAPSHOT (not a git checkout) [snapshot build, details omitted]]
  2> 	at org.apache.solr.cloud.overseer.ZkStateWriter.writePendingUpdates(ZkStateWriter.java:309) ~[main/:?]
  2> 	at org.apache.solr.cloud.overseer.ZkStateWriter.writePendingUpdates(ZkStateWriter.java:223) ~[main/:?]
  2> 	at org.apache.solr.cloud.overseer.ZkStateWriter.enqueueUpdate(ZkStateWriter.java:184) ~[main/:?]
  2> 	at org.apache.solr.cloud.Overseer$ClusterStateUpdater.processQueueItem(Overseer.java:465) ~[main/:9.3.1-SNAPSHOT (not a git checkout) [snapshot build, details omitted]]
  2> 	at org.apache.solr.cloud.Overseer$ClusterStateUpdater.run(Overseer.java:299) [main/:9.3.1-SNAPSHOT (not a git checkout) [snapshot build, details omitted]]
  2> 	at java.lang.Thread.run(Thread.java:829) [?:?]
  2> 441272 ERROR (OverseerStateUpdate-72127657474392074-127.0.0.1:38659_solr-n_0000000000) [] o.a.s.c.Overseer Exception in Overseer main queue loop
  2>           => org.apache.zookeeper.KeeperException$NoNodeException: KeeperErrorCode = NoNode for /collections/collection1/state.json
  2> 	at org.apache.zookeeper.KeeperException.create(KeeperException.java:118)
  2> org.apache.zookeeper.KeeperException$NoNodeException: KeeperErrorCode = NoNode for /collections/collection1/state.json
  2> 	at org.apache.zookeeper.KeeperException.create(KeeperException.java:118) ~[zookeeper-3.8.1.jar:3.8.1]
  2> 	at org.apache.zookeeper.KeeperException.create(KeeperException.java:54) ~[zookeeper-3.8.1.jar:3.8.1]
  2> 	at org.apache.zookeeper.ZooKeeper.create(ZooKeeper.java:1347) ~[zookeeper-3.8.1.jar:3.8.1]
  2> 	at org.apache.solr.common.cloud.SolrZkClient.lambda$create$9(SolrZkClient.java:527) ~[solr-solrj-zookeeper-9.3.1-SNAPSHOT.jar:9.3.1-SNAPSHOT (not a git checkout) [snapshot build, details omitted]]
  2> 	at org.apache.solr.common.cloud.ZkCmdExecutor.retryOperation(ZkCmdExecutor.java:72) ~[solr-solrj-zookeeper-9.3.1-SNAPSHOT.jar:9.3.1-SNAPSHOT (not a git checkout) [snapshot build, details omitted]]
  2> 	at org.apache.solr.common.cloud.SolrZkClient.create(SolrZkClient.java:526) ~[solr-solrj-zookeeper-9.3.1-SNAPSHOT.jar:9.3.1-SNAPSHOT (not a git checkout) [snapshot build, details omitted]]
  2> 	at org.apache.solr.cloud.overseer.ZkStateWriter.writePendingUpdates(ZkStateWriter.java:309) ~[main/:?]
  2> 	at org.apache.solr.cloud.overseer.ZkStateWriter.writePendingUpdates(ZkStateWriter.java:223) ~[main/:?]
  2> 	at org.apache.solr.cloud.overseer.ZkStateWriter.enqueueUpdate(ZkStateWriter.java:184) ~[main/:?]
  2> 	at org.apache.solr.cloud.Overseer$ClusterStateUpdater.processQueueItem(Overseer.java:465) ~[main/:9.3.1-SNAPSHOT (not a git checkout) [snapshot build, details omitted]]
  2> 	at org.apache.solr.cloud.Overseer$ClusterStateUpdater.run(Overseer.java:375) [main/:9.3.1-SNAPSHOT (not a git checkout) [snapshot build, details omitted]]
  2> 	at java.lang.Thread.run(Thread.java:829) [?:?]
  2> 441274 WARN  (OverseerStateUpdate-72127657474392074-127.0.0.1:38659_solr-n_0000000000) [] o.a.s.c.Overseer Exception when process message = {
  2>   "name":"collection1",
  2>   "replicationFactor":"1",
  2>   "numShards":"1",
  2>   "createNodeSet":"",
  2>   "operation":"create"}, consider as bad message and poll out from the queue
  2> 441275 ERROR (OverseerStateUpdate-72127657474392074-127.0.0.1:38659_solr-n_0000000000) [] o.a.s.c.Overseer Exception in Overseer when process message from work queue, retrying
  2>           => org.apache.zookeeper.KeeperException$NoNodeException: KeeperErrorCode = NoNode for /collections/collection1/state.json
  2> 	at org.apache.zookeeper.KeeperException.create(KeeperException.java:118)
  2> org.apache.zookeeper.KeeperException$NoNodeException: KeeperErrorCode = NoNode for /collections/collection1/state.json
  2> 	at org.apache.zookeeper.KeeperException.create(KeeperException.java:118) ~[zookeeper-3.8.1.jar:3.8.1]
  2> 	at org.apache.zookeeper.KeeperException.create(KeeperException.java:54) ~[zookeeper-3.8.1.jar:3.8.1]
  2> 	at org.apache.zookeeper.ZooKeeper.create(ZooKeeper.java:1347) ~[zookeeper-3.8.1.jar:3.8.1]
  2> 	at org.apache.solr.common.cloud.SolrZkClient.lambda$create$9(SolrZkClient.java:527) ~[solr-solrj-zookeeper-9.3.1-SNAPSHOT.jar:9.3.1-SNAPSHOT (not a git checkout) [snapshot build, details omitted]]
  2> 	at org.apache.solr.common.cloud.ZkCmdExecutor.retryOperation(ZkCmdExecutor.java:72) ~[solr-solrj-zookeeper-9.3.1-SNAPSHOT.jar:9.3.1-SNAPSHOT (not a git checkout) [snapshot build, details omitted]]
  2> 	at org.apache.solr.common.cloud.SolrZkClient.create(SolrZkClient.java:526) ~[solr-solrj-zookeeper-9.3.1-SNAPSHOT.jar:9.3.1-SNAPSHOT (not a git checkout) [snapshot build, details omitted]]
  2> 	at org.apache.solr.cloud.overseer.ZkStateWriter.writePendingUpdates(ZkStateWriter.java:309) ~[main/:?]
  2> 	at org.apache.solr.cloud.overseer.ZkStateWriter.writePendingUpdates(ZkStateWriter.java:223) ~[main/:?]
  2> 	at org.apache.solr.cloud.overseer.ZkStateWriter.enqueueUpdate(ZkStateWriter.java:184) ~[main/:?]
  2> 	at org.apache.solr.cloud.Overseer$ClusterStateUpdater.processQueueItem(Overseer.java:465) ~[main/:9.3.1-SNAPSHOT (not a git checkout) [snapshot build, details omitted]]
  2> 	at org.apache.solr.cloud.Overseer$ClusterStateUpdater.run(Overseer.java:299) [main/:9.3.1-SNAPSHOT (not a git checkout) [snapshot build, details omitted]]
  2> 	at java.lang.Thread.run(Thread.java:829) [?:?]
  2> 441521 INFO  (closeThreadPool-6435-thread-1) [] o.a.s.c.Overseer Overseer (id=72127657474392074-127.0.0.1:38659_solr-n_0000000000) closing
  2> 441522 INFO  (OverseerStateUpdate-72127657474392074-127.0.0.1:38659_solr-n_0000000000) [] o.a.s.c.Overseer Overseer Loop exiting : 127.0.0.1:38659_solr
  2> 441523 WARN  (OverseerExitThread) [] o.a.s.c.Overseer Error communicating with ZooKeeper
  2>           => org.apache.zookeeper.KeeperException$SessionExpiredException: KeeperErrorCode = Session expired for /overseer_elect/leader
  2> 	at org.apache.zookeeper.KeeperException.create(KeeperException.java:134)
  2> org.apache.zookeeper.KeeperException$SessionExpiredException: KeeperErrorCode = Session expired for /overseer_elect/leader
  2> 	at org.apache.zookeeper.KeeperException.create(KeeperException.java:134) ~[zookeeper-3.8.1.jar:3.8.1]
  2> 	at org.apache.zookeeper.KeeperException.create(KeeperException.java:54) ~[zookeeper-3.8.1.jar:3.8.1]
  2> 	at org.apache.zookeeper.ZooKeeper.getData(ZooKeeper.java:1972) ~[zookeeper-3.8.1.jar:3.8.1]
  2> 	at org.apache.solr.common.cloud.SolrZkClient.lambda$getData$6(SolrZkClient.java:437) ~[solr-solrj-zookeeper-9.3.1-SNAPSHOT.jar:9.3.1-SNAPSHOT (not a git checkout) [snapshot build, details omitted]]
  2> 	at org.apache.solr.common.cloud.ZkCmdExecutor.retryOperation(ZkCmdExecutor.java:72) ~[solr-solrj-zookeeper-9.3.1-SNAPSHOT.jar:9.3.1-SNAPSHOT (not a git checkout) [snapshot build, details omitted]]
  2> 	at org.apache.solr.common.cloud.SolrZkClient.getData(SolrZkClient.java:437) ~[solr-solrj-zookeeper-9.3.1-SNAPSHOT.jar:9.3.1-SNAPSHOT (not a git checkout) [snapshot build, details omitted]]
  2> 	at org.apache.solr.cloud.Overseer$ClusterStateUpdater.checkIfIamStillLeader(Overseer.java:482) [main/:9.3.1-SNAPSHOT (not a git checkout) [snapshot build, details omitted]]
  2> 	at java.lang.Thread.run(Thread.java:829) [?:?]
  2> 441535 INFO  (TEST-OverseerTest.testExceptionWhenFlushClusterState-seed#[721ECF030168CACB]) [] o.a.s.SolrTestCaseJ4 ###Ending testExceptionWhenFlushClusterState
  2> 441540 INFO  (TEST-OverseerTest.testRemovalOfLastReplica-seed#[721ECF030168CACB]) [] o.a.s.SolrTestCaseJ4 ###Starting testRemovalOfLastReplica
  2> 441551 WARN  (TEST-OverseerTest.testRemovalOfLastReplica-seed#[721ECF030168CACB]) [] o.a.s.c.ZkController Contents of zookeeper /security.json are world-readable; consider setting up ACLs as described in https://solr.apache.org/guide/solr/latest/deployment-guide/zookeeper-access-control.html
  2> 441553 WARN  (TEST-OverseerTest.testRemovalOfLastReplica-seed#[721ECF030168CACB]) [] o.a.s.c.c.SolrZkClient Using default ZkCredentialsInjector. ZkCredentialsInjector is not secure, it creates an empty list of credentials which leads to 'OPEN_ACL_UNSAFE' ACLs to Zookeeper nodes
  2> 441554 INFO  (TEST-OverseerTest.testRemovalOfLastReplica-seed#[721ECF030168CACB]) [] o.a.s.c.c.ConnectionManager Waiting up to 30000ms for client to connect to ZooKeeper
  2> 441555 INFO  (zkConnectionManagerCallback-6439-thread-1) [] o.a.s.c.c.ConnectionManager zkClient has connected
  2> 441555 INFO  (TEST-OverseerTest.testRemovalOfLastReplica-seed#[721ECF030168CACB]) [] o.a.s.c.c.ConnectionManager Client is connected to ZooKeeper
  2> 441555 WARN  (TEST-OverseerTest.testRemovalOfLastReplica-seed#[721ECF030168CACB]) [] o.a.s.c.c.SolrZkClient Using default ZkACLProvider. DefaultZkACLProvider is not secure, it creates 'OPEN_ACL_UNSAFE' ACLs to Zookeeper nodes
  2> 441558 WARN  (TEST-OverseerTest.testRemovalOfLastReplica-seed#[721ECF030168CACB]) [] o.a.s.c.c.SolrZkClient Using default ZkCredentialsInjector. ZkCredentialsInjector is not secure, it creates an empty list of credentials which leads to 'OPEN_ACL_UNSAFE' ACLs to Zookeeper nodes
  2> 441559 INFO  (TEST-OverseerTest.testRemovalOfLastReplica-seed#[721ECF030168CACB]) [] o.a.s.c.c.ConnectionManager Waiting up to 30000ms for client to connect to ZooKeeper
  2> 441559 INFO  (zkConnectionManagerCallback-6447-thread-1) [] o.a.s.c.c.ConnectionManager zkClient has connected
  2> 441560 INFO  (TEST-OverseerTest.testRemovalOfLastReplica-seed#[721ECF030168CACB]) [] o.a.s.c.c.ConnectionManager Client is connected to ZooKeeper
  2> 441560 WARN  (TEST-OverseerTest.testRemovalOfLastReplica-seed#[721ECF030168CACB]) [] o.a.s.c.c.SolrZkClient Using default ZkACLProvider. DefaultZkACLProvider is not secure, it creates 'OPEN_ACL_UNSAFE' ACLs to Zookeeper nodes
  2> 441561 WARN  (TEST-OverseerTest.testRemovalOfLastReplica-seed#[721ECF030168CACB]) [] o.a.s.c.c.SolrZkClient Using default ZkCredentialsInjector. ZkCredentialsInjector is not secure, it creates an empty list of credentials which leads to 'OPEN_ACL_UNSAFE' ACLs to Zookeeper nodes
  2> 441561 INFO  (TEST-OverseerTest.testRemovalOfLastReplica-seed#[721ECF030168CACB]) [] o.a.s.c.c.ConnectionManager Waiting up to 15000ms for client to connect to ZooKeeper
  2> 441562 INFO  (zkConnectionManagerCallback-6452-thread-1) [] o.a.s.c.c.ConnectionManager zkClient

[...truncated too long message...]

.cloud.SolrZkClient.lambda$getData$6(SolrZkClient.java:437) ~[solr-solrj-zookeeper-9.3.1-SNAPSHOT.jar:9.3.1-SNAPSHOT (not a git checkout) [snapshot build, details omitted]]
  2> 	at org.apache.solr.common.cloud.ZkCmdExecutor.retryOperation(ZkCmdExecutor.java:72) ~[solr-solrj-zookeeper-9.3.1-SNAPSHOT.jar:9.3.1-SNAPSHOT (not a git checkout) [snapshot build, details omitted]]
  2> 	at org.apache.solr.common.cloud.SolrZkClient.getData(SolrZkClient.java:437) ~[solr-solrj-zookeeper-9.3.1-SNAPSHOT.jar:9.3.1-SNAPSHOT (not a git checkout) [snapshot build, details omitted]]
  2> 	at org.apache.solr.cloud.Overseer$ClusterStateUpdater.checkIfIamStillLeader(Overseer.java:482) [main/:9.3.1-SNAPSHOT (not a git checkout) [snapshot build, details omitted]]
  2> 	at java.lang.Thread.run(Thread.java:829) [?:?]
  2> 451882 INFO  (TEST-OverseerTest.testBadQueueItem-seed#[721ECF030168CACB]) [] o.a.s.SolrTestCaseJ4 ###Ending testBadQueueItem
  1> / (0)
  1> 
  2> 451883 INFO  (SUITE-OverseerTest-seed#[721ECF030168CACB]-worker) [] o.a.s.c.ZkTestServer Shutting down ZkTestServer.
  2> 452086 WARN  (ZkTestServer Run Thread) [] o.a.s.c.ZkTestServer Watch limit violations: 
  2> Maximum concurrent create/delete watches above limit:
  2> 
  2> 	125	/solr/security.json
  2> 	73	/solr/aliases.json
  2> 	73	/solr/clusterprops.json
  2> 	7	/solr/collections/collection1/state.json
  2> 	2	/solr/collections/collection2/state.json
  2> 
  2> Maximum concurrent data watches above limit:
  2> 
  2> 	470	/solr/collections/collection1/state.json
  2> 	66	/solr/security.json
  2> 	18	/solr/collections/collection2/state.json
  2> 	8	/solr/collections/c1/state.json
  2> 	5	/solr/collections/collection0/state.json
  2> 	5	/solr/collections/test/state.json
  2> 	3	/solr/collections/collection3/state.json
  2> 	2	/solr/collections/collection4/state.json
  2> 
  2> Maximum concurrent children watches above limit:
  2> 
  2> 	340	/solr/live_nodes
  2> 	212	/solr/overseer/queue
  2> 	132	/solr/collections
  2> 	91	/solr/collections/collection1/state.json
  2> 	23	/solr/overseer/queue-work
  2> 	20	/solr/overseer/collection-queue-work
  2> 	7	/solr/collections/collection2/state.json
  2> 	4	/solr/collections/c1/state.json
  2> 	3	/solr/collections/collection0/state.json
  2> 	2	/solr/collections/test/state.json
  2> 
  2> 452092 INFO  (SUITE-OverseerTest-seed#[721ECF030168CACB]-worker) [] o.a.s.u.ErrorLogMuter Closing ErrorLogMuter-regex-132 after mutting 0 log messages
  2> 452092 INFO  (SUITE-OverseerTest-seed#[721ECF030168CACB]-worker) [] o.a.s.u.ErrorLogMuter Creating ErrorLogMuter-regex-133 for ERROR logs matching regex: ignore_exception
  2> NOTE: test params are: codec=Asserting(Lucene95): {}, docValues:{}, maxPointsInLeafNode=1153, maxMBSortInHeap=7.6335254198327185, sim=Asserting(RandomSimilarity(queryNorm=false): {}), locale=fr-CA, timezone=Europe/Tirane
  2> NOTE: Linux 5.4.0-155-generic amd64/Eclipse Adoptium 11.0.16.1 (64-bit)/cpus=1,threads=2,free=102420920,total=517996544
  2> NOTE: All tests run in this JVM: [BasicFunctionalityTest, CursorPagingTest, DistributedIntervalFacetingTest, HelloWorldSolrCloudTestCase, OutputWriterTest, SolrInfoBeanTest, SolrTestCaseJ4Test, TestCursorMarkWithoutUniqueKey, TestDistributedMissingSort, TestDocumentBuilder, TestHighlightDedupGrouping, TestRandomDVFaceting, TestSimpleTrackingShardHandler, TestTolerantSearch, CommonGramsPhraseQueryTest, ProtectedTermFilterFactoryTest, TestDeprecatedFilters, TestReversedWildcardFilterFactory, TokenizerChainTest, ApiToolTest, HealthcheckToolTest, SolrCliUptimeTest, TestExportTool, TestEmbeddedSolrServerAdminHandler, TestEmbeddedSolrServerSchemaAPI, ActionThrottleTest, AliasIntegrationTest, BalanceReplicasTest, BasicDistributedZkTest, ChaosMonkeyNothingIsSafeWithPullReplicasTest, ChaosMonkeySafeLeaderWithPullReplicasTest, CleanupOldIndexTest, ClusterStateMockUtilTest, ClusterStateUpdateTest, CollectionStateZnodeTest, ConcurrentCreateRoutedAliasTest, ConnectionManagerTest, CreateRoutedAliasTest, DeleteLastCustomShardedReplicaTest, DeleteReplicaTest, DeleteStatusTest, DistribDocExpirationUpdateProcessorTest, DistributedApiAsyncTrackerTest, DistributedVersionInfoTest, ForceLeaderTest, FullSolrCloudDistribCmdsTest, HttpPartitionTest, LeaderElectionContextKeyTest, LeaderElectionTest, LeaderFailureAfterFreshStartTest, LeaderVoteWaitTimeoutTest, MigrateRouteKeyTest, MoveReplicaTest, MultiThreadedOCPTest, NodeMutatorTest, OutOfBoxZkACLAndCredentialsProvidersTest, OverseerCollectionConfigSetProcessorTest, OverseerRolesTest, OverseerStatusTest, OverseerTest]

WARNING: Test org.apache.solr.schema.TestCloudSchemaless wrote 13,191,042 bytes of output.
WARNING: Test org.apache.solr.search.facet.TestCloudJSONFacetSKG wrote 20,648,030 bytes of output.
WARNING: Test org.apache.solr.search.facet.TestJsonFacetRefinement wrote 23,143,073 bytes of output.
WARNING: Test org.apache.solr.search.facet.TestJsonFacets wrote 24,931,449 bytes of output.

> Task :solr:benchmark:test
:solr:benchmark:test (SUCCESS): 11 test(s)

> Task :solr:benchmark:wipeTaskTemp

> Task :solr:prometheus-exporter:compileJava
Note: Some input files use or override a deprecated API.
Note: Recompile with -Xlint:deprecation for details.

> Task :solr:prometheus-exporter:processResources NO-SOURCE
> Task :solr:prometheus-exporter:classes

> Task :solr:prometheus-exporter:compileTestJava
Note: /home/jenkins/jenkins-slave/workspace/Solr/Solr-Smoketest-9.3/_tmp/smoke_1691335159/unpack/solr-9.3.1/solr/prometheus-exporter/src/test/org/apache/solr/prometheus/exporter/MetricsQueryTemplateTest.java uses or overrides a deprecated API.
Note: Recompile with -Xlint:deprecation for details.

> Task :solr:prometheus-exporter:processTestResources
> Task :solr:prometheus-exporter:testClasses

> Task :solr:prometheus-exporter:test
:solr:prometheus-exporter:test (SUCCESS): 22 test(s)

> Task :solr:prometheus-exporter:wipeTaskTemp
> Task :solr:server:compileJava SKIPPED
> Task :solr:server:processResources NO-SOURCE
> Task :solr:server:classes UP-TO-DATE
> Task :solr:server:compileTestJava NO-SOURCE
> Task :solr:server:processTestResources NO-SOURCE
> Task :solr:server:testClasses UP-TO-DATE
> Task :solr:server:test NO-SOURCE
> Task :solr:server:wipeTaskTemp
> Task :solr:solr-ref-guide:compileJava NO-SOURCE
> Task :solr:solr-ref-guide:processResources NO-SOURCE
> Task :solr:solr-ref-guide:classes UP-TO-DATE

> Task :solr:solr-ref-guide:compileTestJava
Note: Some input files use or override a deprecated API.
Note: Recompile with -Xlint:deprecation for details.

> Task :solr:solr-ref-guide:copySolrjTestResources
> Task :solr:solr-ref-guide:processTestResources NO-SOURCE
> Task :solr:solr-ref-guide:testClasses

> Task :solr:core:test
:solr:core:test (FAILURE): 4847 test(s), 1 failure(s), 200 skipped

4847 tests completed, 1 failed, 200 skipped

> Task :solr:solr-ref-guide:test
:solr:solr-ref-guide:test (SUCCESS): 32 test(s)

> Task :solr:solr-ref-guide:wipeTaskTemp
> Task :solr:core:test FAILED
> Task :solr:core:wipeTaskTemp

> Task :solr:solrj:compileTestJava
Note: Some input files use or override a deprecated API.
Note: Recompile with -Xlint:deprecation for details.

ERROR: The following test(s) have failed:
  - org.apache.solr.cloud.OverseerTest.testShardLeaderChange (:solr:core)
    Test output: /home/jenkins/jenkins-slave/workspace/Solr/Solr-Smoketest-9.3/_tmp/smoke_1691335159/unpack/solr-9.3.1/solr/core/build/test-results/test/outputs/OUTPUT-org.apache.solr.cloud.OverseerTest.txt
    Reproduce with: gradlew :solr:core:test --tests "org.apache.solr.cloud.OverseerTest.testShardLeaderChange" -Ptests.jvms=2 "-Ptests.jvmargs=-XX:TieredStopAtLevel=1 -XX:+UseParallelGC -XX:ActiveProcessorCount=1 -XX:ReservedCodeCacheSize=120m" -Ptests.seed=721ECF030168CACB -Ptests.badapples=false -Ptests.file.encoding=US-ASCII


FAILURE: Build failed with an exception.

* What went wrong:
Execution failed for task ':solr:core:test'.
> There were failing tests. See the results at: file:///home/jenkins/jenkins-slave/workspace/Solr/Solr-Smoketest-9.3/_tmp/smoke_1691335159/unpack/solr-9.3.1/solr/core/build/test-results/test/

* Try:
> Run with --stacktrace option to get the stack trace.
> Run with --info or --debug option to get more log output.

* Get more help at https://help.gradle.org

BUILD FAILED in 35m 39s
41 actionable tasks: 28 executed, 13 up-to-date

Publishing build scan...
https://ge.apache.org/s/d7pfcfyl4a32q



Traceback (most recent call last):
  File "dev-tools/scripts/smokeTestRelease.py", line 1174, in <module>
    main()
  File "dev-tools/scripts/smokeTestRelease.py", line 1100, in main
    smokeTest(c.java, c.url, c.revision, c.version, c.tmp_dir, c.is_signed, c.local_keys, ' '.join(c.test_args),
  File "dev-tools/scripts/smokeTestRelease.py", line 1162, in smokeTest
    unpackAndVerify(java, tmpDir, 'solr-%s-src.tgz' % version, gitRevision, version, testArgs)
  File "dev-tools/scripts/smokeTestRelease.py", line 553, in unpackAndVerify
    verifyUnpacked(java, artifact, unpackPath, gitRevision, version, testArgs)
  File "dev-tools/scripts/smokeTestRelease.py", line 644, in verifyUnpacked
    java.run_java11('./gradlew --no-daemon test %s' % testArgs, '%s/test.log' % unpackPath)
  File "dev-tools/scripts/smokeTestRelease.py", line 1010, in run_java
    run('%s; %s' % (cmd_prefix, cmd), logfile)
  File "dev-tools/scripts/smokeTestRelease.py", line 483, in run
    raise RuntimeError('command "%s" failed; see log file %s' % (command, logPath))
RuntimeError: command "export JAVA_HOME="/home/jenkins/tools/java/latest11" PATH="/home/jenkins/tools/java/latest11/bin:$PATH" JAVACMD="/home/jenkins/tools/java/latest11/bin/java"; ./gradlew --no-daemon test -Dtests.nightly=false -Dtests.badapples=false " failed; see log file /home/jenkins/jenkins-slave/workspace/Solr/Solr-Smoketest-9.3/_tmp/smoke_1691335159/unpack/solr-9.3.1/test.log
Build step 'Run with timeout' marked build as failure
Email was triggered for: Failure - Any
Sending email for trigger: Failure - Any