You are viewing a plain text version of this content. The canonical link for it is here.
Posted to builds@beam.apache.org by Apache Jenkins Server <je...@builds.apache.org> on 2023/02/16 00:36:08 UTC
Build failed in Jenkins: beam_PerformanceTests_Kafka_IO #3620
See <https://ci-beam.apache.org/job/beam_PerformanceTests_Kafka_IO/3620/display/redirect?page=changes>
Changes:
[noreply] [Go SDK] add retries to connect with expansion service (#25237)
[noreply] SpannerIO: parameterizing partitionQuery timeout (#25236)
[noreply] Use example id as CloudPath (#25487)
[noreply] SpannerIO: Handling pg spanner.commit_timestamp (#25479)
[noreply] Fix provider to be found by AutoService (#25491)
[noreply] [Python] Added Tensorflow Model Handler (#25368)
[noreply] [#24789][prism] internal/coders.go and tests (#25476)
[noreply] Update documents for 2.45 (#25407)
[noreply] Update documents for 2.45 (#25500)
[noreply] Update python container images (#25475)
------------------------------------------
[...truncated 791.45 KB...]
File "/usr/lib/python3.8/urllib/request.py", line 755, in http_error_302
return self.parent.open(new, timeout=req.timeout)
File "/usr/lib/python3.8/urllib/request.py", line 531, in open
response = meth(req, response)
File "/usr/lib/python3.8/urllib/request.py", line 640, in http_response
response = self.parent.error(
File "/usr/lib/python3.8/urllib/request.py", line 563, in error
result = self._call_chain(*args)
File "/usr/lib/python3.8/urllib/request.py", line 502, in _call_chain
result = func(*args)
File "/usr/lib/python3.8/urllib/request.py", line 755, in http_error_302
return self.parent.open(new, timeout=req.timeout)
File "/usr/lib/python3.8/urllib/request.py", line 531, in open
response = meth(req, response)
File "/usr/lib/python3.8/urllib/request.py", line 640, in http_response
response = self.parent.error(
File "/usr/lib/python3.8/urllib/request.py", line 569, in error
return self._call_chain(*args)
File "/usr/lib/python3.8/urllib/request.py", line 502, in _call_chain
result = func(*args)
File "/usr/lib/python3.8/urllib/request.py", line 649, in http_error_default
raise HTTPError(req.full_url, code, msg, hdrs, fp)
urllib.error.HTTPError: HTTP Error 404: Not Found
ERROR:root:Invalid url for minlog-1.2: http://www.opensource.org/licenses/bsd-license.php after 9 retries.
Traceback (most recent call last):
File "<https://ci-beam.apache.org/job/beam_PerformanceTests_Kafka_IO/ws/src/sdks/java/container/license_scripts/pull_licenses_java.py",> line 58, in pull_from_url
url_read = urlopen(Request(url, headers={
File "/usr/lib/python3.8/urllib/request.py", line 222, in urlopen
return opener.open(url, data, timeout)
File "/usr/lib/python3.8/urllib/request.py", line 531, in open
response = meth(req, response)
File "/usr/lib/python3.8/urllib/request.py", line 640, in http_response
response = self.parent.error(
File "/usr/lib/python3.8/urllib/request.py", line 563, in error
result = self._call_chain(*args)
File "/usr/lib/python3.8/urllib/request.py", line 502, in _call_chain
result = func(*args)
File "/usr/lib/python3.8/urllib/request.py", line 755, in http_error_302
return self.parent.open(new, timeout=req.timeout)
File "/usr/lib/python3.8/urllib/request.py", line 531, in open
response = meth(req, response)
File "/usr/lib/python3.8/urllib/request.py", line 640, in http_response
response = self.parent.error(
File "/usr/lib/python3.8/urllib/request.py", line 563, in error
result = self._call_chain(*args)
File "/usr/lib/python3.8/urllib/request.py", line 502, in _call_chain
result = func(*args)
File "/usr/lib/python3.8/urllib/request.py", line 755, in http_error_302
return self.parent.open(new, timeout=req.timeout)
File "/usr/lib/python3.8/urllib/request.py", line 531, in open
response = meth(req, response)
File "/usr/lib/python3.8/urllib/request.py", line 640, in http_response
response = self.parent.error(
File "/usr/lib/python3.8/urllib/request.py", line 569, in error
return self._call_chain(*args)
File "/usr/lib/python3.8/urllib/request.py", line 502, in _call_chain
result = func(*args)
File "/usr/lib/python3.8/urllib/request.py", line 649, in http_error_default
raise HTTPError(req.full_url, code, msg, hdrs, fp)
urllib.error.HTTPError: HTTP Error 404: Not Found
ERROR:root:Invalid url for junit-quickcheck-generators-1.0: http://www.opensource.org/licenses/mit-license.php after 9 retries.
Traceback (most recent call last):
File "<https://ci-beam.apache.org/job/beam_PerformanceTests_Kafka_IO/ws/src/sdks/java/container/license_scripts/pull_licenses_java.py",> line 58, in pull_from_url
url_read = urlopen(Request(url, headers={
File "/usr/lib/python3.8/urllib/request.py", line 222, in urlopen
return opener.open(url, data, timeout)
File "/usr/lib/python3.8/urllib/request.py", line 531, in open
response = meth(req, response)
File "/usr/lib/python3.8/urllib/request.py", line 640, in http_response
response = self.parent.error(
File "/usr/lib/python3.8/urllib/request.py", line 563, in error
result = self._call_chain(*args)
File "/usr/lib/python3.8/urllib/request.py", line 502, in _call_chain
result = func(*args)
File "/usr/lib/python3.8/urllib/request.py", line 755, in http_error_302
return self.parent.open(new, timeout=req.timeout)
File "/usr/lib/python3.8/urllib/request.py", line 531, in open
response = meth(req, response)
File "/usr/lib/python3.8/urllib/request.py", line 640, in http_response
response = self.parent.error(
File "/usr/lib/python3.8/urllib/request.py", line 563, in error
result = self._call_chain(*args)
File "/usr/lib/python3.8/urllib/request.py", line 502, in _call_chain
result = func(*args)
File "/usr/lib/python3.8/urllib/request.py", line 755, in http_error_302
return self.parent.open(new, timeout=req.timeout)
File "/usr/lib/python3.8/urllib/request.py", line 531, in open
response = meth(req, response)
File "/usr/lib/python3.8/urllib/request.py", line 640, in http_response
response = self.parent.error(
File "/usr/lib/python3.8/urllib/request.py", line 569, in error
return self._call_chain(*args)
File "/usr/lib/python3.8/urllib/request.py", line 502, in _call_chain
result = func(*args)
File "/usr/lib/python3.8/urllib/request.py", line 649, in http_error_default
raise HTTPError(req.full_url, code, msg, hdrs, fp)
urllib.error.HTTPError: HTTP Error 404: Not Found
ERROR:root:Invalid url for log4j-over-slf4j-1.7.30: http://www.opensource.org/licenses/mit-license.php after 9 retries.
Traceback (most recent call last):
File "<https://ci-beam.apache.org/job/beam_PerformanceTests_Kafka_IO/ws/src/sdks/java/container/license_scripts/pull_licenses_java.py",> line 58, in pull_from_url
url_read = urlopen(Request(url, headers={
File "/usr/lib/python3.8/urllib/request.py", line 222, in urlopen
return opener.open(url, data, timeout)
File "/usr/lib/python3.8/urllib/request.py", line 531, in open
response = meth(req, response)
File "/usr/lib/python3.8/urllib/request.py", line 640, in http_response
response = self.parent.error(
File "/usr/lib/python3.8/urllib/request.py", line 563, in error
result = self._call_chain(*args)
File "/usr/lib/python3.8/urllib/request.py", line 502, in _call_chain
result = func(*args)
File "/usr/lib/python3.8/urllib/request.py", line 755, in http_error_302
return self.parent.open(new, timeout=req.timeout)
File "/usr/lib/python3.8/urllib/request.py", line 531, in open
response = meth(req, response)
File "/usr/lib/python3.8/urllib/request.py", line 640, in http_response
response = self.parent.error(
File "/usr/lib/python3.8/urllib/request.py", line 563, in error
result = self._call_chain(*args)
File "/usr/lib/python3.8/urllib/request.py", line 502, in _call_chain
result = func(*args)
File "/usr/lib/python3.8/urllib/request.py", line 755, in http_error_302
return self.parent.open(new, timeout=req.timeout)
File "/usr/lib/python3.8/urllib/request.py", line 531, in open
response = meth(req, response)
File "/usr/lib/python3.8/urllib/request.py", line 640, in http_response
response = self.parent.error(
File "/usr/lib/python3.8/urllib/request.py", line 569, in error
return self._call_chain(*args)
File "/usr/lib/python3.8/urllib/request.py", line 502, in _call_chain
result = func(*args)
File "/usr/lib/python3.8/urllib/request.py", line 649, in http_error_default
raise HTTPError(req.full_url, code, msg, hdrs, fp)
urllib.error.HTTPError: HTTP Error 404: Not Found
ERROR:root:Invalid url for slf4j-simple-1.7.30: http://www.opensource.org/licenses/mit-license.php after 9 retries.
Traceback (most recent call last):
File "<https://ci-beam.apache.org/job/beam_PerformanceTests_Kafka_IO/ws/src/sdks/java/container/license_scripts/pull_licenses_java.py",> line 58, in pull_from_url
url_read = urlopen(Request(url, headers={
File "/usr/lib/python3.8/urllib/request.py", line 222, in urlopen
return opener.open(url, data, timeout)
File "/usr/lib/python3.8/urllib/request.py", line 531, in open
response = meth(req, response)
File "/usr/lib/python3.8/urllib/request.py", line 640, in http_response
response = self.parent.error(
File "/usr/lib/python3.8/urllib/request.py", line 563, in error
result = self._call_chain(*args)
File "/usr/lib/python3.8/urllib/request.py", line 502, in _call_chain
result = func(*args)
File "/usr/lib/python3.8/urllib/request.py", line 755, in http_error_302
return self.parent.open(new, timeout=req.timeout)
File "/usr/lib/python3.8/urllib/request.py", line 531, in open
response = meth(req, response)
File "/usr/lib/python3.8/urllib/request.py", line 640, in http_response
response = self.parent.error(
File "/usr/lib/python3.8/urllib/request.py", line 563, in error
result = self._call_chain(*args)
File "/usr/lib/python3.8/urllib/request.py", line 502, in _call_chain
result = func(*args)
File "/usr/lib/python3.8/urllib/request.py", line 755, in http_error_302
return self.parent.open(new, timeout=req.timeout)
File "/usr/lib/python3.8/urllib/request.py", line 531, in open
response = meth(req, response)
File "/usr/lib/python3.8/urllib/request.py", line 640, in http_response
response = self.parent.error(
File "/usr/lib/python3.8/urllib/request.py", line 569, in error
return self._call_chain(*args)
File "/usr/lib/python3.8/urllib/request.py", line 502, in _call_chain
result = func(*args)
File "/usr/lib/python3.8/urllib/request.py", line 649, in http_error_default
raise HTTPError(req.full_url, code, msg, hdrs, fp)
urllib.error.HTTPError: HTTP Error 404: Not Found
ERROR:root:Invalid url for slf4j-api-1.7.35: http://www.opensource.org/licenses/mit-license.php after 9 retries.
ERROR:root:['reflectasm-1.07', 'software-and-algorithms-1.0', 'kryo-2.21', 'junit-quickcheck-core-1.0', 'pcollections-2.1.2', 'jcl-over-slf4j-1.7.30', 'slf4j-jdk14-1.7.30', 'slf4j-api-1.7.30', 'minlog-1.2', 'junit-quickcheck-generators-1.0', 'log4j-over-slf4j-1.7.30', 'slf4j-simple-1.7.30', 'slf4j-api-1.7.35']
ERROR:root:**************************************** Licenses were not able to be pulled automatically for some dependencies. Please search source code of the dependencies on the internet and add "license" and "notice" (if available) field to <https://ci-beam.apache.org/job/beam_PerformanceTests_Kafka_IO/ws/src/sdks/java/container/license_scripts/dep_urls_java.yaml> for each missing license. Dependency List: [jcl-over-slf4j-1.7.30,junit-quickcheck-core-1.0,junit-quickcheck-generators-1.0,kryo-2.21,log4j-over-slf4j-1.7.30,minlog-1.2,pcollections-2.1.2,reflectasm-1.07,slf4j-api-1.7.30,slf4j-api-1.7.35,slf4j-jdk14-1.7.30,slf4j-simple-1.7.30,software-and-algorithms-1.0]
INFO:root:pull_licenses_java.py failed. It took 89.506956 seconds with 16 threads.
Traceback (most recent call last):
File "<https://ci-beam.apache.org/job/beam_PerformanceTests_Kafka_IO/ws/src/sdks/java/container/license_scripts/pull_licenses_java.py",> line 326, in <module>
raise RuntimeError('{n} error(s) occurred.'.format(n=len(error_msg)),
RuntimeError: ('1 error(s) occurred.', ['**************************************** Licenses were not able to be pulled automatically for some dependencies. Please search source code of the dependencies on the internet and add "license" and "notice" (if available) field to <https://ci-beam.apache.org/job/beam_PerformanceTests_Kafka_IO/ws/src/sdks/java/container/license_scripts/dep_urls_java.yaml> for each missing license. Dependency List: [jcl-over-slf4j-1.7.30,junit-quickcheck-core-1.0,junit-quickcheck-generators-1.0,kryo-2.21,log4j-over-slf4j-1.7.30,minlog-1.2,pcollections-2.1.2,reflectasm-1.07,slf4j-api-1.7.30,slf4j-api-1.7.35,slf4j-jdk14-1.7.30,slf4j-simple-1.7.30,software-and-algorithms-1.0]'])
> Task :sdks:java:container:pullLicenses FAILED
:sdks:java:container:pullLicenses (Thread[included builds,5,main]) completed. Took 1 mins 40.882 secs.
Resolve mutations for :sdks:java:container:goPrepare (Thread[Execution **** Thread 3,5,main]) started.
Resolve mutations for :sdks:java:container:goPrepare (Thread[Execution **** Thread 3,5,main]) completed. Took 0.001 secs.
:sdks:java:container:goPrepare (Thread[included builds,5,main]) started.
> Task :sdks:java:container:goPrepare UP-TO-DATE
Skipping task ':sdks:java:container:goPrepare' as it has no actions.
:sdks:java:container:goPrepare (Thread[included builds,5,main]) completed. Took 0.0 secs.
Resolve mutations for :sdks:java:container:goBuild (Thread[included builds,5,main]) started.
Resolve mutations for :sdks:java:container:goBuild (Thread[included builds,5,main]) completed. Took 0.0 secs.
:sdks:java:container:goBuild (Thread[Execution ****,5,main]) started.
> Task :sdks:java:container:goBuild
Custom actions are attached to task ':sdks:java:container:goBuild'.
Caching disabled for task ':sdks:java:container:goBuild' because:
Gradle would require more information to cache this task
Task ':sdks:java:container:goBuild' is not up-to-date because:
Task has not declared any outputs despite executing actions.
Starting process 'command 'sh''. Working directory: <https://ci-beam.apache.org/job/beam_PerformanceTests_Kafka_IO/ws/src/sdks/java/container> Command: sh -c <https://ci-beam.apache.org/job/beam_PerformanceTests_Kafka_IO/ws/src/sdks/go/run_with_go_version.sh> --gocmd GOBIN/go1.19.3 build -o ./build/target/${GOOS}_${GOARCH}/boot *.go
Successfully started process 'command 'sh''
/home/jenkins/go/bin/go1.19.3 build -o ./build/target/linux_amd64/boot boot.go boot_test.go
:sdks:java:container:goBuild (Thread[Execution ****,5,main]) completed. Took 2.435 secs.
work action resolve target (project :sdks:java:container) (Thread[Execution **** Thread 2,5,main]) started.
work action null (Thread[Execution **** Thread 2,5,main]) completed. Took 0.0 secs.
Resolve mutations for :sdks:java:container:java8:copySdkHarnessLauncher (Thread[Execution **** Thread 3,5,main]) started.
Resolve mutations for :sdks:java:container:java8:copySdkHarnessLauncher (Thread[Execution **** Thread 3,5,main]) completed. Took 0.0 secs.
:sdks:java:container:java8:copySdkHarnessLauncher (Thread[Execution **** Thread 5,5,main]) started.
> Task :sdks:java:container:java8:copySdkHarnessLauncher
Execution optimizations have been disabled for task ':sdks:java:container:java8:copySdkHarnessLauncher' to ensure correctness due to the following reasons:
- Gradle detected a problem with the following location: '<https://ci-beam.apache.org/job/beam_PerformanceTests_Kafka_IO/ws/src/sdks/java/container/build/target'.> Reason: Task ':sdks:java:container:java8:copySdkHarnessLauncher' uses this output of task ':sdks:java:container:downloadCloudProfilerAgent' without declaring an explicit or implicit dependency. This can lead to incorrect results being produced, depending on what order the tasks are executed. Please refer to https://docs.gradle.org/7.5.1/userguide/validation_problems.html#implicit_dependency for more details about this problem.
- Gradle detected a problem with the following location: '<https://ci-beam.apache.org/job/beam_PerformanceTests_Kafka_IO/ws/src/sdks/java/container/build/target'.> Reason: Task ':sdks:java:container:java8:copySdkHarnessLauncher' uses this output of task ':sdks:java:container:pullLicenses' without declaring an explicit or implicit dependency. This can lead to incorrect results being produced, depending on what order the tasks are executed. Please refer to https://docs.gradle.org/7.5.1/userguide/validation_problems.html#implicit_dependency for more details about this problem.
Invalidating VFS because task ':sdks:java:container:java8:copySdkHarnessLauncher' failed validation
Caching disabled for task ':sdks:java:container:java8:copySdkHarnessLauncher' because:
Caching has been disabled to ensure correctness. Please consult deprecation warnings for more details.
Task ':sdks:java:container:java8:copySdkHarnessLauncher' is not up-to-date because:
No history is available.
:sdks:java:container:java8:copySdkHarnessLauncher (Thread[Execution **** Thread 5,5,main]) completed. Took 0.757 secs.
FAILURE: Build failed with an exception.
* What went wrong:
Execution failed for task ':sdks:java:container:pullLicenses'.
> Process 'command './license_scripts/license_script.sh'' finished with non-zero exit value 1
* Try:
> Run with --stacktrace option to get the stack trace.
> Run with --debug option to get more log output.
* Get more help at https://help.gradle.org
Deprecated Gradle features were used in this build, making it incompatible with Gradle 8.0.
You can use '--warning-mode all' to show the individual deprecation warnings and determine if they come from your own scripts or plugins.
See https://docs.gradle.org/7.5.1/userguide/command_line_interface.html#sec:command_line_warnings
Execution optimizations have been disabled for 1 invalid unit(s) of work during this build to ensure correctness.
Please consult deprecation warnings for more details.
BUILD FAILED in 2m 9s
152 actionable tasks: 93 executed, 55 from cache, 4 up-to-date
Publishing build scan...
https://gradle.com/s/y4xtdt2igq6km
Build step 'Invoke Gradle script' changed build result to FAILURE
Build step 'Invoke Gradle script' marked build as failure
---------------------------------------------------------------------
To unsubscribe, e-mail: builds-unsubscribe@beam.apache.org
For additional commands, e-mail: builds-help@beam.apache.org
Jenkins build is back to normal : beam_PerformanceTests_Kafka_IO #3623
Posted by Apache Jenkins Server <je...@builds.apache.org>.
See <https://ci-beam.apache.org/job/beam_PerformanceTests_Kafka_IO/3623/display/redirect?page=changes>
---------------------------------------------------------------------
To unsubscribe, e-mail: builds-unsubscribe@beam.apache.org
For additional commands, e-mail: builds-help@beam.apache.org
Build failed in Jenkins: beam_PerformanceTests_Kafka_IO #3622
Posted by Apache Jenkins Server <je...@builds.apache.org>.
See <https://ci-beam.apache.org/job/beam_PerformanceTests_Kafka_IO/3622/display/redirect?page=changes>
Changes:
[noreply] Fix beam.Row.__eq__ for rows with trailing columns (#23876)
[noreply] TFMA notebook showing ExtractEvaluateAndWriteResult Tranfsorm (#25381)
[noreply] Fix whitespace check (#25514)
[noreply] Add back links removed in #24744 (#25513)
[bvolpato] Fix pull_licenses_java returning 404 from opensource.org
[noreply] [#24789][prism] internal/jobservices metrics + tests (#25497)
[noreply] [Go SDK]: Allow SDF methods to have context param and error return value
[noreply] Move closing milestone out of PMC-only tasks (#25516)
[noreply] update GCP cloud libraries BOM to 26.8.0 (#25470)
[noreply] Fix interface{} in iter& emit type of DoFn in Go (#25203)
[noreply] Task #25064: Python SDK Data sampling implementation (#25093)
[noreply] Add support for all Java based portable runners to consume elements
[noreply] Swap Java SDK container to use eclipse-temurin as the base instead of
------------------------------------------
[...truncated 953.88 KB...]
INFO: Adding Calculate hashcode/Combine.perKey(Hashing)/Combine.GroupedValues as step s14
Feb 17, 2023 1:16:37 AM org.apache.beam.runners.dataflow.DataflowPipelineTranslator$Translator addStep
INFO: Adding Calculate hashcode/Values/Values/Map as step s15
Feb 17, 2023 1:16:37 AM org.apache.beam.runners.dataflow.DataflowPipelineTranslator$Translator addStep
INFO: Adding PAssert$0/GroupGlobally/Reify.Window/ParDo(Anonymous) as step s16
Feb 17, 2023 1:16:37 AM org.apache.beam.runners.dataflow.DataflowPipelineTranslator$Translator addStep
INFO: Adding PAssert$0/GroupGlobally/ParDo(ToSingletonIterables) as step s17
Feb 17, 2023 1:16:37 AM org.apache.beam.runners.dataflow.DataflowPipelineTranslator$Translator addStep
INFO: Adding PAssert$0/GroupGlobally/Create.Values/Read(CreateSource) as step s18
Feb 17, 2023 1:16:37 AM org.apache.beam.runners.dataflow.DataflowPipelineTranslator$Translator addStep
INFO: Adding PAssert$0/GroupGlobally/Flatten.PCollections as step s19
Feb 17, 2023 1:16:37 AM org.apache.beam.runners.dataflow.DataflowPipelineTranslator$Translator addStep
INFO: Adding PAssert$0/GroupGlobally/Window.Into()/Flatten.PCollections as step s20
Feb 17, 2023 1:16:37 AM org.apache.beam.runners.dataflow.DataflowPipelineTranslator$Translator addStep
INFO: Adding PAssert$0/GroupGlobally/WithKeys/AddKeys/Map as step s21
Feb 17, 2023 1:16:37 AM org.apache.beam.runners.dataflow.DataflowPipelineTranslator$Translator addStep
INFO: Adding PAssert$0/GroupGlobally/GroupByKey as step s22
Feb 17, 2023 1:16:37 AM org.apache.beam.runners.dataflow.DataflowPipelineTranslator$Translator addStep
INFO: Adding PAssert$0/GroupGlobally/Values/Values/Map as step s23
Feb 17, 2023 1:16:37 AM org.apache.beam.runners.dataflow.DataflowPipelineTranslator$Translator addStep
INFO: Adding PAssert$0/GroupGlobally/ParDo(Concat) as step s24
Feb 17, 2023 1:16:37 AM org.apache.beam.runners.dataflow.DataflowPipelineTranslator$Translator addStep
INFO: Adding PAssert$0/GetPane/Map as step s25
Feb 17, 2023 1:16:37 AM org.apache.beam.runners.dataflow.DataflowPipelineTranslator$Translator addStep
INFO: Adding PAssert$0/RunChecks as step s26
Feb 17, 2023 1:16:38 AM org.apache.beam.runners.dataflow.DataflowPipelineTranslator$Translator addStep
INFO: Adding PAssert$0/VerifyAssertions/ParDo(DefaultConclude) as step s27
Feb 17, 2023 1:16:38 AM org.apache.beam.runners.dataflow.DataflowRunner run
INFO: Dataflow SDK version: 2.46.0-SNAPSHOT
Feb 17, 2023 1:16:38 AM org.apache.beam.runners.dataflow.DataflowRunner run
INFO: To access the Dataflow monitoring console, please navigate to https://console.cloud.google.com/dataflow/jobs/us-central1/2023-02-16_17_16_38-15505842559555965781?project=apache-beam-testing
Feb 17, 2023 1:16:38 AM org.apache.beam.runners.dataflow.DataflowRunner run
INFO: Submitted job: 2023-02-16_17_16_38-15505842559555965781
Feb 17, 2023 1:16:38 AM org.apache.beam.runners.dataflow.DataflowRunner run
INFO: To cancel the job using the 'gcloud' tool, run:
> gcloud dataflow jobs --project=apache-beam-testing cancel --region=us-central1 2023-02-16_17_16_38-15505842559555965781
Feb 17, 2023 1:16:41 AM org.apache.beam.runners.dataflow.util.MonitoringUtil$LoggingHandler process
WARNING: 2023-02-17T01:16:41.267Z: The workflow name is not a valid Cloud Label. Labels applied to Cloud resources (such as GCE Instances) for monitoring will be labeled with this modified job name: kafkaioit0testkafkaioreadsandwritescorrectlyinbatch-jenkin-3oj7. For the best monitoring experience, please name your job with a valid Cloud Label. For details, see: https://cloud.google.com/compute/docs/labeling-resources#restrictions
Feb 17, 2023 1:17:00 AM org.apache.beam.runners.dataflow.util.MonitoringUtil$LoggingHandler process
INFO: 2023-02-17T01:17:00.411Z: Worker configuration: e2-standard-2 in us-central1-f.
Feb 17, 2023 1:17:02 AM org.apache.beam.runners.dataflow.util.MonitoringUtil$LoggingHandler process
INFO: 2023-02-17T01:17:01.768Z: Expanding CoGroupByKey operations into optimizable parts.
Feb 17, 2023 1:17:02 AM org.apache.beam.runners.dataflow.util.MonitoringUtil$LoggingHandler process
INFO: 2023-02-17T01:17:01.902Z: Expanding GroupByKey operations into optimizable parts.
Feb 17, 2023 1:17:02 AM org.apache.beam.runners.dataflow.util.MonitoringUtil$LoggingHandler process
INFO: 2023-02-17T01:17:01.943Z: Lifting ValueCombiningMappingFns into MergeBucketsMappingFns
Feb 17, 2023 1:17:04 AM org.apache.beam.runners.dataflow.util.MonitoringUtil$LoggingHandler process
INFO: 2023-02-17T01:17:02.105Z: Fusing adjacent ParDo, Read, Write, and Flatten operations
Feb 17, 2023 1:17:04 AM org.apache.beam.runners.dataflow.util.MonitoringUtil$LoggingHandler process
INFO: 2023-02-17T01:17:02.136Z: Elided trivial flatten
Feb 17, 2023 1:17:04 AM org.apache.beam.runners.dataflow.util.MonitoringUtil$LoggingHandler process
INFO: 2023-02-17T01:17:02.163Z: Unzipping flatten s19 for input s17.org.apache.beam.sdk.values.PCollection.<init>:405#e63ad18dfc139ac0
Feb 17, 2023 1:17:04 AM org.apache.beam.runners.dataflow.util.MonitoringUtil$LoggingHandler process
INFO: 2023-02-17T01:17:02.189Z: Fusing unzipped copy of PAssert$0/GroupGlobally/WithKeys/AddKeys/Map, through flatten PAssert$0/GroupGlobally/Flatten.PCollections, into producer PAssert$0/GroupGlobally/ParDo(ToSingletonIterables)
Feb 17, 2023 1:17:04 AM org.apache.beam.runners.dataflow.util.MonitoringUtil$LoggingHandler process
INFO: 2023-02-17T01:17:02.226Z: Fusing consumer PAssert$0/GroupGlobally/GroupByKey/Write into PAssert$0/GroupGlobally/GroupByKey/Reify
Feb 17, 2023 1:17:04 AM org.apache.beam.runners.dataflow.util.MonitoringUtil$LoggingHandler process
INFO: 2023-02-17T01:17:02.260Z: Fusing consumer PAssert$0/GroupGlobally/GroupByKey/GroupByWindow into PAssert$0/GroupGlobally/GroupByKey/Read
Feb 17, 2023 1:17:04 AM org.apache.beam.runners.dataflow.util.MonitoringUtil$LoggingHandler process
INFO: 2023-02-17T01:17:02.299Z: Fusing consumer PAssert$0/GroupGlobally/Values/Values/Map into PAssert$0/GroupGlobally/GroupByKey/GroupByWindow
Feb 17, 2023 1:17:04 AM org.apache.beam.runners.dataflow.util.MonitoringUtil$LoggingHandler process
INFO: 2023-02-17T01:17:02.334Z: Fusing consumer PAssert$0/GroupGlobally/ParDo(Concat) into PAssert$0/GroupGlobally/Values/Values/Map
Feb 17, 2023 1:17:04 AM org.apache.beam.runners.dataflow.util.MonitoringUtil$LoggingHandler process
INFO: 2023-02-17T01:17:02.357Z: Fusing consumer PAssert$0/GetPane/Map into PAssert$0/GroupGlobally/ParDo(Concat)
Feb 17, 2023 1:17:04 AM org.apache.beam.runners.dataflow.util.MonitoringUtil$LoggingHandler process
INFO: 2023-02-17T01:17:02.385Z: Fusing consumer PAssert$0/RunChecks into PAssert$0/GetPane/Map
Feb 17, 2023 1:17:04 AM org.apache.beam.runners.dataflow.util.MonitoringUtil$LoggingHandler process
INFO: 2023-02-17T01:17:02.414Z: Fusing consumer PAssert$0/VerifyAssertions/ParDo(DefaultConclude) into PAssert$0/RunChecks
Feb 17, 2023 1:17:04 AM org.apache.beam.runners.dataflow.util.MonitoringUtil$LoggingHandler process
INFO: 2023-02-17T01:17:02.456Z: Unzipping flatten s19-u40 for input s21.org.apache.beam.sdk.values.PCollection.<init>:405#24aa17775bf242ac-c38
Feb 17, 2023 1:17:04 AM org.apache.beam.runners.dataflow.util.MonitoringUtil$LoggingHandler process
INFO: 2023-02-17T01:17:02.483Z: Fusing unzipped copy of PAssert$0/GroupGlobally/GroupByKey/Reify, through flatten PAssert$0/GroupGlobally/Flatten.PCollections/Unzipped-1, into producer PAssert$0/GroupGlobally/WithKeys/AddKeys/Map
Feb 17, 2023 1:17:04 AM org.apache.beam.runners.dataflow.util.MonitoringUtil$LoggingHandler process
INFO: 2023-02-17T01:17:02.517Z: Fusing consumer Read from bounded Kafka/KafkaIO.Read.ReadFromKafkaViaUnbounded/Read(KafkaUnboundedSource)/Split into Read from bounded Kafka/KafkaIO.Read.ReadFromKafkaViaUnbounded/Read(KafkaUnboundedSource)/Create/Read(CreateSource)
Feb 17, 2023 1:17:04 AM org.apache.beam.runners.dataflow.util.MonitoringUtil$LoggingHandler process
INFO: 2023-02-17T01:17:02.549Z: Fusing consumer Read from bounded Kafka/KafkaIO.Read.ReadFromKafkaViaUnbounded/Read(KafkaUnboundedSource)/Reshuffle/Pair with random key into Read from bounded Kafka/KafkaIO.Read.ReadFromKafkaViaUnbounded/Read(KafkaUnboundedSource)/Split
Feb 17, 2023 1:17:04 AM org.apache.beam.runners.dataflow.util.MonitoringUtil$LoggingHandler process
INFO: 2023-02-17T01:17:02.583Z: Fusing consumer Read from bounded Kafka/KafkaIO.Read.ReadFromKafkaViaUnbounded/Read(KafkaUnboundedSource)/Reshuffle/Reshuffle/Window.Into()/Window.Assign into Read from bounded Kafka/KafkaIO.Read.ReadFromKafkaViaUnbounded/Read(KafkaUnboundedSource)/Reshuffle/Pair with random key
Feb 17, 2023 1:17:04 AM org.apache.beam.runners.dataflow.util.MonitoringUtil$LoggingHandler process
INFO: 2023-02-17T01:17:02.619Z: Fusing consumer Read from bounded Kafka/KafkaIO.Read.ReadFromKafkaViaUnbounded/Read(KafkaUnboundedSource)/Reshuffle/Reshuffle/GroupByKey/Reify into Read from bounded Kafka/KafkaIO.Read.ReadFromKafkaViaUnbounded/Read(KafkaUnboundedSource)/Reshuffle/Reshuffle/Window.Into()/Window.Assign
Feb 17, 2023 1:17:04 AM org.apache.beam.runners.dataflow.util.MonitoringUtil$LoggingHandler process
INFO: 2023-02-17T01:17:02.653Z: Fusing consumer Read from bounded Kafka/KafkaIO.Read.ReadFromKafkaViaUnbounded/Read(KafkaUnboundedSource)/Reshuffle/Reshuffle/GroupByKey/Write into Read from bounded Kafka/KafkaIO.Read.ReadFromKafkaViaUnbounded/Read(KafkaUnboundedSource)/Reshuffle/Reshuffle/GroupByKey/Reify
Feb 17, 2023 1:17:04 AM org.apache.beam.runners.dataflow.util.MonitoringUtil$LoggingHandler process
INFO: 2023-02-17T01:17:02.678Z: Fusing consumer Read from bounded Kafka/KafkaIO.Read.ReadFromKafkaViaUnbounded/Read(KafkaUnboundedSource)/Reshuffle/Reshuffle/GroupByKey/GroupByWindow into Read from bounded Kafka/KafkaIO.Read.ReadFromKafkaViaUnbounded/Read(KafkaUnboundedSource)/Reshuffle/Reshuffle/GroupByKey/Read
Feb 17, 2023 1:17:04 AM org.apache.beam.runners.dataflow.util.MonitoringUtil$LoggingHandler process
INFO: 2023-02-17T01:17:02.711Z: Fusing consumer Read from bounded Kafka/KafkaIO.Read.ReadFromKafkaViaUnbounded/Read(KafkaUnboundedSource)/Reshuffle/Reshuffle/ExpandIterable into Read from bounded Kafka/KafkaIO.Read.ReadFromKafkaViaUnbounded/Read(KafkaUnboundedSource)/Reshuffle/Reshuffle/GroupByKey/GroupByWindow
Feb 17, 2023 1:17:04 AM org.apache.beam.runners.dataflow.util.MonitoringUtil$LoggingHandler process
INFO: 2023-02-17T01:17:02.746Z: Fusing consumer Read from bounded Kafka/KafkaIO.Read.ReadFromKafkaViaUnbounded/Read(KafkaUnboundedSource)/Reshuffle/Values/Values/Map into Read from bounded Kafka/KafkaIO.Read.ReadFromKafkaViaUnbounded/Read(KafkaUnboundedSource)/Reshuffle/Reshuffle/ExpandIterable
Feb 17, 2023 1:17:04 AM org.apache.beam.runners.dataflow.util.MonitoringUtil$LoggingHandler process
INFO: 2023-02-17T01:17:02.782Z: Fusing consumer Read from bounded Kafka/KafkaIO.Read.ReadFromKafkaViaUnbounded/Read(KafkaUnboundedSource)/Read into Read from bounded Kafka/KafkaIO.Read.ReadFromKafkaViaUnbounded/Read(KafkaUnboundedSource)/Reshuffle/Values/Values/Map
Feb 17, 2023 1:17:04 AM org.apache.beam.runners.dataflow.util.MonitoringUtil$LoggingHandler process
INFO: 2023-02-17T01:17:02.809Z: Fusing consumer Read from bounded Kafka/KafkaIO.Read.ReadFromKafkaViaUnbounded/Read(KafkaUnboundedSource)/StripIds into Read from bounded Kafka/KafkaIO.Read.ReadFromKafkaViaUnbounded/Read(KafkaUnboundedSource)/Read
Feb 17, 2023 1:17:04 AM org.apache.beam.runners.dataflow.util.MonitoringUtil$LoggingHandler process
INFO: 2023-02-17T01:17:02.839Z: Fusing consumer Measure read time into Read from bounded Kafka/KafkaIO.Read.ReadFromKafkaViaUnbounded/Read(KafkaUnboundedSource)/StripIds
Feb 17, 2023 1:17:04 AM org.apache.beam.runners.dataflow.util.MonitoringUtil$LoggingHandler process
INFO: 2023-02-17T01:17:02.868Z: Fusing consumer Map records to strings/Map into Measure read time
Feb 17, 2023 1:17:04 AM org.apache.beam.runners.dataflow.util.MonitoringUtil$LoggingHandler process
INFO: 2023-02-17T01:17:02.902Z: Fusing consumer Calculate hashcode/WithKeys/AddKeys/Map into Map records to strings/Map
Feb 17, 2023 1:17:04 AM org.apache.beam.runners.dataflow.util.MonitoringUtil$LoggingHandler process
INFO: 2023-02-17T01:17:02.930Z: Fusing consumer Calculate hashcode/Combine.perKey(Hashing)/GroupByKey+Calculate hashcode/Combine.perKey(Hashing)/Combine.GroupedValues/Partial into Calculate hashcode/WithKeys/AddKeys/Map
Feb 17, 2023 1:17:04 AM org.apache.beam.runners.dataflow.util.MonitoringUtil$LoggingHandler process
INFO: 2023-02-17T01:17:02.963Z: Fusing consumer Calculate hashcode/Combine.perKey(Hashing)/GroupByKey/Reify into Calculate hashcode/Combine.perKey(Hashing)/GroupByKey+Calculate hashcode/Combine.perKey(Hashing)/Combine.GroupedValues/Partial
Feb 17, 2023 1:17:04 AM org.apache.beam.runners.dataflow.util.MonitoringUtil$LoggingHandler process
INFO: 2023-02-17T01:17:02.986Z: Fusing consumer Calculate hashcode/Combine.perKey(Hashing)/GroupByKey/Write into Calculate hashcode/Combine.perKey(Hashing)/GroupByKey/Reify
Feb 17, 2023 1:17:04 AM org.apache.beam.runners.dataflow.util.MonitoringUtil$LoggingHandler process
INFO: 2023-02-17T01:17:03.009Z: Fusing consumer Calculate hashcode/Combine.perKey(Hashing)/Combine.GroupedValues into Calculate hashcode/Combine.perKey(Hashing)/GroupByKey/Read
Feb 17, 2023 1:17:04 AM org.apache.beam.runners.dataflow.util.MonitoringUtil$LoggingHandler process
INFO: 2023-02-17T01:17:03.047Z: Fusing consumer Calculate hashcode/Combine.perKey(Hashing)/Combine.GroupedValues/Extract into Calculate hashcode/Combine.perKey(Hashing)/Combine.GroupedValues
Feb 17, 2023 1:17:04 AM org.apache.beam.runners.dataflow.util.MonitoringUtil$LoggingHandler process
INFO: 2023-02-17T01:17:03.078Z: Fusing consumer Calculate hashcode/Values/Values/Map into Calculate hashcode/Combine.perKey(Hashing)/Combine.GroupedValues/Extract
Feb 17, 2023 1:17:04 AM org.apache.beam.runners.dataflow.util.MonitoringUtil$LoggingHandler process
INFO: 2023-02-17T01:17:03.109Z: Fusing consumer PAssert$0/GroupGlobally/Reify.Window/ParDo(Anonymous) into Calculate hashcode/Values/Values/Map
Feb 17, 2023 1:17:04 AM org.apache.beam.runners.dataflow.util.MonitoringUtil$LoggingHandler process
INFO: 2023-02-17T01:17:03.143Z: Fusing consumer PAssert$0/GroupGlobally/ParDo(ToSingletonIterables) into PAssert$0/GroupGlobally/Reify.Window/ParDo(Anonymous)
Feb 17, 2023 1:17:04 AM org.apache.beam.runners.dataflow.util.MonitoringUtil$LoggingHandler process
INFO: 2023-02-17T01:17:03.180Z: Fusing consumer PAssert$0/GroupGlobally/WithKeys/AddKeys/Map into PAssert$0/GroupGlobally/Create.Values/Read(CreateSource)
Feb 17, 2023 1:17:04 AM org.apache.beam.runners.dataflow.util.MonitoringUtil$LoggingHandler process
INFO: 2023-02-17T01:17:03.218Z: Fusing consumer PAssert$0/GroupGlobally/GroupByKey/Reify into PAssert$0/GroupGlobally/WithKeys/AddKeys/Map
Feb 17, 2023 1:17:04 AM org.apache.beam.runners.dataflow.util.MonitoringUtil$LoggingHandler process
INFO: 2023-02-17T01:17:03.584Z: Executing operation Read from bounded Kafka/KafkaIO.Read.ReadFromKafkaViaUnbounded/Read(KafkaUnboundedSource)/Reshuffle/Reshuffle/GroupByKey/Create
Feb 17, 2023 1:17:04 AM org.apache.beam.runners.dataflow.util.MonitoringUtil$LoggingHandler process
INFO: 2023-02-17T01:17:03.673Z: Starting 5 ****s in us-central1-f...
Feb 17, 2023 1:17:04 AM org.apache.beam.runners.dataflow.util.MonitoringUtil$LoggingHandler process
INFO: 2023-02-17T01:17:03.964Z: Finished operation Read from bounded Kafka/KafkaIO.Read.ReadFromKafkaViaUnbounded/Read(KafkaUnboundedSource)/Reshuffle/Reshuffle/GroupByKey/Create
Feb 17, 2023 1:17:04 AM org.apache.beam.runners.dataflow.util.MonitoringUtil$LoggingHandler process
INFO: 2023-02-17T01:17:04.125Z: Executing operation Read from bounded Kafka/KafkaIO.Read.ReadFromKafkaViaUnbounded/Read(KafkaUnboundedSource)/Create/Read(CreateSource)+Read from bounded Kafka/KafkaIO.Read.ReadFromKafkaViaUnbounded/Read(KafkaUnboundedSource)/Split+Read from bounded Kafka/KafkaIO.Read.ReadFromKafkaViaUnbounded/Read(KafkaUnboundedSource)/Reshuffle/Pair with random key+Read from bounded Kafka/KafkaIO.Read.ReadFromKafkaViaUnbounded/Read(KafkaUnboundedSource)/Reshuffle/Reshuffle/Window.Into()/Window.Assign+Read from bounded Kafka/KafkaIO.Read.ReadFromKafkaViaUnbounded/Read(KafkaUnboundedSource)/Reshuffle/Reshuffle/GroupByKey/Reify+Read from bounded Kafka/KafkaIO.Read.ReadFromKafkaViaUnbounded/Read(KafkaUnboundedSource)/Reshuffle/Reshuffle/GroupByKey/Write
Feb 17, 2023 1:17:19 AM org.apache.beam.runners.dataflow.util.MonitoringUtil$LoggingHandler process
INFO: 2023-02-17T01:17:18.552Z: Your project already contains 100 Dataflow-created metric descriptors, so new user metrics of the form custom.googleapis.com/* will not be created. However, all user metrics are also available in the metric dataflow.googleapis.com/job/user_counter. If you rely on the custom metrics, you can delete old / unused metric descriptors. See https://developers.google.com/apis-explorer/#p/monitoring/v3/monitoring.projects.metricDescriptors.list and https://developers.google.com/apis-explorer/#p/monitoring/v3/monitoring.projects.metricDescriptors.delete
Feb 17, 2023 1:17:43 AM org.apache.beam.runners.dataflow.util.MonitoringUtil$LoggingHandler process
INFO: 2023-02-17T01:17:43.524Z: Autoscaling: Raised the number of ****s to 5 based on the rate of progress in the currently running stage(s).
Feb 17, 2023 1:18:16 AM org.apache.beam.runners.dataflow.util.MonitoringUtil$LoggingHandler process
INFO: 2023-02-17T01:18:15.435Z: Workers have started successfully.
Feb 17, 2023 1:18:35 AM org.apache.beam.runners.dataflow.util.MonitoringUtil$LoggingHandler process
INFO: 2023-02-17T01:18:34.965Z: All ****s have finished the startup processes and began to receive work requests.
Feb 17, 2023 1:18:41 AM org.apache.beam.runners.dataflow.util.MonitoringUtil$LoggingHandler process
INFO: 2023-02-17T01:18:39.197Z: Finished operation Read from bounded Kafka/KafkaIO.Read.ReadFromKafkaViaUnbounded/Read(KafkaUnboundedSource)/Create/Read(CreateSource)+Read from bounded Kafka/KafkaIO.Read.ReadFromKafkaViaUnbounded/Read(KafkaUnboundedSource)/Split+Read from bounded Kafka/KafkaIO.Read.ReadFromKafkaViaUnbounded/Read(KafkaUnboundedSource)/Reshuffle/Pair with random key+Read from bounded Kafka/KafkaIO.Read.ReadFromKafkaViaUnbounded/Read(KafkaUnboundedSource)/Reshuffle/Reshuffle/Window.Into()/Window.Assign+Read from bounded Kafka/KafkaIO.Read.ReadFromKafkaViaUnbounded/Read(KafkaUnboundedSource)/Reshuffle/Reshuffle/GroupByKey/Reify+Read from bounded Kafka/KafkaIO.Read.ReadFromKafkaViaUnbounded/Read(KafkaUnboundedSource)/Reshuffle/Reshuffle/GroupByKey/Write
Feb 17, 2023 1:18:41 AM org.apache.beam.runners.dataflow.util.MonitoringUtil$LoggingHandler process
INFO: 2023-02-17T01:18:39.305Z: Executing operation Read from bounded Kafka/KafkaIO.Read.ReadFromKafkaViaUnbounded/Read(KafkaUnboundedSource)/Reshuffle/Reshuffle/GroupByKey/Close
Feb 17, 2023 1:18:41 AM org.apache.beam.runners.dataflow.util.MonitoringUtil$LoggingHandler process
INFO: 2023-02-17T01:18:39.529Z: Finished operation Read from bounded Kafka/KafkaIO.Read.ReadFromKafkaViaUnbounded/Read(KafkaUnboundedSource)/Reshuffle/Reshuffle/GroupByKey/Close
Feb 17, 2023 1:18:41 AM org.apache.beam.runners.dataflow.util.MonitoringUtil$LoggingHandler process
INFO: 2023-02-17T01:18:39.665Z: Executing operation Calculate hashcode/Combine.perKey(Hashing)/GroupByKey/Create
Feb 17, 2023 1:18:41 AM org.apache.beam.runners.dataflow.util.MonitoringUtil$LoggingHandler process
INFO: 2023-02-17T01:18:39.815Z: Finished operation Calculate hashcode/Combine.perKey(Hashing)/GroupByKey/Create
Feb 17, 2023 1:18:41 AM org.apache.beam.runners.dataflow.util.MonitoringUtil$LoggingHandler process
INFO: 2023-02-17T01:18:40.039Z: Executing operation Read from bounded Kafka/KafkaIO.Read.ReadFromKafkaViaUnbounded/Read(KafkaUnboundedSource)/Reshuffle/Reshuffle/GroupByKey/Read+Read from bounded Kafka/KafkaIO.Read.ReadFromKafkaViaUnbounded/Read(KafkaUnboundedSource)/Reshuffle/Reshuffle/GroupByKey/GroupByWindow+Read from bounded Kafka/KafkaIO.Read.ReadFromKafkaViaUnbounded/Read(KafkaUnboundedSource)/Reshuffle/Reshuffle/ExpandIterable+Read from bounded Kafka/KafkaIO.Read.ReadFromKafkaViaUnbounded/Read(KafkaUnboundedSource)/Reshuffle/Values/Values/Map+Read from bounded Kafka/KafkaIO.Read.ReadFromKafkaViaUnbounded/Read(KafkaUnboundedSource)/Read+Read from bounded Kafka/KafkaIO.Read.ReadFromKafkaViaUnbounded/Read(KafkaUnboundedSource)/StripIds+Measure read time+Map records to strings/Map+Calculate hashcode/WithKeys/AddKeys/Map+Calculate hashcode/Combine.perKey(Hashing)/GroupByKey+Calculate hashcode/Combine.perKey(Hashing)/Combine.GroupedValues/Partial+Calculate hashcode/Combine.perKey(Hashing)/GroupByKey/Reify+Calculate hashcode/Combine.perKey(Hashing)/GroupByKey/Write
Feb 17, 2023 1:46:38 AM org.apache.beam.runners.dataflow.DataflowPipelineJob waitUntilFinish
WARNING: No terminal state was returned within allotted timeout. State value RUNNING
Feb 17, 2023 1:46:38 AM org.apache.kafka.common.config.AbstractConfig logAll
INFO: AdminClientConfig values:
bootstrap.servers = [34.170.175.61:32401, 34.172.49.28:32402, 35.239.103.51:32403]
client.dns.lookup = default
client.id =
connections.max.idle.ms = 300000
metadata.max.age.ms = 300000
metric.reporters = []
metrics.num.samples = 2
metrics.recording.level = INFO
metrics.sample.window.ms = 30000
receive.buffer.bytes = 65536
reconnect.backoff.max.ms = 1000
reconnect.backoff.ms = 50
request.timeout.ms = 120000
retries = 5
retry.backoff.ms = 100
sasl.client.callback.handler.class = null
sasl.jaas.config = null
sasl.kerberos.kinit.cmd = /usr/bin/kinit
sasl.kerberos.min.time.before.relogin = 60000
sasl.kerberos.service.name = null
sasl.kerberos.ticket.renew.jitter = 0.05
sasl.kerberos.ticket.renew.window.factor = 0.8
sasl.login.callback.handler.class = null
sasl.login.class = null
sasl.login.refresh.buffer.seconds = 300
sasl.login.refresh.min.period.seconds = 60
sasl.login.refresh.window.factor = 0.8
sasl.login.refresh.window.jitter = 0.05
sasl.mechanism = GSSAPI
security.protocol = PLAINTEXT
security.providers = null
send.buffer.bytes = 131072
ssl.cipher.suites = null
ssl.enabled.protocols = [TLSv1.2, TLSv1.1, TLSv1]
ssl.endpoint.identification.algorithm = https
ssl.key.password = null
ssl.keymanager.algorithm = SunX509
ssl.keystore.location = null
ssl.keystore.password = null
ssl.keystore.type = JKS
ssl.protocol = TLS
ssl.provider = null
ssl.secure.random.implementation = null
ssl.trustmanager.algorithm = PKIX
ssl.truststore.location = null
ssl.truststore.password = null
ssl.truststore.type = JKS
Feb 17, 2023 1:46:38 AM org.apache.kafka.common.utils.AppInfoParser$AppInfo <init>
INFO: Kafka version: 2.4.1
Feb 17, 2023 1:46:38 AM org.apache.kafka.common.utils.AppInfoParser$AppInfo <init>
INFO: Kafka commitId: c57222ae8cd7866b
Feb 17, 2023 1:46:38 AM org.apache.kafka.common.utils.AppInfoParser$AppInfo <init>
INFO: Kafka startTimeMs: 1676598398906
Gradle Test Executor 1 finished executing tests.
> Task :sdks:java:io:kafka:integrationTest FAILED
org.apache.beam.sdk.io.kafka.KafkaIOIT > testKafkaIOReadsAndWritesCorrectlyInBatch FAILED
java.lang.AssertionError: expected:<DONE> but was:<null>
at org.junit.Assert.fail(Assert.java:89)
at org.junit.Assert.failNotEquals(Assert.java:835)
at org.junit.Assert.assertEquals(Assert.java:120)
at org.junit.Assert.assertEquals(Assert.java:146)
at org.apache.beam.sdk.io.kafka.KafkaIOIT.testKafkaIOReadsAndWritesCorrectlyInBatch(KafkaIOIT.java:275)
1 test completed, 1 failed
Finished generating test XML results (0.055 secs) into: <https://ci-beam.apache.org/job/beam_PerformanceTests_Kafka_IO/ws/src/sdks/java/io/kafka/build/test-results/integrationTest>
Generating HTML test report...
Finished generating test html results (0.092 secs) into: <https://ci-beam.apache.org/job/beam_PerformanceTests_Kafka_IO/ws/src/sdks/java/io/kafka/build/reports/tests/integrationTest>
:sdks:java:io:kafka:integrationTest (Thread[Execution **** Thread 7,5,main]) completed. Took 37 mins 37.852 secs.
FAILURE: Build failed with an exception.
* What went wrong:
Execution failed for task ':sdks:java:io:kafka:integrationTest'.
> There were failing tests. See the report at: file://<https://ci-beam.apache.org/job/beam_PerformanceTests_Kafka_IO/ws/src/sdks/java/io/kafka/build/reports/tests/integrationTest/index.html>
* Try:
> Run with --stacktrace option to get the stack trace.
> Run with --debug option to get more log output.
* Get more help at https://help.gradle.org
Deprecated Gradle features were used in this build, making it incompatible with Gradle 8.0.
You can use '--warning-mode all' to show the individual deprecation warnings and determine if they come from your own scripts or plugins.
See https://docs.gradle.org/7.5.1/userguide/command_line_interface.html#sec:command_line_warnings
BUILD FAILED in 38m
137 actionable tasks: 1 executed, 136 up-to-date
Publishing build scan...
https://gradle.com/s/xrw23fge2or7a
Build step 'Invoke Gradle script' changed build result to FAILURE
Build step 'Invoke Gradle script' marked build as failure
---------------------------------------------------------------------
To unsubscribe, e-mail: builds-unsubscribe@beam.apache.org
For additional commands, e-mail: builds-help@beam.apache.org
Build failed in Jenkins: beam_PerformanceTests_Kafka_IO #3621
Posted by Apache Jenkins Server <je...@builds.apache.org>.
See <https://ci-beam.apache.org/job/beam_PerformanceTests_Kafka_IO/3621/display/redirect>
Changes:
------------------------------------------
[...truncated 792.70 KB...]
File "/usr/lib/python3.8/urllib/request.py", line 755, in http_error_302
return self.parent.open(new, timeout=req.timeout)
File "/usr/lib/python3.8/urllib/request.py", line 531, in open
response = meth(req, response)
File "/usr/lib/python3.8/urllib/request.py", line 640, in http_response
response = self.parent.error(
File "/usr/lib/python3.8/urllib/request.py", line 563, in error
result = self._call_chain(*args)
File "/usr/lib/python3.8/urllib/request.py", line 502, in _call_chain
result = func(*args)
File "/usr/lib/python3.8/urllib/request.py", line 755, in http_error_302
return self.parent.open(new, timeout=req.timeout)
File "/usr/lib/python3.8/urllib/request.py", line 531, in open
response = meth(req, response)
File "/usr/lib/python3.8/urllib/request.py", line 640, in http_response
response = self.parent.error(
File "/usr/lib/python3.8/urllib/request.py", line 569, in error
return self._call_chain(*args)
File "/usr/lib/python3.8/urllib/request.py", line 502, in _call_chain
result = func(*args)
File "/usr/lib/python3.8/urllib/request.py", line 649, in http_error_default
raise HTTPError(req.full_url, code, msg, hdrs, fp)
urllib.error.HTTPError: HTTP Error 404: Not Found
ERROR:root:Invalid url for minlog-1.2: http://www.opensource.org/licenses/bsd-license.php after 9 retries.
Traceback (most recent call last):
File "<https://ci-beam.apache.org/job/beam_PerformanceTests_Kafka_IO/ws/src/sdks/java/container/license_scripts/pull_licenses_java.py",> line 58, in pull_from_url
url_read = urlopen(Request(url, headers={
File "/usr/lib/python3.8/urllib/request.py", line 222, in urlopen
return opener.open(url, data, timeout)
File "/usr/lib/python3.8/urllib/request.py", line 531, in open
response = meth(req, response)
File "/usr/lib/python3.8/urllib/request.py", line 640, in http_response
response = self.parent.error(
File "/usr/lib/python3.8/urllib/request.py", line 563, in error
result = self._call_chain(*args)
File "/usr/lib/python3.8/urllib/request.py", line 502, in _call_chain
result = func(*args)
File "/usr/lib/python3.8/urllib/request.py", line 755, in http_error_302
return self.parent.open(new, timeout=req.timeout)
File "/usr/lib/python3.8/urllib/request.py", line 531, in open
response = meth(req, response)
File "/usr/lib/python3.8/urllib/request.py", line 640, in http_response
response = self.parent.error(
File "/usr/lib/python3.8/urllib/request.py", line 563, in error
result = self._call_chain(*args)
File "/usr/lib/python3.8/urllib/request.py", line 502, in _call_chain
result = func(*args)
File "/usr/lib/python3.8/urllib/request.py", line 755, in http_error_302
return self.parent.open(new, timeout=req.timeout)
File "/usr/lib/python3.8/urllib/request.py", line 531, in open
response = meth(req, response)
File "/usr/lib/python3.8/urllib/request.py", line 640, in http_response
response = self.parent.error(
File "/usr/lib/python3.8/urllib/request.py", line 569, in error
return self._call_chain(*args)
File "/usr/lib/python3.8/urllib/request.py", line 502, in _call_chain
result = func(*args)
File "/usr/lib/python3.8/urllib/request.py", line 649, in http_error_default
raise HTTPError(req.full_url, code, msg, hdrs, fp)
urllib.error.HTTPError: HTTP Error 404: Not Found
ERROR:root:Invalid url for junit-quickcheck-generators-1.0: http://www.opensource.org/licenses/mit-license.php after 9 retries.
Traceback (most recent call last):
File "<https://ci-beam.apache.org/job/beam_PerformanceTests_Kafka_IO/ws/src/sdks/java/container/license_scripts/pull_licenses_java.py",> line 58, in pull_from_url
url_read = urlopen(Request(url, headers={
File "/usr/lib/python3.8/urllib/request.py", line 222, in urlopen
return opener.open(url, data, timeout)
File "/usr/lib/python3.8/urllib/request.py", line 531, in open
response = meth(req, response)
File "/usr/lib/python3.8/urllib/request.py", line 640, in http_response
response = self.parent.error(
File "/usr/lib/python3.8/urllib/request.py", line 563, in error
result = self._call_chain(*args)
File "/usr/lib/python3.8/urllib/request.py", line 502, in _call_chain
result = func(*args)
File "/usr/lib/python3.8/urllib/request.py", line 755, in http_error_302
return self.parent.open(new, timeout=req.timeout)
File "/usr/lib/python3.8/urllib/request.py", line 531, in open
response = meth(req, response)
File "/usr/lib/python3.8/urllib/request.py", line 640, in http_response
response = self.parent.error(
File "/usr/lib/python3.8/urllib/request.py", line 563, in error
result = self._call_chain(*args)
File "/usr/lib/python3.8/urllib/request.py", line 502, in _call_chain
result = func(*args)
File "/usr/lib/python3.8/urllib/request.py", line 755, in http_error_302
return self.parent.open(new, timeout=req.timeout)
File "/usr/lib/python3.8/urllib/request.py", line 531, in open
response = meth(req, response)
File "/usr/lib/python3.8/urllib/request.py", line 640, in http_response
response = self.parent.error(
File "/usr/lib/python3.8/urllib/request.py", line 569, in error
return self._call_chain(*args)
File "/usr/lib/python3.8/urllib/request.py", line 502, in _call_chain
result = func(*args)
File "/usr/lib/python3.8/urllib/request.py", line 649, in http_error_default
raise HTTPError(req.full_url, code, msg, hdrs, fp)
urllib.error.HTTPError: HTTP Error 404: Not Found
ERROR:root:Invalid url for slf4j-simple-1.7.30: http://www.opensource.org/licenses/mit-license.php after 9 retries.
Traceback (most recent call last):
File "<https://ci-beam.apache.org/job/beam_PerformanceTests_Kafka_IO/ws/src/sdks/java/container/license_scripts/pull_licenses_java.py",> line 58, in pull_from_url
url_read = urlopen(Request(url, headers={
File "/usr/lib/python3.8/urllib/request.py", line 222, in urlopen
return opener.open(url, data, timeout)
File "/usr/lib/python3.8/urllib/request.py", line 531, in open
response = meth(req, response)
File "/usr/lib/python3.8/urllib/request.py", line 640, in http_response
response = self.parent.error(
File "/usr/lib/python3.8/urllib/request.py", line 563, in error
result = self._call_chain(*args)
File "/usr/lib/python3.8/urllib/request.py", line 502, in _call_chain
result = func(*args)
File "/usr/lib/python3.8/urllib/request.py", line 755, in http_error_302
return self.parent.open(new, timeout=req.timeout)
File "/usr/lib/python3.8/urllib/request.py", line 531, in open
response = meth(req, response)
File "/usr/lib/python3.8/urllib/request.py", line 640, in http_response
response = self.parent.error(
File "/usr/lib/python3.8/urllib/request.py", line 563, in error
result = self._call_chain(*args)
File "/usr/lib/python3.8/urllib/request.py", line 502, in _call_chain
result = func(*args)
File "/usr/lib/python3.8/urllib/request.py", line 755, in http_error_302
return self.parent.open(new, timeout=req.timeout)
File "/usr/lib/python3.8/urllib/request.py", line 531, in open
response = meth(req, response)
File "/usr/lib/python3.8/urllib/request.py", line 640, in http_response
response = self.parent.error(
File "/usr/lib/python3.8/urllib/request.py", line 569, in error
return self._call_chain(*args)
File "/usr/lib/python3.8/urllib/request.py", line 502, in _call_chain
result = func(*args)
File "/usr/lib/python3.8/urllib/request.py", line 649, in http_error_default
raise HTTPError(req.full_url, code, msg, hdrs, fp)
urllib.error.HTTPError: HTTP Error 404: Not Found
ERROR:root:Invalid url for slf4j-api-1.7.35: http://www.opensource.org/licenses/mit-license.php after 9 retries.
Traceback (most recent call last):
File "<https://ci-beam.apache.org/job/beam_PerformanceTests_Kafka_IO/ws/src/sdks/java/container/license_scripts/pull_licenses_java.py",> line 58, in pull_from_url
url_read = urlopen(Request(url, headers={
File "/usr/lib/python3.8/urllib/request.py", line 222, in urlopen
return opener.open(url, data, timeout)
File "/usr/lib/python3.8/urllib/request.py", line 531, in open
response = meth(req, response)
File "/usr/lib/python3.8/urllib/request.py", line 640, in http_response
response = self.parent.error(
File "/usr/lib/python3.8/urllib/request.py", line 563, in error
result = self._call_chain(*args)
File "/usr/lib/python3.8/urllib/request.py", line 502, in _call_chain
result = func(*args)
File "/usr/lib/python3.8/urllib/request.py", line 755, in http_error_302
return self.parent.open(new, timeout=req.timeout)
File "/usr/lib/python3.8/urllib/request.py", line 531, in open
response = meth(req, response)
File "/usr/lib/python3.8/urllib/request.py", line 640, in http_response
response = self.parent.error(
File "/usr/lib/python3.8/urllib/request.py", line 563, in error
result = self._call_chain(*args)
File "/usr/lib/python3.8/urllib/request.py", line 502, in _call_chain
result = func(*args)
File "/usr/lib/python3.8/urllib/request.py", line 755, in http_error_302
return self.parent.open(new, timeout=req.timeout)
File "/usr/lib/python3.8/urllib/request.py", line 531, in open
response = meth(req, response)
File "/usr/lib/python3.8/urllib/request.py", line 640, in http_response
response = self.parent.error(
File "/usr/lib/python3.8/urllib/request.py", line 569, in error
return self._call_chain(*args)
File "/usr/lib/python3.8/urllib/request.py", line 502, in _call_chain
result = func(*args)
File "/usr/lib/python3.8/urllib/request.py", line 649, in http_error_default
raise HTTPError(req.full_url, code, msg, hdrs, fp)
urllib.error.HTTPError: HTTP Error 404: Not Found
ERROR:root:Invalid url for log4j-over-slf4j-1.7.30: http://www.opensource.org/licenses/mit-license.php after 9 retries.
ERROR:root:['software-and-algorithms-1.0', 'kryo-2.21', 'reflectasm-1.07', 'junit-quickcheck-core-1.0', 'slf4j-jdk14-1.7.30', 'slf4j-api-1.7.30', 'pcollections-2.1.2', 'jcl-over-slf4j-1.7.30', 'minlog-1.2', 'junit-quickcheck-generators-1.0', 'slf4j-simple-1.7.30', 'slf4j-api-1.7.35', 'log4j-over-slf4j-1.7.30']
ERROR:root:**************************************** Licenses were not able to be pulled automatically for some dependencies. Please search source code of the dependencies on the internet and add "license" and "notice" (if available) field to <https://ci-beam.apache.org/job/beam_PerformanceTests_Kafka_IO/ws/src/sdks/java/container/license_scripts/dep_urls_java.yaml> for each missing license. Dependency List: [jcl-over-slf4j-1.7.30,junit-quickcheck-core-1.0,junit-quickcheck-generators-1.0,kryo-2.21,log4j-over-slf4j-1.7.30,minlog-1.2,pcollections-2.1.2,reflectasm-1.07,slf4j-api-1.7.30,slf4j-api-1.7.35,slf4j-jdk14-1.7.30,slf4j-simple-1.7.30,software-and-algorithms-1.0]
INFO:root:pull_licenses_java.py failed. It took 88.85278 seconds with 16 threads.
Traceback (most recent call last):
File "<https://ci-beam.apache.org/job/beam_PerformanceTests_Kafka_IO/ws/src/sdks/java/container/license_scripts/pull_licenses_java.py",> line 326, in <module>
raise RuntimeError('{n} error(s) occurred.'.format(n=len(error_msg)),
RuntimeError: ('1 error(s) occurred.', ['**************************************** Licenses were not able to be pulled automatically for some dependencies. Please search source code of the dependencies on the internet and add "license" and "notice" (if available) field to <https://ci-beam.apache.org/job/beam_PerformanceTests_Kafka_IO/ws/src/sdks/java/container/license_scripts/dep_urls_java.yaml> for each missing license. Dependency List: [jcl-over-slf4j-1.7.30,junit-quickcheck-core-1.0,junit-quickcheck-generators-1.0,kryo-2.21,log4j-over-slf4j-1.7.30,minlog-1.2,pcollections-2.1.2,reflectasm-1.07,slf4j-api-1.7.30,slf4j-api-1.7.35,slf4j-jdk14-1.7.30,slf4j-simple-1.7.30,software-and-algorithms-1.0]'])
> Task :sdks:java:container:pullLicenses FAILED
:sdks:java:container:pullLicenses (Thread[Execution **** Thread 2,5,main]) completed. Took 1 mins 39.23 secs.
Resolve mutations for :sdks:java:container:goPrepare (Thread[Execution **** Thread 3,5,main]) started.
Resolve mutations for :sdks:java:container:goPrepare (Thread[Execution **** Thread 3,5,main]) completed. Took 0.0 secs.
:sdks:java:container:goPrepare (Thread[Execution **** Thread 2,5,main]) started.
> Task :sdks:java:container:goPrepare UP-TO-DATE
Skipping task ':sdks:java:container:goPrepare' as it has no actions.
:sdks:java:container:goPrepare (Thread[Execution **** Thread 2,5,main]) completed. Took 0.0 secs.
Resolve mutations for :sdks:java:container:goBuild (Thread[Execution **** Thread 5,5,main]) started.
Resolve mutations for :sdks:java:container:goBuild (Thread[Execution **** Thread 5,5,main]) completed. Took 0.0 secs.
:sdks:java:container:goBuild (Thread[Execution **** Thread 2,5,main]) started.
> Task :sdks:java:container:goBuild
Custom actions are attached to task ':sdks:java:container:goBuild'.
Caching disabled for task ':sdks:java:container:goBuild' because:
Gradle would require more information to cache this task
Task ':sdks:java:container:goBuild' is not up-to-date because:
Task has not declared any outputs despite executing actions.
Starting process 'command 'sh''. Working directory: <https://ci-beam.apache.org/job/beam_PerformanceTests_Kafka_IO/ws/src/sdks/java/container> Command: sh -c <https://ci-beam.apache.org/job/beam_PerformanceTests_Kafka_IO/ws/src/sdks/go/run_with_go_version.sh> --gocmd GOBIN/go1.19.3 build -o ./build/target/${GOOS}_${GOARCH}/boot *.go
Successfully started process 'command 'sh''
/home/jenkins/go/bin/go1.19.3 build -o ./build/target/linux_amd64/boot boot.go boot_test.go
:sdks:java:container:goBuild (Thread[Execution **** Thread 2,5,main]) completed. Took 2.552 secs.
work action resolve target (project :sdks:java:container) (Thread[Execution **** Thread 4,5,main]) started.
work action null (Thread[Execution **** Thread 4,5,main]) completed. Took 0.0 secs.
Resolve mutations for :sdks:java:container:java8:copySdkHarnessLauncher (Thread[Execution **** Thread 5,5,main]) started.
Resolve mutations for :sdks:java:container:java8:copySdkHarnessLauncher (Thread[Execution **** Thread 5,5,main]) completed. Took 0.0 secs.
:sdks:java:container:java8:copySdkHarnessLauncher (Thread[Execution ****,5,main]) started.
> Task :sdks:java:container:java8:copySdkHarnessLauncher
Execution optimizations have been disabled for task ':sdks:java:container:java8:copySdkHarnessLauncher' to ensure correctness due to the following reasons:
- Gradle detected a problem with the following location: '<https://ci-beam.apache.org/job/beam_PerformanceTests_Kafka_IO/ws/src/sdks/java/container/build/target'.> Reason: Task ':sdks:java:container:java8:copySdkHarnessLauncher' uses this output of task ':sdks:java:container:downloadCloudProfilerAgent' without declaring an explicit or implicit dependency. This can lead to incorrect results being produced, depending on what order the tasks are executed. Please refer to https://docs.gradle.org/7.5.1/userguide/validation_problems.html#implicit_dependency for more details about this problem.
- Gradle detected a problem with the following location: '<https://ci-beam.apache.org/job/beam_PerformanceTests_Kafka_IO/ws/src/sdks/java/container/build/target'.> Reason: Task ':sdks:java:container:java8:copySdkHarnessLauncher' uses this output of task ':sdks:java:container:pullLicenses' without declaring an explicit or implicit dependency. This can lead to incorrect results being produced, depending on what order the tasks are executed. Please refer to https://docs.gradle.org/7.5.1/userguide/validation_problems.html#implicit_dependency for more details about this problem.
Invalidating VFS because task ':sdks:java:container:java8:copySdkHarnessLauncher' failed validation
Caching disabled for task ':sdks:java:container:java8:copySdkHarnessLauncher' because:
Caching has been disabled to ensure correctness. Please consult deprecation warnings for more details.
Task ':sdks:java:container:java8:copySdkHarnessLauncher' is not up-to-date because:
No history is available.
:sdks:java:container:java8:copySdkHarnessLauncher (Thread[Execution ****,5,main]) completed. Took 0.364 secs.
FAILURE: Build failed with an exception.
* What went wrong:
Execution failed for task ':sdks:java:container:pullLicenses'.
> Process 'command './license_scripts/license_script.sh'' finished with non-zero exit value 1
* Try:
> Run with --stacktrace option to get the stack trace.
> Run with --debug option to get more log output.
* Get more help at https://help.gradle.org
Deprecated Gradle features were used in this build, making it incompatible with Gradle 8.0.
You can use '--warning-mode all' to show the individual deprecation warnings and determine if they come from your own scripts or plugins.
See https://docs.gradle.org/7.5.1/userguide/command_line_interface.html#sec:command_line_warnings
Execution optimizations have been disabled for 1 invalid unit(s) of work during this build to ensure correctness.
Please consult deprecation warnings for more details.
BUILD FAILED in 2m 7s
152 actionable tasks: 93 executed, 55 from cache, 4 up-to-date
Publishing build scan...
https://gradle.com/s/7pad3ekhc6isk
Build step 'Invoke Gradle script' changed build result to FAILURE
Build step 'Invoke Gradle script' marked build as failure
---------------------------------------------------------------------
To unsubscribe, e-mail: builds-unsubscribe@beam.apache.org
For additional commands, e-mail: builds-help@beam.apache.org