You are viewing a plain text version of this content. The canonical link for it is here.
Posted to builds@beam.apache.org by Apache Jenkins Server <je...@builds.apache.org> on 2022/02/08 00:35:52 UTC
Build failed in Jenkins: beam_PreCommit_PythonDocs_Cron #2132
See <https://ci-beam.apache.org/job/beam_PreCommit_PythonDocs_Cron/2132/display/redirect?page=changes>
Changes:
[Kyle Weaver] [BEAM-12976] Log projection pushdown optimizations.
[benjamin.gonzalez] [BEAM-12572] Change jobs to run as cron jobs
[alexander.zhuravlev] [BEAM-13820] Changed color of delete icon in pipeline options dropdown,
[noreply] [BEAM-13193] Aggregates fn api outbound data/timers of different
[noreply] [BEAM-13767] Migrate a bundle of grade tasks to use configuration
[noreply] Merge pull request #16653 from [BEAM-12164]: Add integration tests for
[noreply] Merge pull request #16728 from [BEAM-13823] Update docs for SnowflakeIO
[noreply] Merge pull request #16660 from [BEAM-13771][Playground] Send multifile
[noreply] Merge pull request #16646 from [BEAM-13643][Playground] Setup running
[noreply] [BEAM-13015] Add state caching benchmark and move benchmarks to their
[noreply] [BEAM-13419] Check for initialization in dataflow runner (#16765)
[noreply] Merge pull request #16701 from [BEAM-13786] [Playground] [Bugfix] Update
[noreply] Merge pull request #16754 from [BEAM-13838][Playground] Add logs in case
[noreply] [BEAM-13293] consistent naming for expansion service address and flag
[noreply] Merge pull request #16700 from [BEAM-13790][Playground] Change logic of
[noreply] [BEAM-13830] update dependency for debeziumio expansion service (#16743)
[noreply] [BEAM-13761] consistent namings for expansion address in Debezium IO
[noreply] [BEAM-13806] Shutting down SchemaIO expansion services from Go VR
[noreply] [release-2.36.0] Update website/changelog for release 2.36.0 (#16627)
------------------------------------------
[...truncated 797.15 KB...]
<https://ci-beam.apache.org/job/beam_PreCommit_PythonDocs_Cron/ws/src/sdks/python/test-suites/tox/pycommon/build/srcs/sdks/python/target/.tox-py38-docs/py38-docs/lib/python3.8/site-packages/apache_beam/dataframe/io.py>:docstring of apache_beam.dataframe.io.to_json:: WARNING: py:class reference target not found: optional
<https://ci-beam.apache.org/job/beam_PreCommit_PythonDocs_Cron/ws/src/sdks/python/test-suites/tox/pycommon/build/srcs/sdks/python/target/.tox-py38-docs/py38-docs/lib/python3.8/site-packages/apache_beam/dataframe/io.py>:docstring of apache_beam.dataframe.io.read_html:: WARNING: py:class reference target not found: path object
<https://ci-beam.apache.org/job/beam_PreCommit_PythonDocs_Cron/ws/src/sdks/python/test-suites/tox/pycommon/build/srcs/sdks/python/target/.tox-py38-docs/py38-docs/lib/python3.8/site-packages/apache_beam/dataframe/io.py>:docstring of apache_beam.dataframe.io.read_html:: WARNING: py:class reference target not found: file-like object
<https://ci-beam.apache.org/job/beam_PreCommit_PythonDocs_Cron/ws/src/sdks/python/test-suites/tox/pycommon/build/srcs/sdks/python/target/.tox-py38-docs/py38-docs/lib/python3.8/site-packages/apache_beam/dataframe/io.py>:docstring of apache_beam.dataframe.io.read_html:: WARNING: py:class reference target not found: compiled regular expression
<https://ci-beam.apache.org/job/beam_PreCommit_PythonDocs_Cron/ws/src/sdks/python/test-suites/tox/pycommon/build/srcs/sdks/python/target/.tox-py38-docs/py38-docs/lib/python3.8/site-packages/apache_beam/dataframe/io.py>:docstring of apache_beam.dataframe.io.read_html:: WARNING: py:class reference target not found: optional
<https://ci-beam.apache.org/job/beam_PreCommit_PythonDocs_Cron/ws/src/sdks/python/test-suites/tox/pycommon/build/srcs/sdks/python/target/.tox-py38-docs/py38-docs/lib/python3.8/site-packages/apache_beam/dataframe/io.py>:docstring of apache_beam.dataframe.io.read_html:: WARNING: py:class reference target not found: optional
<https://ci-beam.apache.org/job/beam_PreCommit_PythonDocs_Cron/ws/src/sdks/python/test-suites/tox/pycommon/build/srcs/sdks/python/target/.tox-py38-docs/py38-docs/lib/python3.8/site-packages/apache_beam/dataframe/io.py>:docstring of apache_beam.dataframe.io.read_html:: WARNING: py:class reference target not found: list-like
<https://ci-beam.apache.org/job/beam_PreCommit_PythonDocs_Cron/ws/src/sdks/python/test-suites/tox/pycommon/build/srcs/sdks/python/target/.tox-py38-docs/py38-docs/lib/python3.8/site-packages/apache_beam/dataframe/io.py>:docstring of apache_beam.dataframe.io.read_html:: WARNING: py:class reference target not found: optional
<https://ci-beam.apache.org/job/beam_PreCommit_PythonDocs_Cron/ws/src/sdks/python/test-suites/tox/pycommon/build/srcs/sdks/python/target/.tox-py38-docs/py38-docs/lib/python3.8/site-packages/apache_beam/dataframe/io.py>:docstring of apache_beam.dataframe.io.read_html:: WARNING: py:class reference target not found: list-like
<https://ci-beam.apache.org/job/beam_PreCommit_PythonDocs_Cron/ws/src/sdks/python/test-suites/tox/pycommon/build/srcs/sdks/python/target/.tox-py38-docs/py38-docs/lib/python3.8/site-packages/apache_beam/dataframe/io.py>:docstring of apache_beam.dataframe.io.read_html:: WARNING: py:class reference target not found: optional
<https://ci-beam.apache.org/job/beam_PreCommit_PythonDocs_Cron/ws/src/sdks/python/test-suites/tox/pycommon/build/srcs/sdks/python/target/.tox-py38-docs/py38-docs/lib/python3.8/site-packages/apache_beam/dataframe/io.py>:docstring of apache_beam.dataframe.io.read_html:: WARNING: py:class reference target not found: list-like
<https://ci-beam.apache.org/job/beam_PreCommit_PythonDocs_Cron/ws/src/sdks/python/test-suites/tox/pycommon/build/srcs/sdks/python/target/.tox-py38-docs/py38-docs/lib/python3.8/site-packages/apache_beam/dataframe/io.py>:docstring of apache_beam.dataframe.io.read_html:: WARNING: py:class reference target not found: optional
<https://ci-beam.apache.org/job/beam_PreCommit_PythonDocs_Cron/ws/src/sdks/python/test-suites/tox/pycommon/build/srcs/sdks/python/target/.tox-py38-docs/py38-docs/lib/python3.8/site-packages/apache_beam/dataframe/io.py>:docstring of apache_beam.dataframe.io.read_html:: WARNING: py:class reference target not found: optional
<https://ci-beam.apache.org/job/beam_PreCommit_PythonDocs_Cron/ws/src/sdks/python/test-suites/tox/pycommon/build/srcs/sdks/python/target/.tox-py38-docs/py38-docs/lib/python3.8/site-packages/apache_beam/dataframe/io.py>:docstring of apache_beam.dataframe.io.read_html:: WARNING: py:class reference target not found: optional
<https://ci-beam.apache.org/job/beam_PreCommit_PythonDocs_Cron/ws/src/sdks/python/test-suites/tox/pycommon/build/srcs/sdks/python/target/.tox-py38-docs/py38-docs/lib/python3.8/site-packages/apache_beam/dataframe/io.py>:docstring of apache_beam.dataframe.io.read_html:: WARNING: py:class reference target not found: optional
<https://ci-beam.apache.org/job/beam_PreCommit_PythonDocs_Cron/ws/src/sdks/python/test-suites/tox/pycommon/build/srcs/sdks/python/target/.tox-py38-docs/py38-docs/lib/python3.8/site-packages/apache_beam/dataframe/io.py>:docstring of apache_beam.dataframe.io.read_html:: WARNING: py:class reference target not found: optional
<https://ci-beam.apache.org/job/beam_PreCommit_PythonDocs_Cron/ws/src/sdks/python/test-suites/tox/pycommon/build/srcs/sdks/python/target/.tox-py38-docs/py38-docs/lib/python3.8/site-packages/apache_beam/dataframe/io.py>:docstring of apache_beam.dataframe.io.read_html:: WARNING: py:class reference target not found: default '.'
<https://ci-beam.apache.org/job/beam_PreCommit_PythonDocs_Cron/ws/src/sdks/python/test-suites/tox/pycommon/build/srcs/sdks/python/target/.tox-py38-docs/py38-docs/lib/python3.8/site-packages/apache_beam/dataframe/io.py>:docstring of apache_beam.dataframe.io.read_html:: WARNING: py:class reference target not found: default None
<https://ci-beam.apache.org/job/beam_PreCommit_PythonDocs_Cron/ws/src/sdks/python/test-suites/tox/pycommon/build/srcs/sdks/python/target/.tox-py38-docs/py38-docs/lib/python3.8/site-packages/apache_beam/dataframe/io.py>:docstring of apache_beam.dataframe.io.read_html:: WARNING: py:class reference target not found: iterable
<https://ci-beam.apache.org/job/beam_PreCommit_PythonDocs_Cron/ws/src/sdks/python/test-suites/tox/pycommon/build/srcs/sdks/python/target/.tox-py38-docs/py38-docs/lib/python3.8/site-packages/apache_beam/dataframe/io.py>:docstring of apache_beam.dataframe.io.read_html:: WARNING: py:class reference target not found: default None
<https://ci-beam.apache.org/job/beam_PreCommit_PythonDocs_Cron/ws/src/sdks/python/test-suites/tox/pycommon/build/srcs/sdks/python/target/.tox-py38-docs/py38-docs/lib/python3.8/site-packages/apache_beam/dataframe/io.py>:docstring of apache_beam.dataframe.io.read_html:: WARNING: py:class reference target not found: default True
<https://ci-beam.apache.org/job/beam_PreCommit_PythonDocs_Cron/ws/src/sdks/python/test-suites/tox/pycommon/build/srcs/sdks/python/target/.tox-py38-docs/py38-docs/lib/python3.8/site-packages/apache_beam/dataframe/io.py>:docstring of apache_beam.dataframe.io.read_html:: WARNING: py:class reference target not found: default True
<https://ci-beam.apache.org/job/beam_PreCommit_PythonDocs_Cron/ws/src/sdks/python/test-suites/tox/pycommon/build/srcs/sdks/python/target/.tox-py38-docs/py38-docs/lib/python3.8/site-packages/apache_beam/dataframe/io.py>:docstring of apache_beam.dataframe.io.read_html:: WARNING: py:class reference target not found: dfs
<https://ci-beam.apache.org/job/beam_PreCommit_PythonDocs_Cron/ws/src/sdks/python/test-suites/tox/pycommon/build/srcs/sdks/python/target/.tox-py38-docs/py38-docs/lib/python3.8/site-packages/apache_beam/dataframe/io.py>:docstring of apache_beam.dataframe.io.read_html:111: WARNING: py:class reference target not found: DeferredDataFrame
<https://ci-beam.apache.org/job/beam_PreCommit_PythonDocs_Cron/ws/src/sdks/python/test-suites/tox/pycommon/build/srcs/sdks/python/target/.tox-py38-docs/py38-docs/lib/python3.8/site-packages/apache_beam/dataframe/io.py>:docstring of apache_beam.dataframe.io.to_html:: WARNING: py:class reference target not found: Path
<https://ci-beam.apache.org/job/beam_PreCommit_PythonDocs_Cron/ws/src/sdks/python/test-suites/tox/pycommon/build/srcs/sdks/python/target/.tox-py38-docs/py38-docs/lib/python3.8/site-packages/apache_beam/dataframe/io.py>:docstring of apache_beam.dataframe.io.to_html:: WARNING: py:class reference target not found: StringIO-like
<https://ci-beam.apache.org/job/beam_PreCommit_PythonDocs_Cron/ws/src/sdks/python/test-suites/tox/pycommon/build/srcs/sdks/python/target/.tox-py38-docs/py38-docs/lib/python3.8/site-packages/apache_beam/dataframe/io.py>:docstring of apache_beam.dataframe.io.to_html:: WARNING: py:class reference target not found: optional
<https://ci-beam.apache.org/job/beam_PreCommit_PythonDocs_Cron/ws/src/sdks/python/test-suites/tox/pycommon/build/srcs/sdks/python/target/.tox-py38-docs/py38-docs/lib/python3.8/site-packages/apache_beam/dataframe/io.py>:docstring of apache_beam.dataframe.io.to_html:: WARNING: py:class reference target not found: default None
<https://ci-beam.apache.org/job/beam_PreCommit_PythonDocs_Cron/ws/src/sdks/python/test-suites/tox/pycommon/build/srcs/sdks/python/target/.tox-py38-docs/py38-docs/lib/python3.8/site-packages/apache_beam/dataframe/io.py>:docstring of apache_beam.dataframe.io.to_html:: WARNING: py:class reference target not found: sequence
<https://ci-beam.apache.org/job/beam_PreCommit_PythonDocs_Cron/ws/src/sdks/python/test-suites/tox/pycommon/build/srcs/sdks/python/target/.tox-py38-docs/py38-docs/lib/python3.8/site-packages/apache_beam/dataframe/io.py>:docstring of apache_beam.dataframe.io.to_html:: WARNING: py:class reference target not found: optional
<https://ci-beam.apache.org/job/beam_PreCommit_PythonDocs_Cron/ws/src/sdks/python/test-suites/tox/pycommon/build/srcs/sdks/python/target/.tox-py38-docs/py38-docs/lib/python3.8/site-packages/apache_beam/dataframe/io.py>:docstring of apache_beam.dataframe.io.to_html:: WARNING: py:class reference target not found: default None
<https://ci-beam.apache.org/job/beam_PreCommit_PythonDocs_Cron/ws/src/sdks/python/test-suites/tox/pycommon/build/srcs/sdks/python/target/.tox-py38-docs/py38-docs/lib/python3.8/site-packages/apache_beam/dataframe/io.py>:docstring of apache_beam.dataframe.io.to_html:: WARNING: py:class reference target not found: dict of int
<https://ci-beam.apache.org/job/beam_PreCommit_PythonDocs_Cron/ws/src/sdks/python/test-suites/tox/pycommon/build/srcs/sdks/python/target/.tox-py38-docs/py38-docs/lib/python3.8/site-packages/apache_beam/dataframe/io.py>:docstring of apache_beam.dataframe.io.to_html:: WARNING: py:class reference target not found: optional
<https://ci-beam.apache.org/job/beam_PreCommit_PythonDocs_Cron/ws/src/sdks/python/test-suites/tox/pycommon/build/srcs/sdks/python/target/.tox-py38-docs/py38-docs/lib/python3.8/site-packages/apache_beam/dataframe/io.py>:docstring of apache_beam.dataframe.io.to_html:: WARNING: py:class reference target not found: optional
<https://ci-beam.apache.org/job/beam_PreCommit_PythonDocs_Cron/ws/src/sdks/python/test-suites/tox/pycommon/build/srcs/sdks/python/target/.tox-py38-docs/py38-docs/lib/python3.8/site-packages/apache_beam/dataframe/io.py>:docstring of apache_beam.dataframe.io.to_html:: WARNING: py:class reference target not found: optional
<https://ci-beam.apache.org/job/beam_PreCommit_PythonDocs_Cron/ws/src/sdks/python/test-suites/tox/pycommon/build/srcs/sdks/python/target/.tox-py38-docs/py38-docs/lib/python3.8/site-packages/apache_beam/dataframe/io.py>:docstring of apache_beam.dataframe.io.to_html:: WARNING: py:class reference target not found: default True
<https://ci-beam.apache.org/job/beam_PreCommit_PythonDocs_Cron/ws/src/sdks/python/test-suites/tox/pycommon/build/srcs/sdks/python/target/.tox-py38-docs/py38-docs/lib/python3.8/site-packages/apache_beam/dataframe/io.py>:docstring of apache_beam.dataframe.io.to_html:: WARNING: py:class reference target not found: optional
<https://ci-beam.apache.org/job/beam_PreCommit_PythonDocs_Cron/ws/src/sdks/python/test-suites/tox/pycommon/build/srcs/sdks/python/target/.tox-py38-docs/py38-docs/lib/python3.8/site-packages/apache_beam/dataframe/io.py>:docstring of apache_beam.dataframe.io.to_html:: WARNING: py:class reference target not found: default 'NaN'
<https://ci-beam.apache.org/job/beam_PreCommit_PythonDocs_Cron/ws/src/sdks/python/test-suites/tox/pycommon/build/srcs/sdks/python/target/.tox-py38-docs/py38-docs/lib/python3.8/site-packages/apache_beam/dataframe/io.py>:docstring of apache_beam.dataframe.io.to_html:: WARNING: py:class reference target not found: dict of one-param. functions
<https://ci-beam.apache.org/job/beam_PreCommit_PythonDocs_Cron/ws/src/sdks/python/test-suites/tox/pycommon/build/srcs/sdks/python/target/.tox-py38-docs/py38-docs/lib/python3.8/site-packages/apache_beam/dataframe/io.py>:docstring of apache_beam.dataframe.io.to_html:: WARNING: py:class reference target not found: optional
<https://ci-beam.apache.org/job/beam_PreCommit_PythonDocs_Cron/ws/src/sdks/python/test-suites/tox/pycommon/build/srcs/sdks/python/target/.tox-py38-docs/py38-docs/lib/python3.8/site-packages/apache_beam/dataframe/io.py>:docstring of apache_beam.dataframe.io.to_html:: WARNING: py:class reference target not found: one-parameter function
<https://ci-beam.apache.org/job/beam_PreCommit_PythonDocs_Cron/ws/src/sdks/python/test-suites/tox/pycommon/build/srcs/sdks/python/target/.tox-py38-docs/py38-docs/lib/python3.8/site-packages/apache_beam/dataframe/io.py>:docstring of apache_beam.dataframe.io.to_html:: WARNING: py:class reference target not found: optional
<https://ci-beam.apache.org/job/beam_PreCommit_PythonDocs_Cron/ws/src/sdks/python/test-suites/tox/pycommon/build/srcs/sdks/python/target/.tox-py38-docs/py38-docs/lib/python3.8/site-packages/apache_beam/dataframe/io.py>:docstring of apache_beam.dataframe.io.to_html:: WARNING: py:class reference target not found: default None
<https://ci-beam.apache.org/job/beam_PreCommit_PythonDocs_Cron/ws/src/sdks/python/test-suites/tox/pycommon/build/srcs/sdks/python/target/.tox-py38-docs/py38-docs/lib/python3.8/site-packages/apache_beam/dataframe/io.py>:docstring of apache_beam.dataframe.io.to_html:: WARNING: py:class reference target not found: optional
<https://ci-beam.apache.org/job/beam_PreCommit_PythonDocs_Cron/ws/src/sdks/python/test-suites/tox/pycommon/build/srcs/sdks/python/target/.tox-py38-docs/py38-docs/lib/python3.8/site-packages/apache_beam/dataframe/io.py>:docstring of apache_beam.dataframe.io.to_html:: WARNING: py:class reference target not found: default True
<https://ci-beam.apache.org/job/beam_PreCommit_PythonDocs_Cron/ws/src/sdks/python/test-suites/tox/pycommon/build/srcs/sdks/python/target/.tox-py38-docs/py38-docs/lib/python3.8/site-packages/apache_beam/dataframe/io.py>:docstring of apache_beam.dataframe.io.to_html:: WARNING: py:class reference target not found: optional
<https://ci-beam.apache.org/job/beam_PreCommit_PythonDocs_Cron/ws/src/sdks/python/test-suites/tox/pycommon/build/srcs/sdks/python/target/.tox-py38-docs/py38-docs/lib/python3.8/site-packages/apache_beam/dataframe/io.py>:docstring of apache_beam.dataframe.io.to_html:: WARNING: py:class reference target not found: default True
<https://ci-beam.apache.org/job/beam_PreCommit_PythonDocs_Cron/ws/src/sdks/python/test-suites/tox/pycommon/build/srcs/sdks/python/target/.tox-py38-docs/py38-docs/lib/python3.8/site-packages/apache_beam/dataframe/io.py>:docstring of apache_beam.dataframe.io.to_html:: WARNING: py:class reference target not found: default None
<https://ci-beam.apache.org/job/beam_PreCommit_PythonDocs_Cron/ws/src/sdks/python/test-suites/tox/pycommon/build/srcs/sdks/python/target/.tox-py38-docs/py38-docs/lib/python3.8/site-packages/apache_beam/dataframe/io.py>:docstring of apache_beam.dataframe.io.to_html:: WARNING: py:class reference target not found: optional
<https://ci-beam.apache.org/job/beam_PreCommit_PythonDocs_Cron/ws/src/sdks/python/test-suites/tox/pycommon/build/srcs/sdks/python/target/.tox-py38-docs/py38-docs/lib/python3.8/site-packages/apache_beam/dataframe/io.py>:docstring of apache_beam.dataframe.io.to_html:: WARNING: py:class reference target not found: optional
<https://ci-beam.apache.org/job/beam_PreCommit_PythonDocs_Cron/ws/src/sdks/python/test-suites/tox/pycommon/build/srcs/sdks/python/target/.tox-py38-docs/py38-docs/lib/python3.8/site-packages/apache_beam/dataframe/io.py>:docstring of apache_beam.dataframe.io.to_html:: WARNING: py:class reference target not found: default False
<https://ci-beam.apache.org/job/beam_PreCommit_PythonDocs_Cron/ws/src/sdks/python/test-suites/tox/pycommon/build/srcs/sdks/python/target/.tox-py38-docs/py38-docs/lib/python3.8/site-packages/apache_beam/dataframe/io.py>:docstring of apache_beam.dataframe.io.to_html:: WARNING: py:class reference target not found: default '.'
<https://ci-beam.apache.org/job/beam_PreCommit_PythonDocs_Cron/ws/src/sdks/python/test-suites/tox/pycommon/build/srcs/sdks/python/target/.tox-py38-docs/py38-docs/lib/python3.8/site-packages/apache_beam/dataframe/io.py>:docstring of apache_beam.dataframe.io.to_html:: WARNING: py:class reference target not found: default True
<https://ci-beam.apache.org/job/beam_PreCommit_PythonDocs_Cron/ws/src/sdks/python/test-suites/tox/pycommon/build/srcs/sdks/python/target/.tox-py38-docs/py38-docs/lib/python3.8/site-packages/apache_beam/dataframe/io.py>:docstring of apache_beam.dataframe.io.to_html:: WARNING: py:class reference target not found: default None
<https://ci-beam.apache.org/job/beam_PreCommit_PythonDocs_Cron/ws/src/sdks/python/test-suites/tox/pycommon/build/srcs/sdks/python/target/.tox-py38-docs/py38-docs/lib/python3.8/site-packages/apache_beam/dataframe/io.py>:docstring of apache_beam.dataframe.io.to_html:: WARNING: py:class reference target not found: default True
<https://ci-beam.apache.org/job/beam_PreCommit_PythonDocs_Cron/ws/src/sdks/python/test-suites/tox/pycommon/build/srcs/sdks/python/target/.tox-py38-docs/py38-docs/lib/python3.8/site-packages/apache_beam/dataframe/io.py>:docstring of apache_beam.dataframe.io.to_html:: WARNING: py:class reference target not found: {True
<https://ci-beam.apache.org/job/beam_PreCommit_PythonDocs_Cron/ws/src/sdks/python/test-suites/tox/pycommon/build/srcs/sdks/python/target/.tox-py38-docs/py38-docs/lib/python3.8/site-packages/apache_beam/dataframe/io.py>:docstring of apache_beam.dataframe.io.to_html:: WARNING: py:class reference target not found: False}
<https://ci-beam.apache.org/job/beam_PreCommit_PythonDocs_Cron/ws/src/sdks/python/test-suites/tox/pycommon/build/srcs/sdks/python/target/.tox-py38-docs/py38-docs/lib/python3.8/site-packages/apache_beam/dataframe/io.py>:docstring of apache_beam.dataframe.io.to_html:: WARNING: py:class reference target not found: default False
<https://ci-beam.apache.org/job/beam_PreCommit_PythonDocs_Cron/ws/src/sdks/python/test-suites/tox/pycommon/build/srcs/sdks/python/target/.tox-py38-docs/py38-docs/lib/python3.8/site-packages/apache_beam/dataframe/io.py>:docstring of apache_beam.dataframe.io.to_html:: WARNING: py:class reference target not found: optional
<https://ci-beam.apache.org/job/beam_PreCommit_PythonDocs_Cron/ws/src/sdks/python/test-suites/tox/pycommon/build/srcs/sdks/python/target/.tox-py38-docs/py38-docs/lib/python3.8/site-packages/apache_beam/dataframe/io.py>:docstring of apache_beam.dataframe.io.to_html:: WARNING: py:class reference target not found: default False
<https://ci-beam.apache.org/job/beam_PreCommit_PythonDocs_Cron/ws/src/sdks/python/test-suites/tox/pycommon/build/srcs/sdks/python/target/.tox-py38-docs/py38-docs/lib/python3.8/site-packages/apache_beam/dataframe/io.py>:docstring of apache_beam.dataframe.io.to_html:: WARNING: py:class reference target not found: default "utf-8"
<https://ci-beam.apache.org/job/beam_PreCommit_PythonDocs_Cron/ws/src/sdks/python/test-suites/tox/pycommon/build/srcs/sdks/python/target/.tox-py38-docs/py38-docs/lib/python3.8/site-packages/apache_beam/dataframe/io.py>:docstring of apache_beam.dataframe.io.to_html:89: WARNING: py:func reference target not found: to_string
<https://ci-beam.apache.org/job/beam_PreCommit_PythonDocs_Cron/ws/src/sdks/python/test-suites/tox/pycommon/build/srcs/sdks/python/target/.tox-py38-docs/py38-docs/lib/python3.8/site-packages/apache_beam/dataframe/io.py>:docstring of apache_beam.dataframe.io.read_excel:: WARNING: py:class reference target not found: ExcelFile
<https://ci-beam.apache.org/job/beam_PreCommit_PythonDocs_Cron/ws/src/sdks/python/test-suites/tox/pycommon/build/srcs/sdks/python/target/.tox-py38-docs/py38-docs/lib/python3.8/site-packages/apache_beam/dataframe/io.py>:docstring of apache_beam.dataframe.io.read_excel:: WARNING: py:class reference target not found: xlrd.Book
<https://ci-beam.apache.org/job/beam_PreCommit_PythonDocs_Cron/ws/src/sdks/python/test-suites/tox/pycommon/build/srcs/sdks/python/target/.tox-py38-docs/py38-docs/lib/python3.8/site-packages/apache_beam/dataframe/io.py>:docstring of apache_beam.dataframe.io.read_excel:: WARNING: py:class reference target not found: path object
<https://ci-beam.apache.org/job/beam_PreCommit_PythonDocs_Cron/ws/src/sdks/python/test-suites/tox/pycommon/build/srcs/sdks/python/target/.tox-py38-docs/py38-docs/lib/python3.8/site-packages/apache_beam/dataframe/io.py>:docstring of apache_beam.dataframe.io.read_excel:: WARNING: py:class reference target not found: file-like object
<https://ci-beam.apache.org/job/beam_PreCommit_PythonDocs_Cron/ws/src/sdks/python/test-suites/tox/pycommon/build/srcs/sdks/python/target/.tox-py38-docs/py38-docs/lib/python3.8/site-packages/apache_beam/dataframe/io.py>:docstring of apache_beam.dataframe.io.read_excel:: WARNING: py:class reference target not found: default 0
<https://ci-beam.apache.org/job/beam_PreCommit_PythonDocs_Cron/ws/src/sdks/python/test-suites/tox/pycommon/build/srcs/sdks/python/target/.tox-py38-docs/py38-docs/lib/python3.8/site-packages/apache_beam/dataframe/io.py>:docstring of apache_beam.dataframe.io.read_excel:: WARNING: py:class reference target not found: list of int
<https://ci-beam.apache.org/job/beam_PreCommit_PythonDocs_Cron/ws/src/sdks/python/test-suites/tox/pycommon/build/srcs/sdks/python/target/.tox-py38-docs/py38-docs/lib/python3.8/site-packages/apache_beam/dataframe/io.py>:docstring of apache_beam.dataframe.io.read_excel:: WARNING: py:class reference target not found: default 0
<https://ci-beam.apache.org/job/beam_PreCommit_PythonDocs_Cron/ws/src/sdks/python/test-suites/tox/pycommon/build/srcs/sdks/python/target/.tox-py38-docs/py38-docs/lib/python3.8/site-packages/apache_beam/dataframe/io.py>:docstring of apache_beam.dataframe.io.read_excel:: WARNING: py:class reference target not found: array-like
<https://ci-beam.apache.org/job/beam_PreCommit_PythonDocs_Cron/ws/src/sdks/python/test-suites/tox/pycommon/build/srcs/sdks/python/target/.tox-py38-docs/py38-docs/lib/python3.8/site-packages/apache_beam/dataframe/io.py>:docstring of apache_beam.dataframe.io.read_excel:: WARNING: py:class reference target not found: default None
<https://ci-beam.apache.org/job/beam_PreCommit_PythonDocs_Cron/ws/src/sdks/python/test-suites/tox/pycommon/build/srcs/sdks/python/target/.tox-py38-docs/py38-docs/lib/python3.8/site-packages/apache_beam/dataframe/io.py>:docstring of apache_beam.dataframe.io.read_excel:: WARNING: py:class reference target not found: list of int
<https://ci-beam.apache.org/job/beam_PreCommit_PythonDocs_Cron/ws/src/sdks/python/test-suites/tox/pycommon/build/srcs/sdks/python/target/.tox-py38-docs/py38-docs/lib/python3.8/site-packages/apache_beam/dataframe/io.py>:docstring of apache_beam.dataframe.io.read_excel:: WARNING: py:class reference target not found: default None
<https://ci-beam.apache.org/job/beam_PreCommit_PythonDocs_Cron/ws/src/sdks/python/test-suites/tox/pycommon/build/srcs/sdks/python/target/.tox-py38-docs/py38-docs/lib/python3.8/site-packages/apache_beam/dataframe/io.py>:docstring of apache_beam.dataframe.io.read_excel:: WARNING: py:class reference target not found: list-like
<https://ci-beam.apache.org/job/beam_PreCommit_PythonDocs_Cron/ws/src/sdks/python/test-suites/tox/pycommon/build/srcs/sdks/python/target/.tox-py38-docs/py38-docs/lib/python3.8/site-packages/apache_beam/dataframe/io.py>:docstring of apache_beam.dataframe.io.read_excel:: WARNING: py:class reference target not found: callable default None
<https://ci-beam.apache.org/job/beam_PreCommit_PythonDocs_Cron/ws/src/sdks/python/test-suites/tox/pycommon/build/srcs/sdks/python/target/.tox-py38-docs/py38-docs/lib/python3.8/site-packages/apache_beam/dataframe/io.py>:docstring of apache_beam.dataframe.io.read_excel:: WARNING: py:class reference target not found: default False
<https://ci-beam.apache.org/job/beam_PreCommit_PythonDocs_Cron/ws/src/sdks/python/test-suites/tox/pycommon/build/srcs/sdks/python/target/.tox-py38-docs/py38-docs/lib/python3.8/site-packages/apache_beam/dataframe/io.py>:docstring of apache_beam.dataframe.io.read_excel:: WARNING: py:class reference target not found: Type name
<https://ci-beam.apache.org/job/beam_PreCommit_PythonDocs_Cron/ws/src/sdks/python/test-suites/tox/pycommon/build/srcs/sdks/python/target/.tox-py38-docs/py38-docs/lib/python3.8/site-packages/apache_beam/dataframe/io.py>:docstring of apache_beam.dataframe.io.read_excel:: WARNING: py:class reference target not found: dict of column -> type
<https://ci-beam.apache.org/job/beam_PreCommit_PythonDocs_Cron/ws/src/sdks/python/test-suites/tox/pycommon/build/srcs/sdks/python/target/.tox-py38-docs/py38-docs/lib/python3.8/site-packages/apache_beam/dataframe/io.py>:docstring of apache_beam.dataframe.io.read_excel:: WARNING: py:class reference target not found: default None
<https://ci-beam.apache.org/job/beam_PreCommit_PythonDocs_Cron/ws/src/sdks/python/test-suites/tox/pycommon/build/srcs/sdks/python/target/.tox-py38-docs/py38-docs/lib/python3.8/site-packages/apache_beam/dataframe/io.py>:docstring of apache_beam.dataframe.io.read_excel:: WARNING: py:class reference target not found: default None
<https://ci-beam.apache.org/job/beam_PreCommit_PythonDocs_Cron/ws/src/sdks/python/test-suites/tox/pycommon/build/srcs/sdks/python/target/.tox-py38-docs/py38-docs/lib/python3.8/site-packages/apache_beam/dataframe/io.py>:docstring of apache_beam.dataframe.io.read_excel:: WARNING: py:class reference target not found: default None
<https://ci-beam.apache.org/job/beam_PreCommit_PythonDocs_Cron/ws/src/sdks/python/test-suites/tox/pycommon/build/srcs/sdks/python/target/.tox-py38-docs/py38-docs/lib/python3.8/site-packages/apache_beam/dataframe/io.py>:docstring of apache_beam.dataframe.io.read_excel:: WARNING: py:class reference target not found: default None
<https://ci-beam.apache.org/job/beam_PreCommit_PythonDocs_Cron/ws/src/sdks/python/test-suites/tox/pycommon/build/srcs/sdks/python/target/.tox-py38-docs/py38-docs/lib/python3.8/site-packages/apache_beam/dataframe/io.py>:docstring of apache_beam.dataframe.io.read_excel:: WARNING: py:class reference target not found: default None
<https://ci-beam.apache.org/job/beam_PreCommit_PythonDocs_Cron/ws/src/sdks/python/test-suites/tox/pycommon/build/srcs/sdks/python/target/.tox-py38-docs/py38-docs/lib/python3.8/site-packages/apache_beam/dataframe/io.py>:docstring of apache_beam.dataframe.io.read_excel:: WARNING: py:class reference target not found: list-like
<https://ci-beam.apache.org/job/beam_PreCommit_PythonDocs_Cron/ws/src/sdks/python/test-suites/tox/pycommon/build/srcs/sdks/python/target/.tox-py38-docs/py38-docs/lib/python3.8/site-packages/apache_beam/dataframe/io.py>:docstring of apache_beam.dataframe.io.read_excel:: WARNING: py:class reference target not found: optional
<https://ci-beam.apache.org/job/beam_PreCommit_PythonDocs_Cron/ws/src/sdks/python/test-suites/tox/pycommon/build/srcs/sdks/python/target/.tox-py38-docs/py38-docs/lib/python3.8/site-packages/apache_beam/dataframe/io.py>:docstring of apache_beam.dataframe.io.read_excel:: WARNING: py:class reference target not found: default None
<https://ci-beam.apache.org/job/beam_PreCommit_PythonDocs_Cron/ws/src/sdks/python/test-suites/tox/pycommon/build/srcs/sdks/python/target/.tox-py38-docs/py38-docs/lib/python3.8/site-packages/apache_beam/dataframe/io.py>:docstring of apache_beam.dataframe.io.read_excel:: WARNING: py:class reference target not found: scalar
<https://ci-beam.apache.org/job/beam_PreCommit_PythonDocs_Cron/ws/src/sdks/python/test-suites/tox/pycommon/build/srcs/sdks/python/target/.tox-py38-docs/py38-docs/lib/python3.8/site-packages/apache_beam/dataframe/io.py>:docstring of apache_beam.dataframe.io.read_excel:: WARNING: py:class reference target not found: list-like
<https://ci-beam.apache.org/job/beam_PreCommit_PythonDocs_Cron/ws/src/sdks/python/test-suites/tox/pycommon/build/srcs/sdks/python/target/.tox-py38-docs/py38-docs/lib/python3.8/site-packages/apache_beam/dataframe/io.py>:docstring of apache_beam.dataframe.io.read_excel:: WARNING: py:class reference target not found: default None
<https://ci-beam.apache.org/job/beam_PreCommit_PythonDocs_Cron/ws/src/sdks/python/test-suites/tox/pycommon/build/srcs/sdks/python/target/.tox-py38-docs/py38-docs/lib/python3.8/site-packages/apache_beam/dataframe/io.py>:docstring of apache_beam.dataframe.io.read_excel:: WARNING: py:class reference target not found: default True
<https://ci-beam.apache.org/job/beam_PreCommit_PythonDocs_Cron/ws/src/sdks/python/test-suites/tox/pycommon/build/srcs/sdks/python/target/.tox-py38-docs/py38-docs/lib/python3.8/site-packages/apache_beam/dataframe/io.py>:docstring of apache_beam.dataframe.io.read_excel:: WARNING: py:class reference target not found: default True
<https://ci-beam.apache.org/job/beam_PreCommit_PythonDocs_Cron/ws/src/sdks/python/test-suites/tox/pycommon/build/srcs/sdks/python/target/.tox-py38-docs/py38-docs/lib/python3.8/site-packages/apache_beam/dataframe/io.py>:docstring of apache_beam.dataframe.io.read_excel:: WARNING: py:class reference target not found: default False
<https://ci-beam.apache.org/job/beam_PreCommit_PythonDocs_Cron/ws/src/sdks/python/test-suites/tox/pycommon/build/srcs/sdks/python/target/.tox-py38-docs/py38-docs/lib/python3.8/site-packages/apache_beam/dataframe/io.py>:docstring of apache_beam.dataframe.io.read_excel:: WARNING: py:class reference target not found: list-like
<https://ci-beam.apache.org/job/beam_PreCommit_PythonDocs_Cron/ws/src/sdks/python/test-suites/tox/pycommon/build/srcs/sdks/python/target/.tox-py38-docs/py38-docs/lib/python3.8/site-packages/apache_beam/dataframe/io.py>:docstring of apache_beam.dataframe.io.read_excel:: WARNING: py:class reference target not found: default False
<https://ci-beam.apache.org/job/beam_PreCommit_PythonDocs_Cron/ws/src/sdks/python/test-suites/tox/pycommon/build/srcs/sdks/python/target/.tox-py38-docs/py38-docs/lib/python3.8/site-packages/apache_beam/dataframe/io.py>:docstring of apache_beam.dataframe.io.read_excel:: WARNING: py:class reference target not found: function
<https://ci-beam.apache.org/job/beam_PreCommit_PythonDocs_Cron/ws/src/sdks/python/test-suites/tox/pycommon/build/srcs/sdks/python/target/.tox-py38-docs/py38-docs/lib/python3.8/site-packages/apache_beam/dataframe/io.py>:docstring of apache_beam.dataframe.io.read_excel:: WARNING: py:class reference target not found: optional
<https://ci-beam.apache.org/job/beam_PreCommit_PythonDocs_Cron/ws/src/sdks/python/test-suites/tox/pycommon/build/srcs/sdks/python/target/.tox-py38-docs/py38-docs/lib/python3.8/site-packages/apache_beam/dataframe/io.py>:docstring of apache_beam.dataframe.io.read_excel:: WARNING: py:class reference target not found: default None
<https://ci-beam.apache.org/job/beam_PreCommit_PythonDocs_Cron/ws/src/sdks/python/test-suites/tox/pycommon/build/srcs/sdks/python/target/.tox-py38-docs/py38-docs/lib/python3.8/site-packages/apache_beam/dataframe/io.py>:docstring of apache_beam.dataframe.io.read_excel:: WARNING: py:class reference target not found: default '.'
<https://ci-beam.apache.org/job/beam_PreCommit_PythonDocs_Cron/ws/src/sdks/python/test-suites/tox/pycommon/build/srcs/sdks/python/target/.tox-py38-docs/py38-docs/lib/python3.8/site-packages/apache_beam/dataframe/io.py>:docstring of apache_beam.dataframe.io.read_excel:: WARNING: py:class reference target not found: default None
<https://ci-beam.apache.org/job/beam_PreCommit_PythonDocs_Cron/ws/src/sdks/python/test-suites/tox/pycommon/build/srcs/sdks/python/target/.tox-py38-docs/py38-docs/lib/python3.8/site-packages/apache_beam/dataframe/io.py>:docstring of apache_beam.dataframe.io.read_excel:: WARNING: py:class reference target not found: default 0
<https://ci-beam.apache.org/job/beam_PreCommit_PythonDocs_Cron/ws/src/sdks/python/test-suites/tox/pycommon/build/srcs/sdks/python/target/.tox-py38-docs/py38-docs/lib/python3.8/site-packages/apache_beam/dataframe/io.py>:docstring of apache_beam.dataframe.io.read_excel:: WARNING: py:class reference target not found: default True
<https://ci-beam.apache.org/job/beam_PreCommit_PythonDocs_Cron/ws/src/sdks/python/test-suites/tox/pycommon/build/srcs/sdks/python/target/.tox-py38-docs/py38-docs/lib/python3.8/site-packages/apache_beam/dataframe/io.py>:docstring of apache_beam.dataframe.io.read_excel:: WARNING: py:class reference target not found: default True
<https://ci-beam.apache.org/job/beam_PreCommit_PythonDocs_Cron/ws/src/sdks/python/test-suites/tox/pycommon/build/srcs/sdks/python/target/.tox-py38-docs/py38-docs/lib/python3.8/site-packages/apache_beam/dataframe/io.py>:docstring of apache_beam.dataframe.io.read_excel:: WARNING: py:class reference target not found: optional
<https://ci-beam.apache.org/job/beam_PreCommit_PythonDocs_Cron/ws/src/sdks/python/test-suites/tox/pycommon/build/srcs/sdks/python/target/.tox-py38-docs/py38-docs/lib/python3.8/site-packages/apache_beam/dataframe/io.py>:docstring of apache_beam.dataframe.io.read_excel:: WARNING: py:class reference target not found: dict of DeferredDataFrames
<https://ci-beam.apache.org/job/beam_PreCommit_PythonDocs_Cron/ws/src/sdks/python/test-suites/tox/pycommon/build/srcs/sdks/python/target/.tox-py38-docs/py38-docs/lib/python3.8/site-packages/apache_beam/dataframe/io.py>:docstring of apache_beam.dataframe.io.read_excel:215: WARNING: py:func reference target not found: DeferredDataFrame.to_excel
<https://ci-beam.apache.org/job/beam_PreCommit_PythonDocs_Cron/ws/src/sdks/python/test-suites/tox/pycommon/build/srcs/sdks/python/target/.tox-py38-docs/py38-docs/lib/python3.8/site-packages/apache_beam/dataframe/io.py>:docstring of apache_beam.dataframe.io.read_excel:218: WARNING: py:func reference target not found: DeferredDataFrame.to_csv
<https://ci-beam.apache.org/job/beam_PreCommit_PythonDocs_Cron/ws/src/sdks/python/test-suites/tox/pycommon/build/srcs/sdks/python/target/.tox-py38-docs/py38-docs/lib/python3.8/site-packages/apache_beam/dataframe/io.py>:docstring of apache_beam.dataframe.io.read_feather:: WARNING: py:class reference target not found: path object
<https://ci-beam.apache.org/job/beam_PreCommit_PythonDocs_Cron/ws/src/sdks/python/test-suites/tox/pycommon/build/srcs/sdks/python/target/.tox-py38-docs/py38-docs/lib/python3.8/site-packages/apache_beam/dataframe/io.py>:docstring of apache_beam.dataframe.io.read_feather:: WARNING: py:class reference target not found: file-like object
<https://ci-beam.apache.org/job/beam_PreCommit_PythonDocs_Cron/ws/src/sdks/python/test-suites/tox/pycommon/build/srcs/sdks/python/target/.tox-py38-docs/py38-docs/lib/python3.8/site-packages/apache_beam/dataframe/io.py>:docstring of apache_beam.dataframe.io.read_feather:: WARNING: py:class reference target not found: sequence
<https://ci-beam.apache.org/job/beam_PreCommit_PythonDocs_Cron/ws/src/sdks/python/test-suites/tox/pycommon/build/srcs/sdks/python/target/.tox-py38-docs/py38-docs/lib/python3.8/site-packages/apache_beam/dataframe/io.py>:docstring of apache_beam.dataframe.io.read_feather:: WARNING: py:class reference target not found: default None
<https://ci-beam.apache.org/job/beam_PreCommit_PythonDocs_Cron/ws/src/sdks/python/test-suites/tox/pycommon/build/srcs/sdks/python/target/.tox-py38-docs/py38-docs/lib/python3.8/site-packages/apache_beam/dataframe/io.py>:docstring of apache_beam.dataframe.io.read_feather:: WARNING: py:class reference target not found: default True
<https://ci-beam.apache.org/job/beam_PreCommit_PythonDocs_Cron/ws/src/sdks/python/test-suites/tox/pycommon/build/srcs/sdks/python/target/.tox-py38-docs/py38-docs/lib/python3.8/site-packages/apache_beam/dataframe/io.py>:docstring of apache_beam.dataframe.io.read_feather:: WARNING: py:class reference target not found: optional
<https://ci-beam.apache.org/job/beam_PreCommit_PythonDocs_Cron/ws/src/sdks/python/test-suites/tox/pycommon/build/srcs/sdks/python/target/.tox-py38-docs/py38-docs/lib/python3.8/site-packages/apache_beam/dataframe/io.py>:docstring of apache_beam.dataframe.io.read_feather:: WARNING: py:class reference target not found: type of object stored in file
<https://ci-beam.apache.org/job/beam_PreCommit_PythonDocs_Cron/ws/src/sdks/python/test-suites/tox/pycommon/build/srcs/sdks/python/target/.tox-py38-docs/py38-docs/lib/python3.8/site-packages/apache_beam/dataframe/io.py>:docstring of apache_beam.dataframe.io.read_parquet:: WARNING: py:class reference target not found: path object
<https://ci-beam.apache.org/job/beam_PreCommit_PythonDocs_Cron/ws/src/sdks/python/test-suites/tox/pycommon/build/srcs/sdks/python/target/.tox-py38-docs/py38-docs/lib/python3.8/site-packages/apache_beam/dataframe/io.py>:docstring of apache_beam.dataframe.io.read_parquet:: WARNING: py:class reference target not found: file-like object
<https://ci-beam.apache.org/job/beam_PreCommit_PythonDocs_Cron/ws/src/sdks/python/test-suites/tox/pycommon/build/srcs/sdks/python/target/.tox-py38-docs/py38-docs/lib/python3.8/site-packages/apache_beam/dataframe/io.py>:docstring of apache_beam.dataframe.io.read_parquet:: WARNING: py:class reference target not found: {'auto'
<https://ci-beam.apache.org/job/beam_PreCommit_PythonDocs_Cron/ws/src/sdks/python/test-suites/tox/pycommon/build/srcs/sdks/python/target/.tox-py38-docs/py38-docs/lib/python3.8/site-packages/apache_beam/dataframe/io.py>:docstring of apache_beam.dataframe.io.read_parquet:: WARNING: py:class reference target not found: 'pyarrow'
<https://ci-beam.apache.org/job/beam_PreCommit_PythonDocs_Cron/ws/src/sdks/python/test-suites/tox/pycommon/build/srcs/sdks/python/target/.tox-py38-docs/py38-docs/lib/python3.8/site-packages/apache_beam/dataframe/io.py>:docstring of apache_beam.dataframe.io.read_parquet:: WARNING: py:class reference target not found: 'fastparquet'}
<https://ci-beam.apache.org/job/beam_PreCommit_PythonDocs_Cron/ws/src/sdks/python/test-suites/tox/pycommon/build/srcs/sdks/python/target/.tox-py38-docs/py38-docs/lib/python3.8/site-packages/apache_beam/dataframe/io.py>:docstring of apache_beam.dataframe.io.read_parquet:: WARNING: py:class reference target not found: default 'auto'
<https://ci-beam.apache.org/job/beam_PreCommit_PythonDocs_Cron/ws/src/sdks/python/test-suites/tox/pycommon/build/srcs/sdks/python/target/.tox-py38-docs/py38-docs/lib/python3.8/site-packages/apache_beam/dataframe/io.py>:docstring of apache_beam.dataframe.io.read_parquet:: WARNING: py:class reference target not found: default=None
<https://ci-beam.apache.org/job/beam_PreCommit_PythonDocs_Cron/ws/src/sdks/python/test-suites/tox/pycommon/build/srcs/sdks/python/target/.tox-py38-docs/py38-docs/lib/python3.8/site-packages/apache_beam/dataframe/io.py>:docstring of apache_beam.dataframe.io.read_parquet:: WARNING: py:class reference target not found: optional
<https://ci-beam.apache.org/job/beam_PreCommit_PythonDocs_Cron/ws/src/sdks/python/test-suites/tox/pycommon/build/srcs/sdks/python/target/.tox-py38-docs/py38-docs/lib/python3.8/site-packages/apache_beam/dataframe/io.py>:docstring of apache_beam.dataframe.io.read_parquet:: WARNING: py:class reference target not found: default False
<https://ci-beam.apache.org/job/beam_PreCommit_PythonDocs_Cron/ws/src/sdks/python/test-suites/tox/pycommon/build/srcs/sdks/python/target/.tox-py38-docs/py38-docs/lib/python3.8/site-packages/apache_beam/dataframe/io.py>:docstring of apache_beam.dataframe.io.read_sas:: WARNING: py:class reference target not found: path object
<https://ci-beam.apache.org/job/beam_PreCommit_PythonDocs_Cron/ws/src/sdks/python/test-suites/tox/pycommon/build/srcs/sdks/python/target/.tox-py38-docs/py38-docs/lib/python3.8/site-packages/apache_beam/dataframe/io.py>:docstring of apache_beam.dataframe.io.read_sas:: WARNING: py:class reference target not found: file-like object
<https://ci-beam.apache.org/job/beam_PreCommit_PythonDocs_Cron/ws/src/sdks/python/test-suites/tox/pycommon/build/srcs/sdks/python/target/.tox-py38-docs/py38-docs/lib/python3.8/site-packages/apache_beam/dataframe/io.py>:docstring of apache_beam.dataframe.io.read_sas:: WARNING: py:class reference target not found: str {'xport'
<https://ci-beam.apache.org/job/beam_PreCommit_PythonDocs_Cron/ws/src/sdks/python/test-suites/tox/pycommon/build/srcs/sdks/python/target/.tox-py38-docs/py38-docs/lib/python3.8/site-packages/apache_beam/dataframe/io.py>:docstring of apache_beam.dataframe.io.read_sas:: WARNING: py:class reference target not found: 'sas7bdat'}
<https://ci-beam.apache.org/job/beam_PreCommit_PythonDocs_Cron/ws/src/sdks/python/test-suites/tox/pycommon/build/srcs/sdks/python/target/.tox-py38-docs/py38-docs/lib/python3.8/site-packages/apache_beam/dataframe/io.py>:docstring of apache_beam.dataframe.io.read_sas:: WARNING: py:class reference target not found: identifier of index column
<https://ci-beam.apache.org/job/beam_PreCommit_PythonDocs_Cron/ws/src/sdks/python/test-suites/tox/pycommon/build/srcs/sdks/python/target/.tox-py38-docs/py38-docs/lib/python3.8/site-packages/apache_beam/dataframe/io.py>:docstring of apache_beam.dataframe.io.read_sas:: WARNING: py:class reference target not found: defaults to None
<https://ci-beam.apache.org/job/beam_PreCommit_PythonDocs_Cron/ws/src/sdks/python/test-suites/tox/pycommon/build/srcs/sdks/python/target/.tox-py38-docs/py38-docs/lib/python3.8/site-packages/apache_beam/dataframe/io.py>:docstring of apache_beam.dataframe.io.read_sas:: WARNING: py:class reference target not found: default is None
<https://ci-beam.apache.org/job/beam_PreCommit_PythonDocs_Cron/ws/src/sdks/python/test-suites/tox/pycommon/build/srcs/sdks/python/target/.tox-py38-docs/py38-docs/lib/python3.8/site-packages/apache_beam/dataframe/io.py>:docstring of apache_beam.dataframe.io.read_sas:: WARNING: py:class reference target not found: defaults to False
<https://ci-beam.apache.org/job/beam_PreCommit_PythonDocs_Cron/ws/src/sdks/python/test-suites/tox/pycommon/build/srcs/sdks/python/target/.tox-py38-docs/py38-docs/lib/python3.8/site-packages/apache_beam/dataframe/io.py>:docstring of apache_beam.dataframe.io.read_spss:: WARNING: py:class reference target not found: Path
<https://ci-beam.apache.org/job/beam_PreCommit_PythonDocs_Cron/ws/src/sdks/python/test-suites/tox/pycommon/build/srcs/sdks/python/target/.tox-py38-docs/py38-docs/lib/python3.8/site-packages/apache_beam/dataframe/io.py>:docstring of apache_beam.dataframe.io.read_spss:: WARNING: py:class reference target not found: list-like
<https://ci-beam.apache.org/job/beam_PreCommit_PythonDocs_Cron/ws/src/sdks/python/test-suites/tox/pycommon/build/srcs/sdks/python/target/.tox-py38-docs/py38-docs/lib/python3.8/site-packages/apache_beam/dataframe/io.py>:docstring of apache_beam.dataframe.io.read_spss:: WARNING: py:class reference target not found: optional
<https://ci-beam.apache.org/job/beam_PreCommit_PythonDocs_Cron/ws/src/sdks/python/test-suites/tox/pycommon/build/srcs/sdks/python/target/.tox-py38-docs/py38-docs/lib/python3.8/site-packages/apache_beam/dataframe/io.py>:docstring of apache_beam.dataframe.io.read_spss:: WARNING: py:class reference target not found: default is True
<https://ci-beam.apache.org/job/beam_PreCommit_PythonDocs_Cron/ws/src/sdks/python/test-suites/tox/pycommon/build/srcs/sdks/python/target/.tox-py38-docs/py38-docs/lib/python3.8/site-packages/apache_beam/dataframe/io.py>:docstring of apache_beam.dataframe.io.read_stata:: WARNING: py:class reference target not found: path object
<https://ci-beam.apache.org/job/beam_PreCommit_PythonDocs_Cron/ws/src/sdks/python/test-suites/tox/pycommon/build/srcs/sdks/python/target/.tox-py38-docs/py38-docs/lib/python3.8/site-packages/apache_beam/dataframe/io.py>:docstring of apache_beam.dataframe.io.read_stata:: WARNING: py:class reference target not found: file-like object
<https://ci-beam.apache.org/job/beam_PreCommit_PythonDocs_Cron/ws/src/sdks/python/test-suites/tox/pycommon/build/srcs/sdks/python/target/.tox-py38-docs/py38-docs/lib/python3.8/site-packages/apache_beam/dataframe/io.py>:docstring of apache_beam.dataframe.io.read_stata:: WARNING: py:class reference target not found: default True
<https://ci-beam.apache.org/job/beam_PreCommit_PythonDocs_Cron/ws/src/sdks/python/test-suites/tox/pycommon/build/srcs/sdks/python/target/.tox-py38-docs/py38-docs/lib/python3.8/site-packages/apache_beam/dataframe/io.py>:docstring of apache_beam.dataframe.io.read_stata:: WARNING: py:class reference target not found: default True
<https://ci-beam.apache.org/job/beam_PreCommit_PythonDocs_Cron/ws/src/sdks/python/test-suites/tox/pycommon/build/srcs/sdks/python/target/.tox-py38-docs/py38-docs/lib/python3.8/site-packages/apache_beam/dataframe/io.py>:docstring of apache_beam.dataframe.io.read_stata:: WARNING: py:class reference target not found: optional
<https://ci-beam.apache.org/job/beam_PreCommit_PythonDocs_Cron/ws/src/sdks/python/test-suites/tox/pycommon/build/srcs/sdks/python/target/.tox-py38-docs/py38-docs/lib/python3.8/site-packages/apache_beam/dataframe/io.py>:docstring of apache_beam.dataframe.io.read_stata:: WARNING: py:class reference target not found: default False
<https://ci-beam.apache.org/job/beam_PreCommit_PythonDocs_Cron/ws/src/sdks/python/test-suites/tox/pycommon/build/srcs/sdks/python/target/.tox-py38-docs/py38-docs/lib/python3.8/site-packages/apache_beam/dataframe/io.py>:docstring of apache_beam.dataframe.io.read_stata:: WARNING: py:class reference target not found: default True
<https://ci-beam.apache.org/job/beam_PreCommit_PythonDocs_Cron/ws/src/sdks/python/test-suites/tox/pycommon/build/srcs/sdks/python/target/.tox-py38-docs/py38-docs/lib/python3.8/site-packages/apache_beam/dataframe/io.py>:docstring of apache_beam.dataframe.io.read_stata:: WARNING: py:class reference target not found: default True
<https://ci-beam.apache.org/job/beam_PreCommit_PythonDocs_Cron/ws/src/sdks/python/test-suites/tox/pycommon/build/srcs/sdks/python/target/.tox-py38-docs/py38-docs/lib/python3.8/site-packages/apache_beam/dataframe/io.py>:docstring of apache_beam.dataframe.io.read_stata:: WARNING: py:class reference target not found: default None
<https://ci-beam.apache.org/job/beam_PreCommit_PythonDocs_Cron/ws/src/sdks/python/test-suites/tox/pycommon/build/srcs/sdks/python/target/.tox-py38-docs/py38-docs/lib/python3.8/site-packages/apache_beam/dataframe/io.py>:docstring of apache_beam.dataframe.io.read_stata:: WARNING: py:class reference target not found: default False
<https://ci-beam.apache.org/job/beam_PreCommit_PythonDocs_Cron/ws/src/sdks/python/test-suites/tox/pycommon/build/srcs/sdks/python/target/.tox-py38-docs/py38-docs/lib/python3.8/site-packages/apache_beam/dataframe/io.py>:docstring of apache_beam.dataframe.io.read_stata:: WARNING: py:class reference target not found: default 'infer'
<https://ci-beam.apache.org/job/beam_PreCommit_PythonDocs_Cron/ws/src/sdks/python/test-suites/tox/pycommon/build/srcs/sdks/python/target/.tox-py38-docs/py38-docs/lib/python3.8/site-packages/apache_beam/dataframe/io.py>:docstring of apache_beam.dataframe.io.read_stata:: WARNING: py:class reference target not found: optional
<https://ci-beam.apache.org/job/beam_PreCommit_PythonDocs_Cron/ws/src/sdks/python/test-suites/tox/pycommon/build/srcs/sdks/python/target/.tox-py38-docs/py38-docs/lib/python3.8/site-packages/apache_beam/dataframe/io.py>:docstring of apache_beam.dataframe.io.read_stata:: WARNING: py:class reference target not found: StataReader
<https://ci-beam.apache.org/job/beam_PreCommit_PythonDocs_Cron/ws/src/sdks/python/test-suites/tox/pycommon/build/srcs/sdks/python/target/.tox-py38-docs/py38-docs/lib/python3.8/site-packages/apache_beam/dataframe/io.py>:docstring of apache_beam.dataframe.io.read_stata:67: WARNING: py:func reference target not found: io.stata.StataReader
<https://ci-beam.apache.org/job/beam_PreCommit_PythonDocs_Cron/ws/src/sdks/python/test-suites/tox/pycommon/build/srcs/sdks/python/target/.tox-py38-docs/py38-docs/lib/python3.8/site-packages/apache_beam/dataframe/io.py>:docstring of apache_beam.dataframe.io.read_stata:69: WARNING: py:func reference target not found: DeferredDataFrame.to_stata
<https://ci-beam.apache.org/job/beam_PreCommit_PythonDocs_Cron/ws/src/sdks/python/test-suites/tox/pycommon/build/srcs/sdks/python/target/.tox-py38-docs/py38-docs/lib/python3.8/site-packages/apache_beam/dataframe/io.py>:docstring of apache_beam.dataframe.io.to_excel:: WARNING: py:class reference target not found: path-like
<https://ci-beam.apache.org/job/beam_PreCommit_PythonDocs_Cron/ws/src/sdks/python/test-suites/tox/pycommon/build/srcs/sdks/python/target/.tox-py38-docs/py38-docs/lib/python3.8/site-packages/apache_beam/dataframe/io.py>:docstring of apache_beam.dataframe.io.to_excel:: WARNING: py:class reference target not found: file-like
<https://ci-beam.apache.org/job/beam_PreCommit_PythonDocs_Cron/ws/src/sdks/python/test-suites/tox/pycommon/build/srcs/sdks/python/target/.tox-py38-docs/py38-docs/lib/python3.8/site-packages/apache_beam/dataframe/io.py>:docstring of apache_beam.dataframe.io.to_excel:: WARNING: py:class reference target not found: ExcelWriter object
<https://ci-beam.apache.org/job/beam_PreCommit_PythonDocs_Cron/ws/src/sdks/python/test-suites/tox/pycommon/build/srcs/sdks/python/target/.tox-py38-docs/py38-docs/lib/python3.8/site-packages/apache_beam/dataframe/io.py>:docstring of apache_beam.dataframe.io.to_excel:: WARNING: py:class reference target not found: default 'Sheet1'
<https://ci-beam.apache.org/job/beam_PreCommit_PythonDocs_Cron/ws/src/sdks/python/test-suites/tox/pycommon/build/srcs/sdks/python/target/.tox-py38-docs/py38-docs/lib/python3.8/site-packages/apache_beam/dataframe/io.py>:docstring of apache_beam.dataframe.io.to_excel:: WARNING: py:class reference target not found: default ''
<https://ci-beam.apache.org/job/beam_PreCommit_PythonDocs_Cron/ws/src/sdks/python/test-suites/tox/pycommon/build/srcs/sdks/python/target/.tox-py38-docs/py38-docs/lib/python3.8/site-packages/apache_beam/dataframe/io.py>:docstring of apache_beam.dataframe.io.to_excel:: WARNING: py:class reference target not found: optional
<https://ci-beam.apache.org/job/beam_PreCommit_PythonDocs_Cron/ws/src/sdks/python/test-suites/tox/pycommon/build/srcs/sdks/python/target/.tox-py38-docs/py38-docs/lib/python3.8/site-packages/apache_beam/dataframe/io.py>:docstring of apache_beam.dataframe.io.to_excel:: WARNING: py:class reference target not found: sequence
<https://ci-beam.apache.org/job/beam_PreCommit_PythonDocs_Cron/ws/src/sdks/python/test-suites/tox/pycommon/build/srcs/sdks/python/target/.tox-py38-docs/py38-docs/lib/python3.8/site-packages/apache_beam/dataframe/io.py>:docstring of apache_beam.dataframe.io.to_excel:: WARNING: py:class reference target not found: list of str
<https://ci-beam.apache.org/job/beam_PreCommit_PythonDocs_Cron/ws/src/sdks/python/test-suites/tox/pycommon/build/srcs/sdks/python/target/.tox-py38-docs/py38-docs/lib/python3.8/site-packages/apache_beam/dataframe/io.py>:docstring of apache_beam.dataframe.io.to_excel:: WARNING: py:class reference target not found: optional
<https://ci-beam.apache.org/job/beam_PreCommit_PythonDocs_Cron/ws/src/sdks/python/test-suites/tox/pycommon/build/srcs/sdks/python/target/.tox-py38-docs/py38-docs/lib/python3.8/site-packages/apache_beam/dataframe/io.py>:docstring of apache_beam.dataframe.io.to_excel:: WARNING: py:class reference target not found: list of str
<https://ci-beam.apache.org/job/beam_PreCommit_PythonDocs_Cron/ws/src/sdks/python/test-suites/tox/pycommon/build/srcs/sdks/python/target/.tox-py38-docs/py38-docs/lib/python3.8/site-packages/apache_beam/dataframe/io.py>:docstring of apache_beam.dataframe.io.to_excel:: WARNING: py:class reference target not found: default True
<https://ci-beam.apache.org/job/beam_PreCommit_PythonDocs_Cron/ws/src/sdks/python/test-suites/tox/pycommon/build/srcs/sdks/python/target/.tox-py38-docs/py38-docs/lib/python3.8/site-packages/apache_beam/dataframe/io.py>:docstring of apache_beam.dataframe.io.to_excel:: WARNING: py:class reference target not found: default True
<https://ci-beam.apache.org/job/beam_PreCommit_PythonDocs_Cron/ws/src/sdks/python/test-suites/tox/pycommon/build/srcs/sdks/python/target/.tox-py38-docs/py38-docs/lib/python3.8/site-packages/apache_beam/dataframe/io.py>:docstring of apache_beam.dataframe.io.to_excel:: WARNING: py:class reference target not found: sequence
<https://ci-beam.apache.org/job/beam_PreCommit_PythonDocs_Cron/ws/src/sdks/python/test-suites/tox/pycommon/build/srcs/sdks/python/target/.tox-py38-docs/py38-docs/lib/python3.8/site-packages/apache_beam/dataframe/io.py>:docstring of apache_beam.dataframe.io.to_excel:: WARNING: py:class reference target not found: optional
<https://ci-beam.apache.org/job/beam_PreCommit_PythonDocs_Cron/ws/src/sdks/python/test-suites/tox/pycommon/build/srcs/sdks/python/target/.tox-py38-docs/py38-docs/lib/python3.8/site-packages/apache_beam/dataframe/io.py>:docstring of apache_beam.dataframe.io.to_excel:: WARNING: py:class reference target not found: default 0
<https://ci-beam.apache.org/job/beam_PreCommit_PythonDocs_Cron/ws/src/sdks/python/test-suites/tox/pycommon/build/srcs/sdks/python/target/.tox-py38-docs/py38-docs/lib/python3.8/site-packages/apache_beam/dataframe/io.py>:docstring of apache_beam.dataframe.io.to_excel:: WARNING: py:class reference target not found: default 0
<https://ci-beam.apache.org/job/beam_PreCommit_PythonDocs_Cron/ws/src/sdks/python/test-suites/tox/pycommon/build/srcs/sdks/python/target/.tox-py38-docs/py38-docs/lib/python3.8/site-packages/apache_beam/dataframe/io.py>:docstring of apache_beam.dataframe.io.to_excel:: WARNING: py:class reference target not found: optional
<https://ci-beam.apache.org/job/beam_PreCommit_PythonDocs_Cron/ws/src/sdks/python/test-suites/tox/pycommon/build/srcs/sdks/python/target/.tox-py38-docs/py38-docs/lib/python3.8/site-packages/apache_beam/dataframe/io.py>:docstring of apache_beam.dataframe.io.to_excel:: WARNING: py:class reference target not found: default True
<https://ci-beam.apache.org/job/beam_PreCommit_PythonDocs_Cron/ws/src/sdks/python/test-suites/tox/pycommon/build/srcs/sdks/python/target/.tox-py38-docs/py38-docs/lib/python3.8/site-packages/apache_beam/dataframe/io.py>:docstring of apache_beam.dataframe.io.to_excel:: WARNING: py:class reference target not found: optional
<https://ci-beam.apache.org/job/beam_PreCommit_PythonDocs_Cron/ws/src/sdks/python/test-suites/tox/pycommon/build/srcs/sdks/python/target/.tox-py38-docs/py38-docs/lib/python3.8/site-packages/apache_beam/dataframe/io.py>:docstring of apache_beam.dataframe.io.to_excel:: WARNING: py:class reference target not found: default 'inf'
<https://ci-beam.apache.org/job/beam_PreCommit_PythonDocs_Cron/ws/src/sdks/python/test-suites/tox/pycommon/build/srcs/sdks/python/target/.tox-py38-docs/py38-docs/lib/python3.8/site-packages/apache_beam/dataframe/io.py>:docstring of apache_beam.dataframe.io.to_excel:: WARNING: py:class reference target not found: default True
<https://ci-beam.apache.org/job/beam_PreCommit_PythonDocs_Cron/ws/src/sdks/python/test-suites/tox/pycommon/build/srcs/sdks/python/target/.tox-py38-docs/py38-docs/lib/python3.8/site-packages/apache_beam/dataframe/io.py>:docstring of apache_beam.dataframe.io.to_excel:: WARNING: py:class reference target not found: tuple of int
<https://ci-beam.apache.org/job/beam_PreCommit_PythonDocs_Cron/ws/src/sdks/python/test-suites/tox/pycommon/build/srcs/sdks/python/target/.tox-py38-docs/py38-docs/lib/python3.8/site-packages/apache_beam/dataframe/io.py>:docstring of apache_beam.dataframe.io.to_excel:: WARNING: py:class reference target not found: length 2
<https://ci-beam.apache.org/job/beam_PreCommit_PythonDocs_Cron/ws/src/sdks/python/test-suites/tox/pycommon/build/srcs/sdks/python/target/.tox-py38-docs/py38-docs/lib/python3.8/site-packages/apache_beam/dataframe/io.py>:docstring of apache_beam.dataframe.io.to_excel:: WARNING: py:class reference target not found: optional
<https://ci-beam.apache.org/job/beam_PreCommit_PythonDocs_Cron/ws/src/sdks/python/test-suites/tox/pycommon/build/srcs/sdks/python/target/.tox-py38-docs/py38-docs/lib/python3.8/site-packages/apache_beam/dataframe/io.py>:docstring of apache_beam.dataframe.io.to_excel:: WARNING: py:class reference target not found: optional
<https://ci-beam.apache.org/job/beam_PreCommit_PythonDocs_Cron/ws/src/sdks/python/test-suites/tox/pycommon/build/srcs/sdks/python/target/.tox-py38-docs/py38-docs/lib/python3.8/site-packages/apache_beam/dataframe/io.py>:docstring of apache_beam.dataframe.io.to_excel:79: WARNING: py:func reference target not found: ExcelWriter
<https://ci-beam.apache.org/job/beam_PreCommit_PythonDocs_Cron/ws/src/sdks/python/test-suites/tox/pycommon/build/srcs/sdks/python/target/.tox-py38-docs/py38-docs/lib/python3.8/site-packages/apache_beam/dataframe/io.py>:docstring of apache_beam.dataframe.io.to_excel:89: WARNING: py:meth reference target not found: DeferredDataFrame.to_csv
<https://ci-beam.apache.org/job/beam_PreCommit_PythonDocs_Cron/ws/src/sdks/python/test-suites/tox/pycommon/build/srcs/sdks/python/target/.tox-py38-docs/py38-docs/lib/python3.8/site-packages/apache_beam/dataframe/io.py>:docstring of apache_beam.dataframe.io.to_feather:: WARNING: py:class reference target not found: path object
<https://ci-beam.apache.org/job/beam_PreCommit_PythonDocs_Cron/ws/src/sdks/python/test-suites/tox/pycommon/build/srcs/sdks/python/target/.tox-py38-docs/py38-docs/lib/python3.8/site-packages/apache_beam/dataframe/io.py>:docstring of apache_beam.dataframe.io.to_feather:: WARNING: py:class reference target not found: file-like object
<https://ci-beam.apache.org/job/beam_PreCommit_PythonDocs_Cron/ws/src/sdks/python/test-suites/tox/pycommon/build/srcs/sdks/python/target/.tox-py38-docs/py38-docs/lib/python3.8/site-packages/apache_beam/dataframe/io.py>:docstring of apache_beam.dataframe.io.to_feather:7: WARNING: py:func reference target not found: pyarrow.feather.write_feather
<https://ci-beam.apache.org/job/beam_PreCommit_PythonDocs_Cron/ws/src/sdks/python/test-suites/tox/pycommon/build/srcs/sdks/python/target/.tox-py38-docs/py38-docs/lib/python3.8/site-packages/apache_beam/dataframe/io.py>:docstring of apache_beam.dataframe.io.to_parquet:: WARNING: py:class reference target not found: path object
<https://ci-beam.apache.org/job/beam_PreCommit_PythonDocs_Cron/ws/src/sdks/python/test-suites/tox/pycommon/build/srcs/sdks/python/target/.tox-py38-docs/py38-docs/lib/python3.8/site-packages/apache_beam/dataframe/io.py>:docstring of apache_beam.dataframe.io.to_parquet:: WARNING: py:class reference target not found: file-like object
<https://ci-beam.apache.org/job/beam_PreCommit_PythonDocs_Cron/ws/src/sdks/python/test-suites/tox/pycommon/build/srcs/sdks/python/target/.tox-py38-docs/py38-docs/lib/python3.8/site-packages/apache_beam/dataframe/io.py>:docstring of apache_beam.dataframe.io.to_parquet:: WARNING: py:class reference target not found: default None
<https://ci-beam.apache.org/job/beam_PreCommit_PythonDocs_Cron/ws/src/sdks/python/test-suites/tox/pycommon/build/srcs/sdks/python/target/.tox-py38-docs/py38-docs/lib/python3.8/site-packages/apache_beam/dataframe/io.py>:docstring of apache_beam.dataframe.io.to_parquet:: WARNING: py:class reference target not found: {'auto'
<https://ci-beam.apache.org/job/beam_PreCommit_PythonDocs_Cron/ws/src/sdks/python/test-suites/tox/pycommon/build/srcs/sdks/python/target/.tox-py38-docs/py38-docs/lib/python3.8/site-packages/apache_beam/dataframe/io.py>:docstring of apache_beam.dataframe.io.to_parquet:: WARNING: py:class reference target not found: 'pyarrow'
<https://ci-beam.apache.org/job/beam_PreCommit_PythonDocs_Cron/ws/src/sdks/python/test-suites/tox/pycommon/build/srcs/sdks/python/target/.tox-py38-docs/py38-docs/lib/python3.8/site-packages/apache_beam/dataframe/io.py>:docstring of apache_beam.dataframe.io.to_parquet:: WARNING: py:class reference target not found: 'fastparquet'}
<https://ci-beam.apache.org/job/beam_PreCommit_PythonDocs_Cron/ws/src/sdks/python/test-suites/tox/pycommon/build/srcs/sdks/python/target/.tox-py38-docs/py38-docs/lib/python3.8/site-packages/apache_beam/dataframe/io.py>:docstring of apache_beam.dataframe.io.to_parquet:: WARNING: py:class reference target not found: default 'auto'
<https://ci-beam.apache.org/job/beam_PreCommit_PythonDocs_Cron/ws/src/sdks/python/test-suites/tox/pycommon/build/srcs/sdks/python/target/.tox-py38-docs/py38-docs/lib/python3.8/site-packages/apache_beam/dataframe/io.py>:docstring of apache_beam.dataframe.io.to_parquet:: WARNING: py:class reference target not found: {'snappy'
<https://ci-beam.apache.org/job/beam_PreCommit_PythonDocs_Cron/ws/src/sdks/python/test-suites/tox/pycommon/build/srcs/sdks/python/target/.tox-py38-docs/py38-docs/lib/python3.8/site-packages/apache_beam/dataframe/io.py>:docstring of apache_beam.dataframe.io.to_parquet:: WARNING: py:class reference target not found: 'gzip'
<https://ci-beam.apache.org/job/beam_PreCommit_PythonDocs_Cron/ws/src/sdks/python/test-suites/tox/pycommon/build/srcs/sdks/python/target/.tox-py38-docs/py38-docs/lib/python3.8/site-packages/apache_beam/dataframe/io.py>:docstring of apache_beam.dataframe.io.to_parquet:: WARNING: py:class reference target not found: 'brotli'
<https://ci-beam.apache.org/job/beam_PreCommit_PythonDocs_Cron/ws/src/sdks/python/test-suites/tox/pycommon/build/srcs/sdks/python/target/.tox-py38-docs/py38-docs/lib/python3.8/site-packages/apache_beam/dataframe/io.py>:docstring of apache_beam.dataframe.io.to_parquet:: WARNING: py:class reference target not found: None}
<https://ci-beam.apache.org/job/beam_PreCommit_PythonDocs_Cron/ws/src/sdks/python/test-suites/tox/pycommon/build/srcs/sdks/python/target/.tox-py38-docs/py38-docs/lib/python3.8/site-packages/apache_beam/dataframe/io.py>:docstring of apache_beam.dataframe.io.to_parquet:: WARNING: py:class reference target not found: default 'snappy'
<https://ci-beam.apache.org/job/beam_PreCommit_PythonDocs_Cron/ws/src/sdks/python/test-suites/tox/pycommon/build/srcs/sdks/python/target/.tox-py38-docs/py38-docs/lib/python3.8/site-packages/apache_beam/dataframe/io.py>:docstring of apache_beam.dataframe.io.to_parquet:: WARNING: py:class reference target not found: default None
<https://ci-beam.apache.org/job/beam_PreCommit_PythonDocs_Cron/ws/src/sdks/python/test-suites/tox/pycommon/build/srcs/sdks/python/target/.tox-py38-docs/py38-docs/lib/python3.8/site-packages/apache_beam/dataframe/io.py>:docstring of apache_beam.dataframe.io.to_parquet:: WARNING: py:class reference target not found: optional
<https://ci-beam.apache.org/job/beam_PreCommit_PythonDocs_Cron/ws/src/sdks/python/test-suites/tox/pycommon/build/srcs/sdks/python/target/.tox-py38-docs/py38-docs/lib/python3.8/site-packages/apache_beam/dataframe/io.py>:docstring of apache_beam.dataframe.io.to_parquet:: WARNING: py:class reference target not found: default None
<https://ci-beam.apache.org/job/beam_PreCommit_PythonDocs_Cron/ws/src/sdks/python/test-suites/tox/pycommon/build/srcs/sdks/python/target/.tox-py38-docs/py38-docs/lib/python3.8/site-packages/apache_beam/dataframe/io.py>:docstring of apache_beam.dataframe.io.to_parquet:: WARNING: py:class reference target not found: optional
<https://ci-beam.apache.org/job/beam_PreCommit_PythonDocs_Cron/ws/src/sdks/python/test-suites/tox/pycommon/build/srcs/sdks/python/target/.tox-py38-docs/py38-docs/lib/python3.8/site-packages/apache_beam/dataframe/io.py>:docstring of apache_beam.dataframe.io.to_parquet:: WARNING: py:class reference target not found: bytes if no path argument is provided else None
<https://ci-beam.apache.org/job/beam_PreCommit_PythonDocs_Cron/ws/src/sdks/python/test-suites/tox/pycommon/build/srcs/sdks/python/target/.tox-py38-docs/py38-docs/lib/python3.8/site-packages/apache_beam/dataframe/io.py>:docstring of apache_beam.dataframe.io.to_parquet:60: WARNING: py:func reference target not found: DeferredDataFrame.to_csv
<https://ci-beam.apache.org/job/beam_PreCommit_PythonDocs_Cron/ws/src/sdks/python/test-suites/tox/pycommon/build/srcs/sdks/python/target/.tox-py38-docs/py38-docs/lib/python3.8/site-packages/apache_beam/dataframe/io.py>:docstring of apache_beam.dataframe.io.to_parquet:63: WARNING: py:func reference target not found: DeferredDataFrame.to_sql
<https://ci-beam.apache.org/job/beam_PreCommit_PythonDocs_Cron/ws/src/sdks/python/test-suites/tox/pycommon/build/srcs/sdks/python/target/.tox-py38-docs/py38-docs/lib/python3.8/site-packages/apache_beam/dataframe/io.py>:docstring of apache_beam.dataframe.io.to_parquet:65: WARNING: py:func reference target not found: DeferredDataFrame.to_hdf
<https://ci-beam.apache.org/job/beam_PreCommit_PythonDocs_Cron/ws/src/sdks/python/test-suites/tox/pycommon/build/srcs/sdks/python/target/.tox-py38-docs/py38-docs/lib/python3.8/site-packages/apache_beam/dataframe/io.py>:docstring of apache_beam.dataframe.io.to_stata:: WARNING: py:class reference target not found: path object
<https://ci-beam.apache.org/job/beam_PreCommit_PythonDocs_Cron/ws/src/sdks/python/test-suites/tox/pycommon/build/srcs/sdks/python/target/.tox-py38-docs/py38-docs/lib/python3.8/site-packages/apache_beam/dataframe/io.py>:docstring of apache_beam.dataframe.io.to_stata:: WARNING: py:class reference target not found: buffer
<https://ci-beam.apache.org/job/beam_PreCommit_PythonDocs_Cron/ws/src/sdks/python/test-suites/tox/pycommon/build/srcs/sdks/python/target/.tox-py38-docs/py38-docs/lib/python3.8/site-packages/apache_beam/dataframe/io.py>:docstring of apache_beam.dataframe.io.to_stata:: WARNING: py:class reference target not found: datetime
<https://ci-beam.apache.org/job/beam_PreCommit_PythonDocs_Cron/ws/src/sdks/python/test-suites/tox/pycommon/build/srcs/sdks/python/target/.tox-py38-docs/py38-docs/lib/python3.8/site-packages/apache_beam/dataframe/io.py>:docstring of apache_beam.dataframe.io.to_stata:: WARNING: py:class reference target not found: optional
<https://ci-beam.apache.org/job/beam_PreCommit_PythonDocs_Cron/ws/src/sdks/python/test-suites/tox/pycommon/build/srcs/sdks/python/target/.tox-py38-docs/py38-docs/lib/python3.8/site-packages/apache_beam/dataframe/io.py>:docstring of apache_beam.dataframe.io.to_stata:: WARNING: py:class reference target not found: {114
<https://ci-beam.apache.org/job/beam_PreCommit_PythonDocs_Cron/ws/src/sdks/python/test-suites/tox/pycommon/build/srcs/sdks/python/target/.tox-py38-docs/py38-docs/lib/python3.8/site-packages/apache_beam/dataframe/io.py>:docstring of apache_beam.dataframe.io.to_stata:: WARNING: py:class reference target not found: 117
<https://ci-beam.apache.org/job/beam_PreCommit_PythonDocs_Cron/ws/src/sdks/python/test-suites/tox/pycommon/build/srcs/sdks/python/target/.tox-py38-docs/py38-docs/lib/python3.8/site-packages/apache_beam/dataframe/io.py>:docstring of apache_beam.dataframe.io.to_stata:: WARNING: py:class reference target not found: 118
<https://ci-beam.apache.org/job/beam_PreCommit_PythonDocs_Cron/ws/src/sdks/python/test-suites/tox/pycommon/build/srcs/sdks/python/target/.tox-py38-docs/py38-docs/lib/python3.8/site-packages/apache_beam/dataframe/io.py>:docstring of apache_beam.dataframe.io.to_stata:: WARNING: py:class reference target not found: 119
<https://ci-beam.apache.org/job/beam_PreCommit_PythonDocs_Cron/ws/src/sdks/python/test-suites/tox/pycommon/build/srcs/sdks/python/target/.tox-py38-docs/py38-docs/lib/python3.8/site-packages/apache_beam/dataframe/io.py>:docstring of apache_beam.dataframe.io.to_stata:: WARNING: py:class reference target not found: None}
<https://ci-beam.apache.org/job/beam_PreCommit_PythonDocs_Cron/ws/src/sdks/python/test-suites/tox/pycommon/build/srcs/sdks/python/target/.tox-py38-docs/py38-docs/lib/python3.8/site-packages/apache_beam/dataframe/io.py>:docstring of apache_beam.dataframe.io.to_stata:: WARNING: py:class reference target not found: default 114
<https://ci-beam.apache.org/job/beam_PreCommit_PythonDocs_Cron/ws/src/sdks/python/test-suites/tox/pycommon/build/srcs/sdks/python/target/.tox-py38-docs/py38-docs/lib/python3.8/site-packages/apache_beam/dataframe/io.py>:docstring of apache_beam.dataframe.io.to_stata:: WARNING: py:class reference target not found: optional
<https://ci-beam.apache.org/job/beam_PreCommit_PythonDocs_Cron/ws/src/sdks/python/test-suites/tox/pycommon/build/srcs/sdks/python/target/.tox-py38-docs/py38-docs/lib/python3.8/site-packages/apache_beam/dataframe/io.py>:docstring of apache_beam.dataframe.io.to_stata:: WARNING: py:class reference target not found: default 'infer'
<https://ci-beam.apache.org/job/beam_PreCommit_PythonDocs_Cron/ws/src/sdks/python/test-suites/tox/pycommon/build/srcs/sdks/python/target/.tox-py38-docs/py38-docs/lib/python3.8/site-packages/apache_beam/dataframe/io.py>:docstring of apache_beam.dataframe.io.to_stata:: WARNING: py:class reference target not found: optional
<https://ci-beam.apache.org/job/beam_PreCommit_PythonDocs_Cron/ws/src/sdks/python/test-suites/tox/pycommon/build/srcs/sdks/python/target/.tox-py38-docs/py38-docs/lib/python3.8/site-packages/apache_beam/dataframe/io.py>:docstring of apache_beam.dataframe.io.to_stata:: WARNING: py:class reference target not found: dict of dicts
<https://ci-beam.apache.org/job/beam_PreCommit_PythonDocs_Cron/ws/src/sdks/python/test-suites/tox/pycommon/build/srcs/sdks/python/target/.tox-py38-docs/py38-docs/lib/python3.8/site-packages/apache_beam/dataframe/io.py>:docstring of apache_beam.dataframe.io.to_stata:104: WARNING: py:func reference target not found: io.stata.StataWriter
<https://ci-beam.apache.org/job/beam_PreCommit_PythonDocs_Cron/ws/src/sdks/python/test-suites/tox/pycommon/build/srcs/sdks/python/target/.tox-py38-docs/py38-docs/lib/python3.8/site-packages/apache_beam/dataframe/io.py>:docstring of apache_beam.dataframe.io.to_stata:106: WARNING: py:func reference target not found: io.stata.StataWriter117
<https://ci-beam.apache.org/job/beam_PreCommit_PythonDocs_Cron/ws/src/sdks/python/test-suites/tox/pycommon/build/srcs/sdks/python/target/.tox-py38-docs/py38-docs/lib/python3.8/site-packages/apache_beam/dataframe/pandas_top_level_functions.py>:docstring of apache_beam.dataframe.pandas_top_level_functions.DeferredPandasModule.merge_ordered:1: WARNING: py:meth reference target not found: pandas.merge_ordered
<https://ci-beam.apache.org/job/beam_PreCommit_PythonDocs_Cron/ws/src/sdks/python/test-suites/tox/pycommon/build/srcs/sdks/python/target/.tox-py38-docs/py38-docs/lib/python3.8/site-packages/apache_beam/dataframe/pandas_top_level_functions.py>:docstring of apache_beam.dataframe.pandas_top_level_functions.DeferredPandasModule.test:1: WARNING: py:meth reference target not found: pandas.test
<https://ci-beam.apache.org/job/beam_PreCommit_PythonDocs_Cron/ws/src/sdks/python/test-suites/tox/pycommon/build/srcs/sdks/python/target/.tox-py38-docs/py38-docs/lib/python3.8/site-packages/apache_beam/dataframe/pandas_top_level_functions.py>:docstring of apache_beam.dataframe.pandas_top_level_functions.DeferredPandasModule.to_pickle:1: WARNING: py:meth reference target not found: pandas.to_pickle
Command exited with non-zero status 1
71.87user 2.40system 1:24.14elapsed 88%CPU (0avgtext+0avgdata 355172maxresident)k
152inputs+125944outputs (0major+118854minor)pagefaults 0swaps
[31mERROR: InvocationError for command /usr/bin/time scripts/generate_pydoc.sh (exited with code 1)
[0m[1mpy38-docs run-test-post: commands[0] | bash <https://ci-beam.apache.org/job/beam_PreCommit_PythonDocs_Cron/ws/src/sdks/python/test-suites/tox/pycommon/build/srcs/sdks/python/scripts/run_tox_cleanup.sh>
[0m___________________________________ summary ____________________________________
[31mERROR: py38-docs: commands failed
[0m
> Task :sdks:python:test-suites:tox:pycommon:docs FAILED
FAILURE: Build failed with an exception.
* What went wrong:
Execution failed for task ':sdks:python:test-suites:tox:pycommon:docs'.
> Process 'command 'sh'' finished with non-zero exit value 1
* Try:
> Run with --stacktrace option to get the stack trace.
> Run with --info or --debug option to get more log output.
> Run with --scan to get full insights.
* Get more help at https://help.gradle.org
BUILD FAILED in 2m 48s
14 actionable tasks: 8 executed, 4 from cache, 2 up-to-date
Publishing build scan...
https://gradle.com/s/u7ffjdhhl7jby
Build step 'Invoke Gradle script' changed build result to FAILURE
Build step 'Invoke Gradle script' marked build as failure
---------------------------------------------------------------------
To unsubscribe, e-mail: builds-unsubscribe@beam.apache.org
For additional commands, e-mail: builds-help@beam.apache.org
Jenkins build is back to normal : beam_PreCommit_PythonDocs_Cron #2133
Posted by Apache Jenkins Server <je...@builds.apache.org>.
See <https://ci-beam.apache.org/job/beam_PreCommit_PythonDocs_Cron/2133/display/redirect?page=changes>
---------------------------------------------------------------------
To unsubscribe, e-mail: builds-unsubscribe@beam.apache.org
For additional commands, e-mail: builds-help@beam.apache.org