You are viewing a plain text version of this content. The canonical link for it is here.
Posted to dev@lucene.apache.org by Policeman Jenkins Server <je...@thetaphi.de> on 2017/01/05 06:38:09 UTC
[JENKINS] Lucene-Solr-6.x-Solaris (64bit/jdk1.8.0) - Build # 597 -
Failure!
Build: https://jenkins.thetaphi.de/job/Lucene-Solr-6.x-Solaris/597/
Java: 64bit/jdk1.8.0 -XX:+UseCompressedOops -XX:+UseParallelGC
1 tests failed.
FAILED: junit.framework.TestSuite.org.apache.solr.cloud.TestSolrCloudWithSecureImpersonation
Error Message:
2 threads leaked from SUITE scope at org.apache.solr.cloud.TestSolrCloudWithSecureImpersonation: 1) Thread[id=788, name=jetty-launcher-153-thread-1-EventThread, state=TIMED_WAITING, group=TGRP-TestSolrCloudWithSecureImpersonation] at sun.misc.Unsafe.park(Native Method) at java.util.concurrent.locks.LockSupport.parkNanos(LockSupport.java:215) at java.util.concurrent.locks.AbstractQueuedSynchronizer.doAcquireSharedNanos(AbstractQueuedSynchronizer.java:1037) at java.util.concurrent.locks.AbstractQueuedSynchronizer.tryAcquireSharedNanos(AbstractQueuedSynchronizer.java:1328) at java.util.concurrent.CountDownLatch.await(CountDownLatch.java:277) at org.apache.curator.CuratorZookeeperClient.internalBlockUntilConnectedOrTimedOut(CuratorZookeeperClient.java:323) at org.apache.curator.RetryLoop.callWithRetry(RetryLoop.java:105) at org.apache.curator.framework.imps.GetDataBuilderImpl.pathInForeground(GetDataBuilderImpl.java:288) at org.apache.curator.framework.imps.GetDataBuilderImpl.forPath(GetDataBuilderImpl.java:279) at org.apache.curator.framework.imps.GetDataBuilderImpl.forPath(GetDataBuilderImpl.java:41) at org.apache.curator.framework.recipes.shared.SharedValue.readValue(SharedValue.java:244) at org.apache.curator.framework.recipes.shared.SharedValue.access$100(SharedValue.java:44) at org.apache.curator.framework.recipes.shared.SharedValue$1.process(SharedValue.java:61) at org.apache.curator.framework.imps.NamespaceWatcher.process(NamespaceWatcher.java:67) at org.apache.zookeeper.ClientCnxn$EventThread.processEvent(ClientCnxn.java:522) at org.apache.zookeeper.ClientCnxn$EventThread.run(ClientCnxn.java:498) 2) Thread[id=789, name=jetty-launcher-153-thread-2-EventThread, state=TIMED_WAITING, group=TGRP-TestSolrCloudWithSecureImpersonation] at sun.misc.Unsafe.park(Native Method) at java.util.concurrent.locks.LockSupport.parkNanos(LockSupport.java:215) at java.util.concurrent.locks.AbstractQueuedSynchronizer.doAcquireSharedNanos(AbstractQueuedSynchronizer.java:1037) at java.util.concurrent.locks.AbstractQueuedSynchronizer.tryAcquireSharedNanos(AbstractQueuedSynchronizer.java:1328) at java.util.concurrent.CountDownLatch.await(CountDownLatch.java:277) at org.apache.curator.CuratorZookeeperClient.internalBlockUntilConnectedOrTimedOut(CuratorZookeeperClient.java:323) at org.apache.curator.RetryLoop.callWithRetry(RetryLoop.java:105) at org.apache.curator.framework.imps.GetDataBuilderImpl.pathInForeground(GetDataBuilderImpl.java:288) at org.apache.curator.framework.imps.GetDataBuilderImpl.forPath(GetDataBuilderImpl.java:279) at org.apache.curator.framework.imps.GetDataBuilderImpl.forPath(GetDataBuilderImpl.java:41) at org.apache.curator.framework.recipes.shared.SharedValue.readValue(SharedValue.java:244) at org.apache.curator.framework.recipes.shared.SharedValue.access$100(SharedValue.java:44) at org.apache.curator.framework.recipes.shared.SharedValue$1.process(SharedValue.java:61) at org.apache.curator.framework.imps.NamespaceWatcher.process(NamespaceWatcher.java:67) at org.apache.zookeeper.ClientCnxn$EventThread.processEvent(ClientCnxn.java:522) at org.apache.zookeeper.ClientCnxn$EventThread.run(ClientCnxn.java:498)
Stack Trace:
com.carrotsearch.randomizedtesting.ThreadLeakError: 2 threads leaked from SUITE scope at org.apache.solr.cloud.TestSolrCloudWithSecureImpersonation:
1) Thread[id=788, name=jetty-launcher-153-thread-1-EventThread, state=TIMED_WAITING, group=TGRP-TestSolrCloudWithSecureImpersonation]
at sun.misc.Unsafe.park(Native Method)
at java.util.concurrent.locks.LockSupport.parkNanos(LockSupport.java:215)
at java.util.concurrent.locks.AbstractQueuedSynchronizer.doAcquireSharedNanos(AbstractQueuedSynchronizer.java:1037)
at java.util.concurrent.locks.AbstractQueuedSynchronizer.tryAcquireSharedNanos(AbstractQueuedSynchronizer.java:1328)
at java.util.concurrent.CountDownLatch.await(CountDownLatch.java:277)
at org.apache.curator.CuratorZookeeperClient.internalBlockUntilConnectedOrTimedOut(CuratorZookeeperClient.java:323)
at org.apache.curator.RetryLoop.callWithRetry(RetryLoop.java:105)
at org.apache.curator.framework.imps.GetDataBuilderImpl.pathInForeground(GetDataBuilderImpl.java:288)
at org.apache.curator.framework.imps.GetDataBuilderImpl.forPath(GetDataBuilderImpl.java:279)
at org.apache.curator.framework.imps.GetDataBuilderImpl.forPath(GetDataBuilderImpl.java:41)
at org.apache.curator.framework.recipes.shared.SharedValue.readValue(SharedValue.java:244)
at org.apache.curator.framework.recipes.shared.SharedValue.access$100(SharedValue.java:44)
at org.apache.curator.framework.recipes.shared.SharedValue$1.process(SharedValue.java:61)
at org.apache.curator.framework.imps.NamespaceWatcher.process(NamespaceWatcher.java:67)
at org.apache.zookeeper.ClientCnxn$EventThread.processEvent(ClientCnxn.java:522)
at org.apache.zookeeper.ClientCnxn$EventThread.run(ClientCnxn.java:498)
2) Thread[id=789, name=jetty-launcher-153-thread-2-EventThread, state=TIMED_WAITING, group=TGRP-TestSolrCloudWithSecureImpersonation]
at sun.misc.Unsafe.park(Native Method)
at java.util.concurrent.locks.LockSupport.parkNanos(LockSupport.java:215)
at java.util.concurrent.locks.AbstractQueuedSynchronizer.doAcquireSharedNanos(AbstractQueuedSynchronizer.java:1037)
at java.util.concurrent.locks.AbstractQueuedSynchronizer.tryAcquireSharedNanos(AbstractQueuedSynchronizer.java:1328)
at java.util.concurrent.CountDownLatch.await(CountDownLatch.java:277)
at org.apache.curator.CuratorZookeeperClient.internalBlockUntilConnectedOrTimedOut(CuratorZookeeperClient.java:323)
at org.apache.curator.RetryLoop.callWithRetry(RetryLoop.java:105)
at org.apache.curator.framework.imps.GetDataBuilderImpl.pathInForeground(GetDataBuilderImpl.java:288)
at org.apache.curator.framework.imps.GetDataBuilderImpl.forPath(GetDataBuilderImpl.java:279)
at org.apache.curator.framework.imps.GetDataBuilderImpl.forPath(GetDataBuilderImpl.java:41)
at org.apache.curator.framework.recipes.shared.SharedValue.readValue(SharedValue.java:244)
at org.apache.curator.framework.recipes.shared.SharedValue.access$100(SharedValue.java:44)
at org.apache.curator.framework.recipes.shared.SharedValue$1.process(SharedValue.java:61)
at org.apache.curator.framework.imps.NamespaceWatcher.process(NamespaceWatcher.java:67)
at org.apache.zookeeper.ClientCnxn$EventThread.processEvent(ClientCnxn.java:522)
at org.apache.zookeeper.ClientCnxn$EventThread.run(ClientCnxn.java:498)
at __randomizedtesting.SeedInfo.seed([F5331B1AA8E993BA]:0)
Build Log:
[...truncated 10776 lines...]
[junit4] Suite: org.apache.solr.cloud.TestSolrCloudWithSecureImpersonation
[junit4] 2> Creating dataDir: /export/home/jenkins/workspace/Lucene-Solr-6.x-Solaris/solr/build/solr-core/test/J1/temp/solr.cloud.TestSolrCloudWithSecureImpersonation_F5331B1AA8E993BA-001/init-core-data-001
[junit4] 2> 90297 INFO (SUITE-TestSolrCloudWithSecureImpersonation-seed#[F5331B1AA8E993BA]-worker) [ ] o.a.s.SolrTestCaseJ4 Randomized ssl (false) and clientAuth (false) via: @org.apache.solr.util.RandomizeSSL(reason=, value=NaN, ssl=NaN, clientAuth=NaN)
[junit4] 2> 90374 WARN (SUITE-TestSolrCloudWithSecureImpersonation-seed#[F5331B1AA8E993BA]-worker) [ ] o.a.h.u.NativeCodeLoader Unable to load native-hadoop library for your platform... using builtin-java classes where applicable
[junit4] 2> 90513 INFO (SUITE-TestSolrCloudWithSecureImpersonation-seed#[F5331B1AA8E993BA]-worker) [ ] o.a.s.c.MiniSolrCloudCluster Starting cluster of 2 servers in /export/home/jenkins/workspace/Lucene-Solr-6.x-Solaris/solr/build/solr-core/test/J1/temp/solr.cloud.TestSolrCloudWithSecureImpersonation_F5331B1AA8E993BA-001/tempDir-001
[junit4] 2> 90513 INFO (SUITE-TestSolrCloudWithSecureImpersonation-seed#[F5331B1AA8E993BA]-worker) [ ] o.a.s.c.ZkTestServer STARTING ZK TEST SERVER
[junit4] 2> 90514 INFO (Thread-142) [ ] o.a.s.c.ZkTestServer client port:0.0.0.0/0.0.0.0:0
[junit4] 2> 90514 INFO (Thread-142) [ ] o.a.s.c.ZkTestServer Starting server
[junit4] 2> 90614 INFO (SUITE-TestSolrCloudWithSecureImpersonation-seed#[F5331B1AA8E993BA]-worker) [ ] o.a.s.c.ZkTestServer start zk server on port:41693
[junit4] 2> 90624 INFO (jetty-launcher-153-thread-2) [ ] o.e.j.s.Server jetty-9.3.14.v20161028
[junit4] 2> 90624 INFO (jetty-launcher-153-thread-1) [ ] o.e.j.s.Server jetty-9.3.14.v20161028
[junit4] 2> 90627 INFO (jetty-launcher-153-thread-2) [ ] o.e.j.s.h.ContextHandler Started o.e.j.s.ServletContextHandler@44381440{/solr,null,AVAILABLE}
[junit4] 2> 90628 INFO (jetty-launcher-153-thread-1) [ ] o.e.j.s.h.ContextHandler Started o.e.j.s.ServletContextHandler@5dda9158{/solr,null,AVAILABLE}
[junit4] 2> 90628 INFO (jetty-launcher-153-thread-2) [ ] o.e.j.s.AbstractConnector Started ServerConnector@10792d63{HTTP/1.1,[http/1.1]}{127.0.0.1:50819}
[junit4] 2> 90628 INFO (jetty-launcher-153-thread-2) [ ] o.e.j.s.Server Started @93265ms
[junit4] 2> 90628 INFO (jetty-launcher-153-thread-2) [ ] o.a.s.c.s.e.JettySolrRunner Jetty properties: {hostContext=/solr, hostPort=50819}
[junit4] 2> 90630 ERROR (jetty-launcher-153-thread-2) [ ] o.a.s.s.StartupLoggingUtils Missing Java Option solr.log.dir. Logging may be missing or incomplete.
[junit4] 2> 90630 INFO (jetty-launcher-153-thread-2) [ ] o.a.s.s.SolrDispatchFilter ___ _ Welcome to Apache Solr™ version 6.4.0
[junit4] 2> 90630 INFO (jetty-launcher-153-thread-2) [ ] o.a.s.s.SolrDispatchFilter / __| ___| |_ _ Starting in cloud mode on port null
[junit4] 2> 90630 INFO (jetty-launcher-153-thread-2) [ ] o.a.s.s.SolrDispatchFilter \__ \/ _ \ | '_| Install dir: null
[junit4] 2> 90630 INFO (jetty-launcher-153-thread-2) [ ] o.a.s.s.SolrDispatchFilter |___/\___/_|_| Start time: 2017-01-05T05:29:51.482Z
[junit4] 2> 90631 INFO (jetty-launcher-153-thread-1) [ ] o.e.j.s.AbstractConnector Started ServerConnector@6bed3025{HTTP/1.1,[http/1.1]}{127.0.0.1:36949}
[junit4] 2> 90632 INFO (jetty-launcher-153-thread-1) [ ] o.e.j.s.Server Started @93269ms
[junit4] 2> 90632 INFO (jetty-launcher-153-thread-1) [ ] o.a.s.c.s.e.JettySolrRunner Jetty properties: {hostContext=/solr, hostPort=36949}
[junit4] 2> 90632 ERROR (jetty-launcher-153-thread-1) [ ] o.a.s.s.StartupLoggingUtils Missing Java Option solr.log.dir. Logging may be missing or incomplete.
[junit4] 2> 90632 INFO (jetty-launcher-153-thread-1) [ ] o.a.s.s.SolrDispatchFilter ___ _ Welcome to Apache Solr™ version 6.4.0
[junit4] 2> 90632 INFO (jetty-launcher-153-thread-1) [ ] o.a.s.s.SolrDispatchFilter / __| ___| |_ _ Starting in cloud mode on port null
[junit4] 2> 90632 INFO (jetty-launcher-153-thread-1) [ ] o.a.s.s.SolrDispatchFilter \__ \/ _ \ | '_| Install dir: null
[junit4] 2> 90632 INFO (jetty-launcher-153-thread-1) [ ] o.a.s.s.SolrDispatchFilter |___/\___/_|_| Start time: 2017-01-05T05:29:51.484Z
[junit4] 2> 90639 INFO (jetty-launcher-153-thread-2) [ ] o.a.s.s.SolrDispatchFilter solr.xml found in ZooKeeper. Loading...
[junit4] 2> 90639 INFO (jetty-launcher-153-thread-1) [ ] o.a.s.s.SolrDispatchFilter solr.xml found in ZooKeeper. Loading...
[junit4] 2> 90651 INFO (jetty-launcher-153-thread-1) [ ] o.a.s.u.UpdateShardHandler Creating UpdateShardHandler HTTP client with params: socketTimeout=340000&connTimeout=45000&retry=true
[junit4] 2> 90651 INFO (jetty-launcher-153-thread-1) [ ] o.a.s.c.ZkContainer Zookeeper client=127.0.0.1:41693/solr
[junit4] 2> 90658 INFO (jetty-launcher-153-thread-2) [ ] o.a.s.u.UpdateShardHandler Creating UpdateShardHandler HTTP client with params: socketTimeout=340000&connTimeout=45000&retry=true
[junit4] 2> 90660 INFO (jetty-launcher-153-thread-2) [ ] o.a.s.c.ZkContainer Zookeeper client=127.0.0.1:41693/solr
[junit4] 2> 90703 INFO (jetty-launcher-153-thread-2) [n:127.0.0.1:50819_solr ] o.a.s.c.OverseerElectionContext I am going to be the leader 127.0.0.1:50819_solr
[junit4] 2> 90705 INFO (jetty-launcher-153-thread-1) [n:127.0.0.1:36949_solr ] o.a.s.c.ZkController Register node as live in ZooKeeper:/live_nodes/127.0.0.1:36949_solr
[junit4] 2> 90706 INFO (jetty-launcher-153-thread-2) [n:127.0.0.1:50819_solr ] o.a.s.c.Overseer Overseer (id=97228828925427718-127.0.0.1:50819_solr-n_0000000000) starting
[junit4] 2> 90709 INFO (zkCallback-164-thread-1-processing-n:127.0.0.1:50819_solr) [n:127.0.0.1:50819_solr ] o.a.s.c.c.ZkStateReader Updated live nodes from ZooKeeper... (0) -> (1)
[junit4] 2> 90709 INFO (zkCallback-163-thread-1-processing-n:127.0.0.1:36949_solr) [n:127.0.0.1:36949_solr ] o.a.s.c.c.ZkStateReader Updated live nodes from ZooKeeper... (0) -> (1)
[junit4] 2> 90727 INFO (jetty-launcher-153-thread-2) [n:127.0.0.1:50819_solr ] o.a.s.c.ZkController Register node as live in ZooKeeper:/live_nodes/127.0.0.1:50819_solr
[junit4] 2> 90730 INFO (zkCallback-163-thread-1-processing-n:127.0.0.1:36949_solr) [n:127.0.0.1:36949_solr ] o.a.s.c.c.ZkStateReader Updated live nodes from ZooKeeper... (1) -> (2)
[junit4] 2> 90730 INFO (zkCallback-164-thread-2-processing-n:127.0.0.1:50819_solr) [n:127.0.0.1:50819_solr ] o.a.s.c.c.ZkStateReader Updated live nodes from ZooKeeper... (1) -> (2)
[junit4] 2> 90833 INFO (jetty-launcher-153-thread-1) [n:127.0.0.1:36949_solr ] o.a.s.c.CoreContainer Authentication plugin class obtained from system property 'authenticationPlugin': org.apache.solr.security.HttpParamDelegationTokenPlugin
[junit4] 2> 90861 INFO (jetty-launcher-153-thread-1) [n:127.0.0.1:36949_solr ] o.a.s.s.KerberosPlugin Params: {solr.kerberos.impersonator.user.noGroups.hosts=*, solr.kerberos.impersonator.user.bogusGroup.groups=__some_bogus_group, token.valid=30, cookie.domain=127.0.0.1, solr.kerberos.impersonator.user.anyHostAnyUser.groups=*, solr.kerberos.impersonator.user.bogusGroup.hosts=*, solr.kerberos.impersonator.user.anyHostAnyUser.hosts=*, token.validity=36000, solr.kerberos.impersonator.user.noHosts.groups=*, type=kerberos, solr.kerberos.impersonator.user.localHostAnyGroup.groups=*, delegation-token.token-kind=solr-dt, solr.kerberos.impersonator.user.wrongHost.hosts=1.1.1.1.1.1, cookie.path=/, zk-dt-secret-manager.znodeWorkingPath=solr/security/zkdtsm, solr.kerberos.impersonator.user.localHostAnyGroup.hosts=solaris-vm,localhost,127.0.0.1, signer.secret.provider.zookeeper.path=/token, solr.kerberos.impersonator.user.anyHostUsersGroup.groups=staff, zk-dt-secret-manager.enable=true, solr.kerberos.impersonator.user.wrongHost.groups=*, kerberos.name.rules=DEFAULT, signer.secret.provider=zookeeper, solr.kerberos.impersonator.user.anyHostUsersGroup.hosts=*}
[junit4] 2> 90863 INFO (jetty-launcher-153-thread-2) [n:127.0.0.1:50819_solr ] o.a.s.c.CoreContainer Authentication plugin class obtained from system property 'authenticationPlugin': org.apache.solr.security.HttpParamDelegationTokenPlugin
[junit4] 2> 90863 INFO (jetty-launcher-153-thread-2) [n:127.0.0.1:50819_solr ] o.a.s.s.KerberosPlugin Params: {solr.kerberos.impersonator.user.noGroups.hosts=*, solr.kerberos.impersonator.user.bogusGroup.groups=__some_bogus_group, token.valid=30, cookie.domain=127.0.0.1, solr.kerberos.impersonator.user.anyHostAnyUser.groups=*, solr.kerberos.impersonator.user.bogusGroup.hosts=*, solr.kerberos.impersonator.user.anyHostAnyUser.hosts=*, token.validity=36000, solr.kerberos.impersonator.user.noHosts.groups=*, type=kerberos, solr.kerberos.impersonator.user.localHostAnyGroup.groups=*, delegation-token.token-kind=solr-dt, solr.kerberos.impersonator.user.wrongHost.hosts=1.1.1.1.1.1, cookie.path=/, zk-dt-secret-manager.znodeWorkingPath=solr/security/zkdtsm, solr.kerberos.impersonator.user.localHostAnyGroup.hosts=solaris-vm,localhost,127.0.0.1, signer.secret.provider.zookeeper.path=/token, solr.kerberos.impersonator.user.anyHostUsersGroup.groups=staff, zk-dt-secret-manager.enable=true, solr.kerberos.impersonator.user.wrongHost.groups=*, kerberos.name.rules=DEFAULT, signer.secret.provider=zookeeper, solr.kerberos.impersonator.user.anyHostUsersGroup.hosts=*}
[junit4] 2> 90966 INFO (jetty-launcher-153-thread-1) [n:127.0.0.1:36949_solr ] o.a.c.f.i.CuratorFrameworkImpl Starting
[junit4] 2> 90966 INFO (jetty-launcher-153-thread-2) [n:127.0.0.1:50819_solr ] o.a.c.f.i.CuratorFrameworkImpl Starting
[junit4] 2> 90995 INFO (jetty-launcher-153-thread-2-EventThread) [n:127.0.0.1:50819_solr ] o.a.c.f.s.ConnectionStateManager State change: CONNECTED
[junit4] 2> 91000 INFO (jetty-launcher-153-thread-1-EventThread) [n:127.0.0.1:36949_solr ] o.a.c.f.s.ConnectionStateManager State change: CONNECTED
[junit4] 2> 91191 INFO (jetty-launcher-153-thread-1) [n:127.0.0.1:36949_solr ] o.a.s.h.c.HttpShardHandlerFactory Reconfiguring the default client with: org.apache.solr.security.HttpParamDelegationTokenPlugin$2@76a07217
[junit4] 2> 91191 INFO (jetty-launcher-153-thread-1) [n:127.0.0.1:36949_solr ] o.a.s.u.UpdateShardHandler Reconfiguring the default client with: org.apache.solr.security.HttpParamDelegationTokenPlugin$2@76a07217
[junit4] 2> 91193 INFO (jetty-launcher-153-thread-1) [n:127.0.0.1:36949_solr ] o.a.s.c.CorePropertiesLocator Found 0 core definitions underneath /export/home/jenkins/workspace/Lucene-Solr-6.x-Solaris/solr/build/solr-core/test/J1/temp/solr.cloud.TestSolrCloudWithSecureImpersonation_F5331B1AA8E993BA-001/tempDir-001/node1/.
[junit4] 2> 91200 INFO (jetty-launcher-153-thread-2) [n:127.0.0.1:50819_solr ] o.a.s.h.c.HttpShardHandlerFactory Reconfiguring the default client with: org.apache.solr.security.HttpParamDelegationTokenPlugin$2@672b7b69
[junit4] 2> 91200 INFO (jetty-launcher-153-thread-2) [n:127.0.0.1:50819_solr ] o.a.s.u.UpdateShardHandler Reconfiguring the default client with: org.apache.solr.security.HttpParamDelegationTokenPlugin$2@672b7b69
[junit4] 2> 91203 INFO (jetty-launcher-153-thread-2) [n:127.0.0.1:50819_solr ] o.a.s.c.CorePropertiesLocator Found 0 core definitions underneath /export/home/jenkins/workspace/Lucene-Solr-6.x-Solaris/solr/build/solr-core/test/J1/temp/solr.cloud.TestSolrCloudWithSecureImpersonation_F5331B1AA8E993BA-001/tempDir-001/node2/.
[junit4] 2> 91312 INFO (TEST-TestSolrCloudWithSecureImpersonation.testProxyValidateHost-seed#[F5331B1AA8E993BA]) [ ] o.a.s.SolrTestCaseJ4 ###Starting testProxyValidateHost
[junit4] 2> 91363 INFO (qtp2089038678-747) [n:127.0.0.1:36949_solr ] o.a.s.h.a.CollectionsHandler Invoked Collection Action :list with params doAs=bar&action=LIST&wt=javabin&version=2 and sendToOCPQueue=true
[junit4] 2> 91363 INFO (qtp2089038678-747) [n:127.0.0.1:36949_solr ] o.a.s.s.HttpSolrCall [admin] webapp=null path=/admin/collections params={doAs=bar&action=LIST&wt=javabin&version=2} status=0 QTime=0
[junit4] 2> 91371 WARN (TEST-TestSolrCloudWithSecureImpersonation.testProxyValidateHost-seed#[F5331B1AA8E993BA]) [ ] o.a.h.c.p.ResponseProcessCookies Invalid cookie header: "Set-Cookie: hadoop.auth="u=localHostAnyGroup&p=localHostAnyGroup&t=test&e=1483630192181&s=ikEdF2CjsZrXoPEIn9lWvBG7gN8="; Path=/; Domain=127.0.0.1; Expires= ., 05- .-2017 15:29:52 GMT; HttpOnly". Invalid 'expires' attribute: ., 05- .-2017 15:29:52 GMT
[junit4] 2> 91372 INFO (TEST-TestSolrCloudWithSecureImpersonation.testProxyValidateHost-seed#[F5331B1AA8E993BA]) [ ] o.a.s.SolrTestCaseJ4 ###Ending testProxyValidateHost
[junit4] 2> 91395 INFO (TEST-TestSolrCloudWithSecureImpersonation.testProxyInvalidGroup-seed#[F5331B1AA8E993BA]) [ ] o.a.s.SolrTestCaseJ4 ###Starting testProxyInvalidGroup
[junit4] 2> 91435 WARN (qtp2089038678-750) [ ] o.a.h.s.ShellBasedUnixGroupsMapping got exception trying to get groups for user bar: id: invalid user name: "bar"
[junit4] 2>
[junit4] 2> 91436 WARN (qtp2089038678-750) [ ] o.a.h.s.UserGroupInformation No groups available for user bar
[junit4] 2> 91835 WARN (TEST-TestSolrCloudWithSecureImpersonation.testProxyInvalidGroup-seed#[F5331B1AA8E993BA]) [ ] o.a.h.c.p.ResponseProcessCookies Invalid cookie header: "Set-Cookie: hadoop.auth="u=bogusGroup&p=bogusGroup&t=test&e=1483630192250&s=dy6tWFTAF4CfCxY/pH5408sxbsY="; Path=/; Domain=127.0.0.1; Expires= ., 05- .-2017 15:29:52 GMT; HttpOnly". Invalid 'expires' attribute: ., 05- .-2017 15:29:52 GMT
[junit4] 2> 91837 INFO (TEST-TestSolrCloudWithSecureImpersonation.testProxyInvalidGroup-seed#[F5331B1AA8E993BA]) [ ] o.a.s.SolrTestCaseJ4 ###Ending testProxyInvalidGroup
[junit4] 2> 91860 INFO (TEST-TestSolrCloudWithSecureImpersonation.testProxyValidateGroup-seed#[F5331B1AA8E993BA]) [ ] o.a.s.SolrTestCaseJ4 ###Starting testProxyValidateGroup
[junit4] 2> 91885 INFO (qtp2089038678-751) [n:127.0.0.1:36949_solr ] o.a.s.h.a.CollectionsHandler Invoked Collection Action :list with params doAs=jenkins&action=LIST&wt=javabin&version=2 and sendToOCPQueue=true
[junit4] 2> 91885 INFO (qtp2089038678-751) [n:127.0.0.1:36949_solr ] o.a.s.s.HttpSolrCall [admin] webapp=null path=/admin/collections params={doAs=jenkins&action=LIST&wt=javabin&version=2} status=0 QTime=0
[junit4] 2> 91886 WARN (TEST-TestSolrCloudWithSecureImpersonation.testProxyValidateGroup-seed#[F5331B1AA8E993BA]) [ ] o.a.h.c.p.ResponseProcessCookies Invalid cookie header: "Set-Cookie: hadoop.auth="u=anyHostUsersGroup&p=anyHostUsersGroup&t=test&e=1483630192715&s=YHLnn2+erCWLSr5tqiAT6gsVuq8="; Path=/; Domain=127.0.0.1; Expires= ., 05- .-2017 15:29:52 GMT; HttpOnly". Invalid 'expires' attribute: ., 05- .-2017 15:29:52 GMT
[junit4] 2> 91886 INFO (TEST-TestSolrCloudWithSecureImpersonation.testProxyValidateGroup-seed#[F5331B1AA8E993BA]) [ ] o.a.s.SolrTestCaseJ4 ###Ending testProxyValidateGroup
[junit4] 2> 91909 INFO (TEST-TestSolrCloudWithSecureImpersonation.testProxyInvalidProxyUser-seed#[F5331B1AA8E993BA]) [ ] o.a.s.SolrTestCaseJ4 ###Starting testProxyInvalidProxyUser
[junit4] 2> 91919 WARN (TEST-TestSolrCloudWithSecureImpersonation.testProxyInvalidProxyUser-seed#[F5331B1AA8E993BA]) [ ] o.a.h.c.p.ResponseProcessCookies Invalid cookie header: "Set-Cookie: hadoop.auth="u=bar&p=bar&t=test&e=1483630192765&s=EZ9oW0hBVhffqbNe0Il117vSn5s="; Path=/; Domain=127.0.0.1; Expires= ., 05- .-2017 15:29:52 GMT; HttpOnly". Invalid 'expires' attribute: ., 05- .-2017 15:29:52 GMT
[junit4] 2> 91919 INFO (TEST-TestSolrCloudWithSecureImpersonation.testProxyInvalidProxyUser-seed#[F5331B1AA8E993BA]) [ ] o.a.s.SolrTestCaseJ4 ###Ending testProxyInvalidProxyUser
[junit4] 2> 91951 INFO (TEST-TestSolrCloudWithSecureImpersonation.testProxyNoConfigHosts-seed#[F5331B1AA8E993BA]) [ ] o.a.s.SolrTestCaseJ4 ###Starting testProxyNoConfigHosts
[junit4] 2> 91957 WARN (TEST-TestSolrCloudWithSecureImpersonation.testProxyNoConfigHosts-seed#[F5331B1AA8E993BA]) [ ] o.a.h.c.p.ResponseProcessCookies Invalid cookie header: "Set-Cookie: hadoop.auth="u=noHosts&p=noHosts&t=test&e=1483630192805&s=RFUhY1Hh0OCGsky4vFoZPlnsDlc="; Path=/; Domain=127.0.0.1; Expires= ., 05- .-2017 15:29:52 GMT; HttpOnly". Invalid 'expires' attribute: ., 05- .-2017 15:29:52 GMT
[junit4] 2> 91957 INFO (TEST-TestSolrCloudWithSecureImpersonation.testProxyNoConfigHosts-seed#[F5331B1AA8E993BA]) [ ] o.a.s.SolrTestCaseJ4 ###Ending testProxyNoConfigHosts
[junit4] 2> 91986 INFO (TEST-TestSolrCloudWithSecureImpersonation.testForwarding-seed#[F5331B1AA8E993BA]) [ ] o.a.s.SolrTestCaseJ4 ###Starting testForwarding
[junit4] 2> 92702 INFO (TEST-TestSolrCloudWithSecureImpersonation.testForwarding-seed#[F5331B1AA8E993BA]) [ ] o.a.s.c.c.ZkStateReader Updated live nodes from ZooKeeper... (0) -> (2)
[junit4] 2> 92704 INFO (TEST-TestSolrCloudWithSecureImpersonation.testForwarding-seed#[F5331B1AA8E993BA]) [ ] o.a.s.c.s.i.ZkClientClusterStateProvider Cluster at 127.0.0.1:41693/solr ready
[junit4] 2> 92709 INFO (qtp1784274756-740) [n:127.0.0.1:50819_solr ] o.a.s.h.a.CollectionsHandler Invoked Collection Action :create with params replicationFactor=1&collection.configName=conf1&maxShardsPerNode=1&name=forwardingCollection&action=CREATE&numShards=1&wt=javabin&version=2 and sendToOCPQueue=true
[junit4] 2> 92712 INFO (OverseerThreadFactory-320-thread-1-processing-n:127.0.0.1:50819_solr) [n:127.0.0.1:50819_solr ] o.a.s.c.CreateCollectionCmd Create collection forwardingCollection
[junit4] 2> 92822 INFO (qtp2089038678-743) [n:127.0.0.1:36949_solr ] o.a.s.h.a.CoreAdminOperation core create command qt=/admin/cores&collection.configName=conf1&newCollection=true&name=forwardingCollection_shard1_replica1&action=CREATE&numShards=1&collection=forwardingCollection&shard=shard1&wt=javabin&version=2
[junit4] 2> 92933 INFO (zkCallback-163-thread-1-processing-n:127.0.0.1:36949_solr) [n:127.0.0.1:36949_solr ] o.a.s.c.c.ZkStateReader A cluster state change: [WatchedEvent state:SyncConnected type:NodeDataChanged path:/collections/forwardingCollection/state.json] for collection [forwardingCollection] has occurred - updating... (live nodes size: [2])
[junit4] 2> 93842 WARN (qtp2089038678-743) [n:127.0.0.1:36949_solr c:forwardingCollection s:shard1 x:forwardingCollection_shard1_replica1] o.a.s.c.Config Beginning with Solr 5.5, <mergePolicy> is deprecated, use <mergePolicyFactory> instead.
[junit4] 2> 93843 INFO (qtp2089038678-743) [n:127.0.0.1:36949_solr c:forwardingCollection s:shard1 x:forwardingCollection_shard1_replica1] o.a.s.c.SolrConfig Using Lucene MatchVersion: 6.4.0
[junit4] 2> 93862 INFO (qtp2089038678-743) [n:127.0.0.1:36949_solr c:forwardingCollection s:shard1 x:forwardingCollection_shard1_replica1] o.a.s.s.IndexSchema [forwardingCollection_shard1_replica1] Schema name=test
[junit4] 2> 93928 WARN (qtp2089038678-743) [n:127.0.0.1:36949_solr c:forwardingCollection s:shard1 x:forwardingCollection_shard1_replica1] o.a.s.s.IndexSchema [forwardingCollection_shard1_replica1] default search field in schema is text. WARNING: Deprecated, please use 'df' on request instead.
[junit4] 2> 93930 INFO (qtp2089038678-743) [n:127.0.0.1:36949_solr c:forwardingCollection s:shard1 x:forwardingCollection_shard1_replica1] o.a.s.s.IndexSchema Loaded schema test/1.0 with uniqueid field id
[junit4] 2> 93943 INFO (qtp2089038678-743) [n:127.0.0.1:36949_solr c:forwardingCollection s:shard1 x:forwardingCollection_shard1_replica1] o.a.s.c.CoreContainer Creating SolrCore 'forwardingCollection_shard1_replica1' using configuration from collection forwardingCollection
[junit4] 2> 93944 INFO (qtp2089038678-743) [n:127.0.0.1:36949_solr c:forwardingCollection s:shard1 x:forwardingCollection_shard1_replica1] o.a.s.c.SolrCore [[forwardingCollection_shard1_replica1] ] Opening new SolrCore at [/export/home/jenkins/workspace/Lucene-Solr-6.x-Solaris/solr/build/solr-core/test/J1/temp/solr.cloud.TestSolrCloudWithSecureImpersonation_F5331B1AA8E993BA-001/tempDir-001/node1/forwardingCollection_shard1_replica1], dataDir=[/export/home/jenkins/workspace/Lucene-Solr-6.x-Solaris/solr/build/solr-core/test/J1/temp/solr.cloud.TestSolrCloudWithSecureImpersonation_F5331B1AA8E993BA-001/tempDir-001/node1/./forwardingCollection_shard1_replica1/data/]
[junit4] 2> 93944 INFO (qtp2089038678-743) [n:127.0.0.1:36949_solr c:forwardingCollection s:shard1 x:forwardingCollection_shard1_replica1] o.a.s.c.JmxMonitoredMap JMX monitoring is enabled. Adding Solr mbeans to JMX Server: com.sun.jmx.mbeanserver.JmxMBeanServer@1f395e9d
[junit4] 2> 93945 INFO (qtp2089038678-743) [n:127.0.0.1:36949_solr c:forwardingCollection s:shard1 x:forwardingCollection_shard1_replica1] o.a.s.u.RandomMergePolicy RandomMergePolicy wrapping class org.apache.lucene.index.TieredMergePolicy: [TieredMergePolicy: maxMergeAtOnce=21, maxMergeAtOnceExplicit=19, maxMergedSegmentMB=40.767578125, floorSegmentMB=1.78515625, forceMergeDeletesPctAllowed=15.272273582634398, segmentsPerTier=50.0, maxCFSSegmentSizeMB=8.796093022207999E12, noCFSRatio=1.0
[junit4] 2> 93964 INFO (qtp2089038678-743) [n:127.0.0.1:36949_solr c:forwardingCollection s:shard1 x:forwardingCollection_shard1_replica1] o.a.s.u.UpdateHandler Using UpdateLog implementation: org.apache.solr.update.UpdateLog
[junit4] 2> 93964 INFO (qtp2089038678-743) [n:127.0.0.1:36949_solr c:forwardingCollection s:shard1 x:forwardingCollection_shard1_replica1] o.a.s.u.UpdateLog Initializing UpdateLog: dataDir= defaultSyncLevel=FLUSH numRecordsToKeep=100 maxNumLogsToKeep=10 numVersionBuckets=65536
[junit4] 2> 93965 INFO (qtp2089038678-743) [n:127.0.0.1:36949_solr c:forwardingCollection s:shard1 x:forwardingCollection_shard1_replica1] o.a.s.u.CommitTracker Hard AutoCommit: disabled
[junit4] 2> 93965 INFO (qtp2089038678-743) [n:127.0.0.1:36949_solr c:forwardingCollection s:shard1 x:forwardingCollection_shard1_replica1] o.a.s.u.CommitTracker Soft AutoCommit: disabled
[junit4] 2> 93965 INFO (qtp2089038678-743) [n:127.0.0.1:36949_solr c:forwardingCollection s:shard1 x:forwardingCollection_shard1_replica1] o.a.s.u.RandomMergePolicy RandomMergePolicy wrapping class org.apache.lucene.index.TieredMergePolicy: [TieredMergePolicy: maxMergeAtOnce=23, maxMergeAtOnceExplicit=35, maxMergedSegmentMB=93.01171875, floorSegmentMB=0.3330078125, forceMergeDeletesPctAllowed=21.93003182153646, segmentsPerTier=47.0, maxCFSSegmentSizeMB=8.796093022207999E12, noCFSRatio=0.15370689076826016
[junit4] 2> 93967 INFO (qtp2089038678-743) [n:127.0.0.1:36949_solr c:forwardingCollection s:shard1 x:forwardingCollection_shard1_replica1] o.a.s.s.SolrIndexSearcher Opening [Searcher@6d4a4335[forwardingCollection_shard1_replica1] main]
[junit4] 2> 93968 INFO (qtp2089038678-743) [n:127.0.0.1:36949_solr c:forwardingCollection s:shard1 x:forwardingCollection_shard1_replica1] o.a.s.h.c.SpellCheckComponent Initializing spell checkers
[junit4] 2> 93974 INFO (qtp2089038678-743) [n:127.0.0.1:36949_solr c:forwardingCollection s:shard1 x:forwardingCollection_shard1_replica1] o.a.s.s.DirectSolrSpellChecker init: {name=direct,classname=DirectSolrSpellChecker,field=lowerfilt,minQueryLength=3}
[junit4] 2> 93992 INFO (qtp2089038678-743) [n:127.0.0.1:36949_solr c:forwardingCollection s:shard1 x:forwardingCollection_shard1_replica1] o.a.s.h.ReplicationHandler Commits will be reserved for 10000
[junit4] 2> 93993 INFO (qtp2089038678-743) [n:127.0.0.1:36949_solr c:forwardingCollection s:shard1 x:forwardingCollection_shard1_replica1] o.a.s.u.UpdateLog Could not find max version in index or recent updates, using new clock 1555661266453790720
[junit4] 2> 93995 INFO (searcherExecutor-325-thread-1-processing-n:127.0.0.1:36949_solr x:forwardingCollection_shard1_replica1 s:shard1 c:forwardingCollection) [n:127.0.0.1:36949_solr c:forwardingCollection s:shard1 x:forwardingCollection_shard1_replica1] o.a.s.h.c.SpellCheckComponent Loading spell index for spellchecker: default
[junit4] 2> 93995 INFO (searcherExecutor-325-thread-1-processing-n:127.0.0.1:36949_solr x:forwardingCollection_shard1_replica1 s:shard1 c:forwardingCollection) [n:127.0.0.1:36949_solr c:forwardingCollection s:shard1 x:forwardingCollection_shard1_replica1] o.a.s.h.c.SpellCheckComponent Loading spell index for spellchecker: direct
[junit4] 2> 93995 INFO (searcherExecutor-325-thread-1-processing-n:127.0.0.1:36949_solr x:forwardingCollection_shard1_replica1 s:shard1 c:forwardingCollection) [n:127.0.0.1:36949_solr c:forwardingCollection s:shard1 x:forwardingCollection_shard1_replica1] o.a.s.h.c.SpellCheckComponent Loading spell index for spellchecker: wordbreak
[junit4] 2> 93995 INFO (searcherExecutor-325-thread-1-processing-n:127.0.0.1:36949_solr x:forwardingCollection_shard1_replica1 s:shard1 c:forwardingCollection) [n:127.0.0.1:36949_solr c:forwardingCollection s:shard1 x:forwardingCollection_shard1_replica1] o.a.s.h.c.SpellCheckComponent Loading spell index for spellchecker: multipleFields
[junit4] 2> 93995 INFO (searcherExecutor-325-thread-1-processing-n:127.0.0.1:36949_solr x:forwardingCollection_shard1_replica1 s:shard1 c:forwardingCollection) [n:127.0.0.1:36949_solr c:forwardingCollection s:shard1 x:forwardingCollection_shard1_replica1] o.a.s.h.c.SpellCheckComponent Loading spell index for spellchecker: jarowinkler
[junit4] 2> 93996 INFO (searcherExecutor-325-thread-1-processing-n:127.0.0.1:36949_solr x:forwardingCollection_shard1_replica1 s:shard1 c:forwardingCollection) [n:127.0.0.1:36949_solr c:forwardingCollection s:shard1 x:forwardingCollection_shard1_replica1] o.a.s.h.c.SpellCheckComponent Loading spell index for spellchecker: external
[junit4] 2> 93996 INFO (searcherExecutor-325-thread-1-processing-n:127.0.0.1:36949_solr x:forwardingCollection_shard1_replica1 s:shard1 c:forwardingCollection) [n:127.0.0.1:36949_solr c:forwardingCollection s:shard1 x:forwardingCollection_shard1_replica1] o.a.s.h.c.SpellCheckComponent Loading spell index for spellchecker: freq
[junit4] 2> 93997 INFO (searcherExecutor-325-thread-1-processing-n:127.0.0.1:36949_solr x:forwardingCollection_shard1_replica1 s:shard1 c:forwardingCollection) [n:127.0.0.1:36949_solr c:forwardingCollection s:shard1 x:forwardingCollection_shard1_replica1] o.a.s.h.c.SpellCheckComponent Loading spell index for spellchecker: fqcn
[junit4] 2> 93997 INFO (searcherExecutor-325-thread-1-processing-n:127.0.0.1:36949_solr x:forwardingCollection_shard1_replica1 s:shard1 c:forwardingCollection) [n:127.0.0.1:36949_solr c:forwardingCollection s:shard1 x:forwardingCollection_shard1_replica1] o.a.s.h.c.SpellCheckComponent Loading spell index for spellchecker: perDict
[junit4] 2> 93997 INFO (searcherExecutor-325-thread-1-processing-n:127.0.0.1:36949_solr x:forwardingCollection_shard1_replica1 s:shard1 c:forwardingCollection) [n:127.0.0.1:36949_solr c:forwardingCollection s:shard1 x:forwardingCollection_shard1_replica1] o.a.s.c.SolrCore [forwardingCollection_shard1_replica1] Registered new searcher Searcher@6d4a4335[forwardingCollection_shard1_replica1] main{ExitableDirectoryReader(UninvertingDirectoryReader())}
[junit4] 2> 94003 INFO (qtp2089038678-743) [n:127.0.0.1:36949_solr c:forwardingCollection s:shard1 x:forwardingCollection_shard1_replica1] o.a.s.c.ShardLeaderElectionContext Enough replicas found to continue.
[junit4] 2> 94003 INFO (qtp2089038678-743) [n:127.0.0.1:36949_solr c:forwardingCollection s:shard1 x:forwardingCollection_shard1_replica1] o.a.s.c.ShardLeaderElectionContext I may be the new leader - try and sync
[junit4] 2> 94003 INFO (qtp2089038678-743) [n:127.0.0.1:36949_solr c:forwardingCollection s:shard1 x:forwardingCollection_shard1_replica1] o.a.s.c.SyncStrategy Sync replicas to http://127.0.0.1:36949/solr/forwardingCollection_shard1_replica1/
[junit4] 2> 94003 INFO (qtp2089038678-743) [n:127.0.0.1:36949_solr c:forwardingCollection s:shard1 x:forwardingCollection_shard1_replica1] o.a.s.c.SyncStrategy Sync Success - now sync replicas to me
[junit4] 2> 94003 INFO (qtp2089038678-743) [n:127.0.0.1:36949_solr c:forwardingCollection s:shard1 x:forwardingCollection_shard1_replica1] o.a.s.c.SyncStrategy http://127.0.0.1:36949/solr/forwardingCollection_shard1_replica1/ has no replicas
[junit4] 2> 94009 INFO (qtp2089038678-743) [n:127.0.0.1:36949_solr c:forwardingCollection s:shard1 x:forwardingCollection_shard1_replica1] o.a.s.c.ShardLeaderElectionContext I am the new leader: http://127.0.0.1:36949/solr/forwardingCollection_shard1_replica1/ shard1
[junit4] 2> 94113 INFO (zkCallback-163-thread-1-processing-n:127.0.0.1:36949_solr) [n:127.0.0.1:36949_solr ] o.a.s.c.c.ZkStateReader A cluster state change: [WatchedEvent state:SyncConnected type:NodeDataChanged path:/collections/forwardingCollection/state.json] for collection [forwardingCollection] has occurred - updating... (live nodes size: [2])
[junit4] 2> 94160 INFO (qtp2089038678-743) [n:127.0.0.1:36949_solr c:forwardingCollection s:shard1 x:forwardingCollection_shard1_replica1] o.a.s.c.ZkController I am the leader, no recovery necessary
[junit4] 2> 94163 INFO (qtp2089038678-743) [n:127.0.0.1:36949_solr c:forwardingCollection s:shard1 x:forwardingCollection_shard1_replica1] o.a.s.s.HttpSolrCall [admin] webapp=null path=/admin/cores params={qt=/admin/cores&collection.configName=conf1&newCollection=true&name=forwardingCollection_shard1_replica1&action=CREATE&numShards=1&collection=forwardingCollection&shard=shard1&wt=javabin&version=2} status=0 QTime=1341
[junit4] 2> 94163 WARN (httpShardExecutor-318-thread-1-processing-n:127.0.0.1:50819_solr [http:////127.0.0.1:36949//solr] http:////127.0.0.1:36949//solr) [n:127.0.0.1:50819_solr ] o.a.h.c.p.ResponseProcessCookies Invalid cookie header: "Set-Cookie: hadoop.auth="u=$&p=$&t=test&e=1483630193674&s=i5dzJFcHO49/qek0X2z2O2vvZmo="; Path=/; Domain=127.0.0.1; Expires= ., 05- .-2017 15:29:53 GMT; HttpOnly". Invalid 'expires' attribute: ., 05- .-2017 15:29:53 GMT
[junit4] 2> 94169 INFO (qtp1784274756-740) [n:127.0.0.1:50819_solr ] o.a.s.h.a.CollectionsHandler Wait for new collection to be active for at most 30 seconds. Check all shard replicas
[junit4] 2> 94268 INFO (zkCallback-163-thread-1-processing-n:127.0.0.1:36949_solr) [n:127.0.0.1:36949_solr ] o.a.s.c.c.ZkStateReader A cluster state change: [WatchedEvent state:SyncConnected type:NodeDataChanged path:/collections/forwardingCollection/state.json] for collection [forwardingCollection] has occurred - updating... (live nodes size: [2])
[junit4] 2> 94716 INFO (OverseerCollectionConfigSetProcessor-97228828925427718-127.0.0.1:50819_solr-n_0000000000) [n:127.0.0.1:50819_solr ] o.a.s.c.OverseerTaskQueue Response ZK path: /overseer/collection-queue-work/qnr-0000000000 doesn't exist. Requestor may have disconnected from ZooKeeper
[junit4] 2> 95171 INFO (qtp1784274756-740) [n:127.0.0.1:50819_solr ] o.a.s.s.HttpSolrCall [admin] webapp=null path=/admin/collections params={replicationFactor=1&collection.configName=conf1&maxShardsPerNode=1&name=forwardingCollection&action=CREATE&numShards=1&wt=javabin&version=2} status=0 QTime=2463
[junit4] 2> 95171 WARN (TEST-TestSolrCloudWithSecureImpersonation.testForwarding-seed#[F5331B1AA8E993BA]) [ ] o.a.h.c.p.ResponseProcessCookies Invalid cookie header: "Set-Cookie: hadoop.auth="u=user&p=user&t=test&e=1483630193560&s=DjIwcFi1p3+8Iy8vynwXCYlXe0U="; Path=/; Domain=127.0.0.1; Expires= ., 05- .-2017 15:29:53 GMT; HttpOnly". Invalid 'expires' attribute: ., 05- .-2017 15:29:53 GMT
[junit4] 2> 95171 INFO (TEST-TestSolrCloudWithSecureImpersonation.testForwarding-seed#[F5331B1AA8E993BA]) [ ] o.a.s.c.AbstractDistribZkTestBase Wait for recoveries to finish - collection: forwardingCollection failOnTimeout:true timeout (sec):100
[junit4] 2> 95172 INFO (TEST-TestSolrCloudWithSecureImpersonation.testForwarding-seed#[F5331B1AA8E993BA]) [ ] o.a.s.c.AbstractDistribZkTestBase Recoveries finished - collection: forwardingCollection
[junit4] 2> 95175 INFO (qtp2089038678-750) [n:127.0.0.1:36949_solr c:forwardingCollection s:shard1 r:core_node1 x:forwardingCollection_shard1_replica1] o.a.s.c.S.Request [forwardingCollection_shard1_replica1] webapp=/solr path=/select params={q=*:*&wt=javabin&version=2} hits=0 status=0 QTime=0
[junit4] 2> 95176 WARN (TEST-TestSolrCloudWithSecureImpersonation.testForwarding-seed#[F5331B1AA8E993BA]) [ ] o.a.h.c.p.ResponseProcessCookies Invalid cookie header: "Set-Cookie: hadoop.auth="u=user&p=user&t=test&e=1483630196027&s=qojsisJc91W5laWwL9Dhn+IFEws="; Path=/; Domain=127.0.0.1; Expires= ., 05- .-2017 15:29:56 GMT; HttpOnly". Invalid 'expires' attribute: ., 05- .-2017 15:29:56 GMT
[junit4] 2> 95183 INFO (qtp2089038678-754) [n:127.0.0.1:36949_solr c:forwardingCollection s:shard1 r:core_node1 x:forwardingCollection_shard1_replica1] o.a.s.c.S.Request [forwardingCollection_shard1_replica1] webapp=/solr path=/select params={q=*:*&wt=javabin&version=2} hits=0 status=0 QTime=0
[junit4] 2> 95183 WARN (qtp1784274756-742) [n:127.0.0.1:50819_solr ] o.a.h.c.p.ResponseProcessCookies Invalid cookie header: "Set-Cookie: hadoop.auth="u=$&p=$&t=test&e=1483630196034&s=O8/DEzku18BWuwYmI+tBd9u0rYI="; Path=/; Domain=127.0.0.1; Expires= ., 05- .-2017 15:29:56 GMT; HttpOnly". Invalid 'expires' attribute: ., 05- .-2017 15:29:56 GMT
[junit4] 2> 95187 WARN (TEST-TestSolrCloudWithSecureImpersonation.testForwarding-seed#[F5331B1AA8E993BA]) [ ] o.a.h.c.p.ResponseProcessCookies Invalid cookie header: "Set-Cookie: hadoop.auth="u=user&p=user&t=test&e=1483630196030&s=f1ZtKg1t11ZE5I8orUE43cF94jQ="; Path=/; Domain=127.0.0.1; Expires= ., 05- .-2017 15:29:56 GMT; HttpOnly". Invalid 'expires' attribute: ., 05- .-2017 15:29:56 GMT
[junit4] 2> 95188 WARN (TEST-TestSolrCloudWithSecureImpersonation.testForwarding-seed#[F5331B1AA8E993BA]) [ ] o.a.h.c.p.ResponseProcessCookies Invalid cookie header: "Set-Cookie: hadoop.auth="u=$&p=$&t=test&e=1483630196034&s=O8/DEzku18BWuwYmI+tBd9u0rYI="; Path=/; Domain=127.0.0.1; Expires= ., 05- .-2017 15:29:56 GMT; HttpOnly". Invalid 'expires' attribute: ., 05- .-2017 15:29:56 GMT
[junit4] 2> 95188 INFO (TEST-TestSolrCloudWithSecureImpersonation.testForwarding-seed#[F5331B1AA8E993BA]) [ ] o.a.s.SolrTestCaseJ4 ###Ending testForwarding
[junit4] 2> 95214 INFO (TEST-TestSolrCloudWithSecureImpersonation.testProxyNoConfigGroups-seed#[F5331B1AA8E993BA]) [ ] o.a.s.SolrTestCaseJ4 ###Starting testProxyNoConfigGroups
[junit4] 2> 95218 WARN (TEST-TestSolrCloudWithSecureImpersonation.testProxyNoConfigGroups-seed#[F5331B1AA8E993BA]) [ ] o.a.h.c.p.ResponseProcessCookies Invalid cookie header: "Set-Cookie: hadoop.auth="u=noGroups&p=noGroups&t=test&e=1483630196068&s=ngpJPJzl5vVtDcBoNjYHz/1nwoA="; Path=/; Domain=127.0.0.1; Expires= ., 05- .-2017 15:29:56 GMT; HttpOnly". Invalid 'expires' attribute: ., 05- .-2017 15:29:56 GMT
[junit4] 2> 95219 INFO (TEST-TestSolrCloudWithSecureImpersonation.testProxyNoConfigGroups-seed#[F5331B1AA8E993BA]) [ ] o.a.s.SolrTestCaseJ4 ###Ending testProxyNoConfigGroups
[junit4] 2> 95247 INFO (TEST-TestSolrCloudWithSecureImpersonation.testProxyUnknownRemote-seed#[F5331B1AA8E993BA]) [ ] o.a.s.SolrTestCaseJ4 ###Starting testProxyUnknownRemote
[junit4] 2> 110585 WARN (NIOServerCxn.Factory:0.0.0.0/0.0.0.0:0) [ ] o.a.z.s.NIOServerCnxn caught end of stream exception
[junit4] 2> EndOfStreamException: Unable to read additional data from client sessionid 0x1596d1ad2070005, likely client has closed socket
[junit4] 2> at org.apache.zookeeper.server.NIOServerCnxn.doIO(NIOServerCnxn.java:228)
[junit4] 2> at org.apache.zookeeper.server.NIOServerCnxnFactory.run(NIOServerCnxnFactory.java:208)
[junit4] 2> at java.lang.Thread.run(Thread.java:745)
[junit4] 2> 110586 WARN (NIOServerCxn.Factory:0.0.0.0/0.0.0.0:0) [ ] o.a.z.s.NIOServerCnxn caught end of stream exception
[junit4] 2> EndOfStreamException: Unable to read additional data from client sessionid 0x1596d1ad2070007, likely client has closed socket
[junit4] 2> at org.apache.zookeeper.server.NIOServerCnxn.doIO(NIOServerCnxn.java:228)
[junit4] 2> at org.apache.zookeeper.server.NIOServerCnxnFactory.run(NIOServerCnxnFactory.java:208)
[junit4] 2> at java.lang.Thread.run(Thread.java:745)
[junit4] 2> 110586 WARN (NIOServerCxn.Factory:0.0.0.0/0.0.0.0:0) [ ] o.a.z.s.NIOServerCnxn caught end of stream exception
[junit4] 2> EndOfStreamException: Unable to read additional data from client sessionid 0x1596d1ad2070008, likely client has closed socket
[junit4] 2> at org.apache.zookeeper.server.NIOServerCnxn.doIO(NIOServerCnxn.java:228)
[junit4] 2> at org.apache.zookeeper.server.NIOServerCnxnFactory.run(NIOServerCnxnFactory.java:208)
[junit4] 2> at java.lang.Thread.run(Thread.java:745)
[junit4] 2> 110586 WARN (NIOServerCxn.Factory:0.0.0.0/0.0.0.0:0) [ ] o.a.z.s.NIOServerCnxn Exception causing close of session 0x1596d1ad2070006 due to java.io.IOException: Connection reset by peer
[junit4] 2> 110588 WARN (TEST-TestSolrCloudWithSecureImpersonation.testProxyUnknownRemote-seed#[F5331B1AA8E993BA]) [ ] o.a.h.c.p.ResponseProcessCookies Invalid cookie header: "Set-Cookie: hadoop.auth="u=localHostAnyGroup&p=localHostAnyGroup&t=test&e=1483630196108&s=7YuQ6eHGAL/38f6aRG3ZHO0VhBQ="; Path=/; Domain=127.0.0.1; Expires= ., 05- .-2017 15:29:56 GMT; HttpOnly". Invalid 'expires' attribute: ., 05- .-2017 15:29:56 GMT
[junit4] 2> 110588 INFO (TEST-TestSolrCloudWithSecureImpersonation.testProxyUnknownRemote-seed#[F5331B1AA8E993BA]) [ ] o.a.s.SolrTestCaseJ4 ###Ending testProxyUnknownRemote
[junit4] 2> 110620 INFO (TEST-TestSolrCloudWithSecureImpersonation.testProxyWrongHost-seed#[F5331B1AA8E993BA]) [ ] o.a.s.SolrTestCaseJ4 ###Starting testProxyWrongHost
[junit4] 2> 110636 WARN (TEST-TestSolrCloudWithSecureImpersonation.testProxyWrongHost-seed#[F5331B1AA8E993BA]) [ ] o.a.h.c.p.ResponseProcessCookies Invalid cookie header: "Set-Cookie: hadoop.auth="u=wrongHost&p=wrongHost&t=test&e=1483630211474&s=DUNpFIZL8IM2NXh5JuuBjvbhF+g="; Path=/; Domain=127.0.0.1; Expires= ., 05- .-2017 15:30:11 GMT; HttpOnly". Invalid 'expires' attribute: ., 05- .-2017 15:30:11 GMT
[junit4] 2> 110636 INFO (TEST-TestSolrCloudWithSecureImpersonation.testProxyWrongHost-seed#[F5331B1AA8E993BA]) [ ] o.a.s.SolrTestCaseJ4 ###Ending testProxyWrongHost
[junit4] 2> 110663 INFO (TEST-TestSolrCloudWithSecureImpersonation.testProxyNullProxyUser-seed#[F5331B1AA8E993BA]) [ ] o.a.s.SolrTestCaseJ4 ###Starting testProxyNullProxyUser
[junit4] 2> 110665 INFO (qtp2089038678-750) [n:127.0.0.1:36949_solr c:forwardingCollection s:shard1 r:core_node1 x:forwardingCollection_shard1_replica1] o.a.s.s.SolrDispatchFilter Error authenticating
[junit4] 2> java.lang.IllegalArgumentException: userName is NULL, empty or contains a '&'
[junit4] 2> at org.apache.hadoop.security.authentication.util.AuthToken.checkForIllegalArgument(AuthToken.java:87)
[junit4] 2> at org.apache.hadoop.security.authentication.util.AuthToken.<init>(AuthToken.java:70)
[junit4] 2> at org.apache.hadoop.security.authentication.server.AuthenticationToken.<init>(AuthenticationToken.java:58)
[junit4] 2> at org.apache.solr.security.HttpParamDelegationTokenPlugin$HttpParamDelegationTokenAuthenticationHandler$HttpParamAuthenticationHandler.authenticate(HttpParamDelegationTokenPlugin.java:220)
[junit4] 2> at org.apache.hadoop.security.token.delegation.web.DelegationTokenAuthenticationHandler.authenticate(DelegationTokenAuthenticationHandler.java:348)
[junit4] 2> at org.apache.solr.security.RequestContinuesRecorderAuthenticationHandler.authenticate(RequestContinuesRecorderAuthenticationHandler.java:69)
[junit4] 2> at org.apache.hadoop.security.authentication.server.AuthenticationFilter.doFilter(AuthenticationFilter.java:519)
[junit4] 2> at org.apache.solr.security.DelegationTokenKerberosFilter.doFilter(DelegationTokenKerberosFilter.java:128)
[junit4] 2> at org.apache.solr.security.HttpParamDelegationTokenPlugin$HttpParamToRequestFilter.doFilter(HttpParamDelegationTokenPlugin.java:252)
[junit4] 2> at org.apache.solr.security.KerberosPlugin.doAuthenticate(KerberosPlugin.java:248)
[junit4] 2> at org.apache.solr.servlet.SolrDispatchFilter.authenticateRequest(SolrDispatchFilter.java:404)
[junit4] 2> at org.apache.solr.servlet.SolrDispatchFilter.doFilter(SolrDispatchFilter.java:310)
[junit4] 2> at org.apache.solr.servlet.SolrDispatchFilter.doFilter(SolrDispatchFilter.java:296)
[junit4] 2> at org.eclipse.jetty.servlet.ServletHandler$CachedChain.doFilter(ServletHandler.java:1699)
[junit4] 2> at org.apache.solr.client.solrj.embedded.JettySolrRunner$DebugFilter.doFilter(JettySolrRunner.java:110)
[junit4] 2> at org.eclipse.jetty.servlet.ServletHandler$CachedChain.doFilter(ServletHandler.java:1699)
[junit4] 2> at org.eclipse.jetty.servlet.ServletHandler.doHandle(ServletHandler.java:582)
[junit4] 2> at org.eclipse.jetty.server.session.SessionHandler.doHandle(SessionHandler.java:224)
[junit4] 2> at org.eclipse.jetty.server.handler.ContextHandler.doHandle(ContextHandler.java:1180)
[junit4] 2> at org.eclipse.jetty.servlet.ServletHandler.doScope(ServletHandler.java:512)
[junit4] 2> at org.eclipse.jetty.server.session.SessionHandler.doScope(SessionHandler.java:185)
[junit4] 2> at org.eclipse.jetty.server.handler.ContextHandler.doScope(ContextHandler.java:1112)
[junit4] 2> at org.eclipse.jetty.server.handler.ScopedHandler.handle(ScopedHandler.java:141)
[junit4] 2> at org.eclipse.jetty.server.handler.gzip.GzipHandler.handle(GzipHandler.java:462)
[junit4] 2> at org.eclipse.jetty.server.handler.HandlerWrapper.handle(HandlerWrapper.java:134)
[junit4] 2> at org.eclipse.jetty.server.Server.handle(Server.java:534)
[junit4] 2> at org.eclipse.jetty.server.HttpChannel.handle(HttpChannel.java:320)
[junit4] 2> at org.eclipse.jetty.server.HttpConnection.onFillable(HttpConnection.java:251)
[junit4] 2> at org.eclipse.jetty.io.AbstractConnection$ReadCallback.succeeded(AbstractConnection.java:273)
[junit4] 2> at org.eclipse.jetty.io.FillInterest.fillable(FillInterest.java:95)
[junit4] 2> at org.eclipse.jetty.io.SelectChannelEndPoint$2.run(SelectChannelEndPoint.java:93)
[junit4] 2> at org.eclipse.jetty.util.thread.strategy.ExecuteProduceConsume.executeProduceConsume(ExecuteProduceConsume.java:303)
[junit4] 2> at org.eclipse.jetty.util.thread.strategy.ExecuteProduceConsume.produceConsume(ExecuteProduceConsume.java:148)
[junit4] 2> at org.eclipse.jetty.util.thread.strategy.ExecuteProduceConsume.run(ExecuteProduceConsume.java:136)
[junit4] 2> at org.eclipse.jetty.util.thread.QueuedThreadPool.runJob(QueuedThreadPool.java:671)
[junit4] 2> at org.eclipse.jetty.util.thread.QueuedThreadPool$2.run(QueuedThreadPool.java:589)
[junit4] 2> at java.lang.Thread.run(Thread.java:745)
[junit4] 2> 110666 WARN (qtp2089038678-750) [n:127.0.0.1:36949_solr c:forwardingCollection s:shard1 r:core_node1 x:forwardingCollection_shard1_replica1] o.e.j.s.ServletHandler /solr/admin/collections
[junit4] 2> org.apache.solr.common.SolrException: Error during request authentication,
[junit4] 2> at org.apache.solr.servlet.SolrDispatchFilter.authenticateRequest(SolrDispatchFilter.java:410)
[junit4] 2> at org.apache.solr.servlet.SolrDispatchFilter.doFilter(SolrDispatchFilter.java:310)
[junit4] 2> at org.apache.solr.servlet.SolrDispatchFilter.doFilter(SolrDispatchFilter.java:296)
[junit4] 2> at org.eclipse.jetty.servlet.ServletHandler$CachedChain.doFilter(ServletHandler.java:1699)
[junit4] 2> at org.apache.solr.client.solrj.embedded.JettySolrRunner$DebugFilter.doFilter(JettySolrRunner.java:110)
[junit4] 2> at org.eclipse.jetty.servlet.ServletHandler$CachedChain.doFilter(ServletHandler.java:1699)
[junit4] 2> at org.eclipse.jetty.servlet.ServletHandler.doHandle(ServletHandler.java:582)
[junit4] 2> at org.eclipse.jetty.server.session.SessionHandler.doHandle(SessionHandler.java:224)
[junit4] 2> at org.eclipse.jetty.server.handler.ContextHandler.doHandle(ContextHandler.java:1180)
[junit4] 2> at org.eclipse.jetty.servlet.ServletHandler.doScope(ServletHandler.java:512)
[junit4] 2> at org.eclipse.jetty.server.session.SessionHandler.doScope(SessionHandler.java:185)
[junit4] 2> at org.eclipse.jetty.server.handler.ContextHandler.doScope(ContextHandler.java:1112)
[junit4] 2> at org.eclipse.jetty.server.handler.ScopedHandler.handle(ScopedHandler.java:141)
[junit4] 2> at org.eclipse.jetty.server.handler.gzip.GzipHandler.handle(GzipHandler.java:462)
[junit4] 2> at org.eclipse.jetty.server.handler.HandlerWrapper.handle(HandlerWrapper.java:134)
[junit4] 2> at org.eclipse.jetty.server.Server.handle(Server.java:534)
[junit4] 2> at org.eclipse.jetty.server.HttpChannel.handle(HttpChannel.java:320)
[junit4] 2> at org.eclipse.jetty.server.HttpConnection.onFillable(HttpConnection.java:251)
[junit4] 2> at org.eclipse.jetty.io.AbstractConnection$ReadCallback.succeeded(AbstractConnection.java:273)
[junit4] 2> at org.eclipse.jetty.io.FillInterest.fillable(FillInterest.java:95)
[junit4] 2> at org.eclipse.jetty.io.SelectChannelEndPoint$2.run(SelectChannelEndPoint.java:93)
[junit4] 2> at org.eclipse.jetty.util.thread.strategy.ExecuteProduceConsume.executeProduceConsume(ExecuteProduceConsume.java:303)
[junit4] 2> at org.eclipse.jetty.util.thread.strategy.ExecuteProduceConsume.produceConsume(ExecuteProduceConsume.java:148)
[junit4] 2> at org.eclipse.jetty.util.thread.strategy.ExecuteProduceConsume.run(ExecuteProduceConsume.java:136)
[junit4] 2> at org.eclipse.jetty.util.thread.QueuedThreadPool.runJob(QueuedThreadPool.java:671)
[junit4] 2> at org.eclipse.jetty.util.thread.QueuedThreadPool$2.run(QueuedThreadPool.java:589)
[junit4] 2> at java.lang.Thread.run(Thread.java:745)
[junit4] 2> Caused by: java.lang.IllegalArgumentException: userName is NULL, empty or contains a '&'
[junit4] 2> at org.apache.hadoop.security.authentication.util.AuthToken.checkForIllegalArgument(AuthToken.java:87)
[junit4] 2> at org.apache.hadoop.security.authentication.util.AuthToken.<init>(AuthToken.java:70)
[junit4] 2> at org.apache.hadoop.security.authentication.server.AuthenticationToken.<init>(AuthenticationToken.java:58)
[junit4] 2> at org.apache.solr.security.HttpParamDelegationTokenPlugin$HttpParamDelegationTokenAuthenticationHandler$HttpParamAuthenticationHandler.authenticate(HttpParamDelegationTokenPlugin.java:220)
[junit4] 2> at org.apache.hadoop.security.token.delegation.web.DelegationTokenAuthenticationHandler.authenticate(DelegationTokenAuthenticationHandler.java:348)
[junit4] 2> at org.apache.solr.security.RequestContinuesRecorderAuthenticationHandler.authenticate(RequestContinuesRecorderAuthenticationHandler.java:69)
[junit4] 2> at org.apache.hadoop.security.authentication.server.AuthenticationFilter.doFilter(AuthenticationFilter.java:519)
[junit4] 2> at org.apache.solr.security.DelegationTokenKerberosFilter.doFilter(DelegationTokenKerberosFilter.java:128)
[junit4] 2> at org.apache.solr.security.HttpParamDelegationTokenPlugin$HttpParamToRequestFilter.doFilter(HttpParamDelegationTokenPlugin.java:252)
[junit4] 2> at org.apache.solr.security.KerberosPlugin.doAuthenticate(KerberosPlugin.java:248)
[junit4] 2> at org.apache.solr.servlet.SolrDispatchFilter.authenticateRequest(SolrDispatchFilter.java:404)
[junit4] 2> ... 26 more
[junit4] 2> 110672 INFO (TEST-TestSolrCloudWithSecureImpersonation.testProxyNullProxyUser-seed#[F5331B1AA8E993BA]) [ ] o.a.s.SolrTestCaseJ4 ###Ending testProxyNullProxyUser
[junit4] 2> 110686 WARN (zkCallback-163-thread-3-processing-n:127.0.0.1:36949_solr) [n:127.0.0.1:36949_solr ] o.a.s.c.c.ConnectionManager Watcher org.apache.solr.common.cloud.ConnectionManager@5755e791 name: ZooKeeperConnection Watcher:127.0.0.1:41693/solr got event WatchedEvent state:Disconnected type:None path:null path: null type: None
[junit4] 2> 110687 WARN (zkCallback-163-thread-3-processing-n:127.0.0.1:36949_solr) [n:127.0.0.1:36949_solr ] o.a.s.c.c.ConnectionManager zkClient has disconnected
[junit4] 2> 110688 WARN (zkCallback-164-thread-4-processing-n:127.0.0.1:50819_solr) [n:127.0.0.1:50819_solr ] o.a.s.c.c.ConnectionManager Watcher org.apache.solr.common.cloud.ConnectionManager@9c45d65 name: ZooKeeperConnection Watcher:127.0.0.1:41693/solr got event WatchedEvent state:Disconnected type:None path:null path: null type: None
[junit4] 2> 110688 WARN (zkCallback-164-thread-4-processing-n:127.0.0.1:50819_solr) [n:127.0.0.1:50819_solr ] o.a.s.c.c.ConnectionManager zkClient has disconnected
[junit4] 2> 110689 WARN (zkCallback-171-thread-3) [ ] o.a.s.c.c.ConnectionManager Watcher org.apache.solr.common.cloud.ConnectionManager@48aec5a6 name: ZooKeeperConnection Watcher:127.0.0.1:41693/solr got event WatchedEvent state:Disconnected type:None path:null path: null type: None
[junit4] 2> 110689 WARN (zkCallback-171-thread-3) [ ] o.a.s.c.c.ConnectionManager zkClient has disconnected
[junit4] 2> 110702 INFO (TEST-TestSolrCloudWithSecureImpersonation.testProxyValidateAnyHostAnyUser-seed#[F5331B1AA8E993BA]) [ ] o.a.s.SolrTestCaseJ4 ###Starting testProxyValidateAnyHostAnyUser
[junit4] 2> 110704 INFO (qtp2089038678-754) [n:127.0.0.1:36949_solr ] o.a.s.h.a.CollectionsHandler Invoked Collection Action :list with params doAs=bar&action=LIST&wt=javabin&version=2 and sendToOCPQueue=true
[junit4] 2> 110704 INFO (qtp2089038678-754) [n:127.0.0.1:36949_solr ] o.a.s.s.HttpSolrCall [admin] webapp=null path=/admin/collections params={doAs=bar&action=LIST&wt=javabin&version=2} status=0 QTime=0
[junit4] 2> 110704 WARN (TEST-TestSolrCloudWithSecureImpersonation.testProxyValidateAnyHostAnyUser-seed#[F5331B1AA8E993BA]) [ ] o.a.h.c.p.ResponseProcessCookies Invalid cookie header: "Set-Cookie: hadoop.auth="u=anyHostAnyUser&p=anyHostAnyUser&t=test&e=1483630211555&s=fjGyuvD/sqVbq/JtbtyqWWj/lfo="; Path=/; Domain=127.0.0.1; Expires= ., 05- .-2017 15:30:11 GMT; HttpOnly". Invalid 'expires' attribute: ., 05- .-2017 15:30:11 GMT
[junit4] 2> 110705 INFO (TEST-TestSolrCloudWithSecureImpersonation.testProxyValidateAnyHostAnyUser-seed#[F5331B1AA8E993BA]) [ ] o.a.s.SolrTestCaseJ4 ###Ending testProxyValidateAnyHostAnyUser
[junit4] 2> 110731 INFO (TEST-TestSolrCloudWithSecureImpersonation.testProxyInvalidRemote-seed#[F5331B1AA8E993BA]) [ ] o.a.s.SolrTestCaseJ4 ###Starting testProxyInvalidRemote
[junit4] 2> 110750 WARN (TEST-TestSolrCloudWithSecureImpersonation.testProxyInvalidRemote-seed#[F5331B1AA8E993BA]) [ ] o.a.h.c.p.ResponseProcessCookies Invalid cookie header: "Set-Cookie: hadoop.auth="u=localHostAnyGroup&p=localHostAnyGroup&t=test&e=1483630211585&s=Omk0oGSx2LkeeG4kXqILXzmW+yo="; Path=/; Domain=127.0.0.1; Expires= ., 05- .-2017 15:30:11 GMT; HttpOnly". Invalid 'expires' attribute: ., 05- .-2017 15:30:11 GMT
[junit4] 2> 110750 INFO (TEST-TestSolrCloudWithSecureImpersonation.testProxyInvalidRemote-seed#[F5331B1AA8E993BA]) [ ] o.a.s.SolrTestCaseJ4 ###Ending testProxyInvalidRemote
[junit4] 2> 111780 INFO (jetty-launcher-153-thread-1) [ ] o.e.j.s.AbstractConnector Stopped ServerConnector@10792d63{HTTP/1.1,[http/1.1]}{127.0.0.1:0}
[junit4] 2> 111780 INFO (jetty-launcher-153-thread-2) [ ] o.e.j.s.AbstractConnector Stopped ServerConnector@6bed3025{HTTP/1.1,[http/1.1]}{127.0.0.1:0}
[junit4] 2> 111781 INFO (jetty-launcher-153-thread-1) [ ] o.a.s.c.CoreContainer Shutting down CoreContainer instance=1826907382
[junit4] 2> 111781 INFO (jetty-launcher-153-thread-2) [ ] o.a.s.c.CoreContainer Shutting down CoreContainer instance=1880404461
[junit4] 2> 112202 INFO (coreCloseExecutor-330-thread-1) [n:127.0.0.1:36949_solr c:forwardingCollection s:shard1 r:core_node1 x:forwardingCollection_shard1_replica1] o.a.s.c.SolrCore [forwardingCollection_shard1_replica1] CLOSING SolrCore org.apache.solr.core.SolrCore@3e8fd5c6
[junit4] 2> 112213 INFO (coreCloseExecutor-330-thread-1) [n:127.0.0.1:36949_solr c:forwardingCollection s:shard1 r:core_node1 x:forwardingCollection_shard1_replica1] o.a.s.m.SolrMetricManager Closing metric reporters for: solr.core.forwardingCollection.shard1.replica1
[junit4] 2> 112219 INFO (jetty-launcher-153-thread-2) [ ] o.a.s.m.SolrMetricManager Closing metric reporters for: solr.node
[junit4] 2> 112220 ERROR (Thread[Thread-159,5,TGRP-TestSolrCloudWithSecureImpersonation]) [n:127.0.0.1:36949_solr ] o.a.h.s.t.d.AbstractDelegationTokenSecretManager ExpiredTokenRemover received java.lang.InterruptedException: sleep interrupted
[junit4] 2> 112304 INFO (zkCallback-164-thread-6-processing-n:127.0.0.1:50819_solr) [n:127.0.0.1:50819_solr ] o.a.s.c.c.ZkStateReader Updated live nodes from ZooKeeper... (2) -> (1)
[junit4] 2> 112307 INFO (jetty-launcher-153-thread-1) [ ] o.a.s.c.Overseer Overseer (id=97228828925427718-127.0.0.1:50819_solr-n_0000000000) closing
[junit4] 2> 112311 INFO (jetty-launcher-153-thread-1) [ ] o.a.s.m.SolrMetricManager Closing metric reporters for: solr.node
[junit4] 2> 112311 ERROR (Thread[Thread-161,5,TGRP-TestSolrCloudWithSecureImpersonation]) [n:127.0.0.1:50819_solr ] o.a.h.s.t.d.AbstractDelegationTokenSecretManager ExpiredTokenRemover received java.lang.InterruptedException: sleep interrupted
[junit4] 2> 112312 WARN (OverseerStateUpdate-97228828925427718-127.0.0.1:50819_solr-n_0000000000) [n:127.0.0.1:50819_solr ] o.a.s.c.Overseer Solr cannot talk to ZK, exiting Overseer main queue loop
[junit4] 2> org.apache.zookeeper.KeeperException$SessionExpiredException: KeeperErrorCode = Session expired for /collections/forwardingCollection/state.json
[junit4] 2> at org.apache.zookeeper.KeeperException.create(KeeperException.java:127)
[junit4] 2> at org.apache.zookeeper.KeeperException.create(KeeperException.java:51)
[junit4] 2> at org.apache.zookeeper.ZooKeeper.exists(ZooKeeper.java:1045)
[junit4] 2> at org.apache.solr.common.cloud.SolrZkClient$5.execute(SolrZkClient.java:322)
[junit4] 2> at org.apache.solr.common.cloud.SolrZkClient$5.execute(SolrZkClient.java:319)
[junit4] 2> at org.apache.solr.common.cloud.ZkCmdExecutor.retryOperation(ZkCmdExecutor.java:60)
[junit4] 2> at org.apache.solr.common.cloud.SolrZkClient.exists(SolrZkClient.java:319)
[junit4] 2> at org.apache.solr.cloud.overseer.ZkStateWriter.writePendingUpdates(ZkStateWriter.java:228)
[junit4] 2> at org.apache.solr.cloud.overseer.ZkStateWriter.enqueueUpdate(ZkStateWriter.java:152)
[junit4] 2> at org.apache.solr.cloud.Overseer$ClusterStateUpdater.processQueueItem(Overseer.java:271)
[junit4] 2> at org.apache.solr.cloud.Overseer$ClusterStateUpdater.run(Overseer.java:199)
[junit4] 2> at java.lang.Thread.run(Thread.java:745)
[junit4] 2> 112314 INFO (OverseerStateUpdate-97228828925427718-127.0.0.1:50819_solr-n_0000000000) [n:127.0.0.1:50819_solr ] o.a.s.c.Overseer Overseer Loop exiting : 127.0.0.1:50819_solr
[junit4] 2> 112590 INFO (jetty-launcher-153-thread-2) [ ] o.e.j.s.h.ContextHandler Stopped o.e.j.s.ServletContextHandler@5dda9158{/solr,null,UNAVAILABLE}
[junit4] 2> 112590 INFO (jetty-launcher-153-thread-1) [ ] o.e.j.s.h.ContextHandler Stopped o.e.j.s.ServletContextHandler@44381440{/solr,null,UNAVAILABLE}
[junit4] 2> 112593 INFO (SUITE-TestSolrCloudWithSecureImpersonation-seed#[F5331B1AA8E993BA]-worker) [ ] o.a.s.c.ZkTestServer connecting to 127.0.0.1:41693 41693
[junit4] 2> 112614 INFO (Thread-142) [ ] o.a.s.c.ZkTestServer connecting to 127.0.0.1:41693 41693
[junit4] 2> 112615 WARN (Thread-142) [ ] o.a.s.c.ZkTestServer Watch limit violations:
[junit4] 2> Maximum concurrent create/delete watches above limit:
[junit4] 2>
[junit4] 2> 3 /solr/aliases.json
[junit4] 2> 3 /solr/clusterprops.json
[junit4] 2> 2 /solr/security.json
[junit4] 2>
[junit4] 2> Maximum concurrent data watches above limit:
[junit4] 2>
[junit4] 2> 3 /solr/clusterstate.json
[junit4] 2> 2 /solr/security/zkdtsm/ZKDTSMRoot/ZKDTSMKeyIdRoot
[junit4] 2> 2 /solr/security/zkdtsm/ZKDTSMRoot/ZKDTSMMasterKeyRoot/DK_1
[junit4] 2> 2 /solr/security/zkdtsm/ZKDTSMRoot/ZKDTSMMasterKeyRoot/DK_3
[junit4] 2> 2 /solr/security/zkdtsm/ZKDTSMRoot/ZKDTSMMasterKeyRoot/DK_2
[junit4] 2> 2 /solr/security/zkdtsm/ZKDTSMRoot/ZKDTSMMasterKeyRoot/DK_4
[junit4] 2> 2 /solr/security/zkdtsm/ZKDTSMRoot/ZKDTSMSeqNumRoot
[junit4] 2>
[junit4] 2> Maximum concurrent children watches above limit:
[junit4] 2>
[junit4] 2> 10 /solr/overseer/queue
[junit4] 2> 6 /solr/overseer/collection-queue-work
[junit4] 2> 3 /solr/live_nodes
[junit4] 2> 3 /solr/collections
[junit4] 2> 2 /solr/security/zkdtsm/ZKDTSMRoot/ZKDTSMMasterKeyRoot
[junit4] 2> 2 /solr/overseer/queue-work
[junit4] 2> 2 /solr/security/zkdtsm/ZKDTSMRoot/ZKDTSMTokensRoot
[junit4] 2>
[junit4] 2> 112645 INFO (SUITE-TestSolrCloudWithSecureImpersonation-seed#[F5331B1AA8E993BA]-worker) [ ] o.a.s.SolrTestCaseJ4 ###deleteCore
[junit4] 2> Jan 05, 2017 5:30:13 AM com.carrotsearch.randomizedtesting.ThreadLeakControl checkThreadLeaks
[junit4] 2> WARNING: Will linger awaiting termination of 3 leaked thread(s).
[junit4] 2> Jan 05, 2017 5:30:33 AM com.carrotsearch.randomizedtesting.ThreadLeakControl checkThreadLeaks
[junit4] 2> SEVERE: 2 threads leaked from SUITE scope at org.apache.solr.cloud.TestSolrCloudWithSecureImpersonation:
[junit4] 2> 1) Thread[id=788, name=jetty-launcher-153-thread-1-EventThread, state=TIMED_WAITING, group=TGRP-TestSolrCloudWithSecureImpersonation]
[junit4] 2> at sun.misc.Unsafe.park(Native Method)
[junit4] 2> at java.util.concurrent.locks.LockSupport.parkNanos(LockSupport.java:215)
[junit4] 2> at java.util.concurrent.locks.AbstractQueuedSynchronizer.doAcquireSharedNanos(AbstractQueuedSynchronizer.java:1037)
[junit4] 2> at java.util.concurrent.locks.AbstractQueuedSynchronizer.tryAcquireSharedNanos(AbstractQueuedSynchronizer.java:1328)
[junit4] 2> at java.util.concurrent.CountDownLatch.await(CountDownLatch.java:277)
[junit4] 2> at org.apache.curator.CuratorZookeeperClient.internalBlockUntilConnectedOrTimedOut(CuratorZookeeperClient.java:323)
[junit4] 2> at org.apache.curator.RetryLoop.callWithRetry(RetryLoop.java:105)
[junit4] 2> at org.apache.curator.framework.imps.GetDataBuilderImpl.pathInForeground(GetDataBuilderImpl.java:288)
[junit4] 2> at org.apache.curator.framework.imps.GetDataBuilderImpl.forPath(GetDataBuilderImpl.java:279)
[junit4] 2> at org.apache.curator.framework.imps.GetDataBuilderImpl.forPath(GetDataBuilderImpl.java:41)
[junit4] 2> at org.apache.curator.framework.recipes.shared.SharedValue.readValue(SharedValue.java:244)
[junit4] 2> at org.apache.curator.framework.recipes.shared.SharedValue.access$100(SharedValue.java:44)
[junit4] 2> at org.apache.curator.framework.recipes.shared.SharedValue$1.process(SharedValue.java:61)
[junit4] 2> at org.apache.curator.framework.imps.NamespaceWatcher.process(NamespaceWatcher.java:67)
[junit4] 2> at org.apache.zookeeper.ClientCnxn$EventThread.processEvent(ClientCnxn.java:522)
[junit4] 2> at org.apache.zookeeper.ClientCnxn$EventThread.run(ClientCnxn.java:498)
[junit4] 2> 2) Thread[id=789, name=jetty-launcher-153-thread-2-EventThread, state=TIMED_WAITING, group=TGRP-TestSolrCloudWithSecureImpersonation]
[junit4] 2> at sun.misc.Unsafe.park(Native Method)
[junit4] 2> at java.util.concurrent.locks.LockSupport.parkNanos(LockSupport.java:215)
[junit4] 2> at java.util.concurrent.locks.AbstractQueuedSynchronizer.doAcquireSharedNanos(AbstractQueuedSynchronizer.java:1037)
[junit4] 2> at java.util.concurrent.locks.AbstractQueuedSynchronizer.tryAcquireSharedNanos(AbstractQueuedSynchronizer.java:1328)
[junit4] 2> at java.util.concurrent.CountDownLatch.await(CountDownLatch.java:277)
[junit4] 2> at org.apache.curator.CuratorZookeeperClient.internalBlockUntilConnectedOrTimedOut(CuratorZookeeperClient.java:323)
[junit4] 2> at org.apache.curator.RetryLoop.callWithRetry(RetryLoop.java:105)
[junit4] 2> at org.apache.curator.framework.imps.GetDataBuilderImpl.pathInForeground(GetDataBuilderImpl.java:288)
[junit4] 2> at org.apache.curator.framework.imps.GetDataBuilderImpl.forPath(GetDataBuilderImpl.java:279)
[junit4] 2> at org.apache.curator.framework.imps.GetDataBuilderImpl.forPath(GetDataBuilderImpl.java:41)
[junit4] 2> at org.apache.curator.framework.recipes.shared.SharedValue.readValue(SharedValue.java:244)
[junit4] 2> at org.apache.curator.framework.recipes.shared.SharedValue.access$100(SharedValue.java:44)
[junit4] 2> at org.apache.curator.framework.recipes.shared.SharedValue$1.process(SharedValue.java:61)
[junit4] 2> at org.apache.curator.framework.imps.NamespaceWatcher.process(NamespaceWatcher.java:67)
[junit4] 2> at org.apache.zookeeper.ClientCnxn$EventThread.processEvent(ClientCnxn.java:522)
[junit4] 2> at org.apache.zookeeper.ClientCnxn$EventThread.run(ClientCnxn.java:498)
[junit4] 2> Jan 05, 2017 5:30:33 AM com.carrotsearch.randomizedtesting.ThreadLeakControl tryToInterruptAll
[junit4] 2> INFO: Starting to interrupt leaked threads:
[junit4] 2> 1) Thread[id=788, name=jetty-launcher-153-thread-1-EventThread, state=TIMED_WAITING, group=TGRP-TestSolrCloudWithSecureImpersonation]
[junit4] 2> 2) Thread[id=789, name=jetty-launcher-153-thread-2-EventThread, state=TIMED_WAITING, group=TGRP-TestSolrCloudWithSecureImpersonation]
[junit4] 2> 132822 ERROR (jetty-launcher-153-thread-2-EventThread) [n:127.0.0.1:50819_solr ] o.a.c.f.i.CuratorFrameworkImpl Watcher exception
[junit4] 2> java.lang.InterruptedException
[junit4] 2> at java.util.concurrent.locks.AbstractQueuedSynchronizer.doAcquireSharedNanos(AbstractQueuedSynchronizer.java:1039)
[junit4] 2> at java.util.concurrent.locks.AbstractQueuedSynchronizer.tryAcquireSharedNanos(AbstractQueuedSynchronizer.java:1328)
[junit4] 2> at java.util.concurrent.CountDownLatch.await(CountDownLatch.java:277)
[junit4] 2> at org.apache.curator.CuratorZookeeperClient.internalBlockUntilConnectedOrTimedOut(CuratorZookeeperClient.java:323)
[junit4] 2> at org.apache.curator.RetryLoop.callWithRetry(RetryLoop.java:105)
[junit4] 2> at org.apache.curator.framework.imps.GetDataBuilderImpl.pathInForeground(GetDataBuilderImpl.java:288)
[junit4] 2> at org.apache.curator.framework.imps.GetDataBuilderImpl.forPath(GetDataBuilderImpl.java:279)
[junit4] 2> at org.apache.curator.framework.imps.GetDataBuilderImpl.forPath(GetDataBuilderImpl.java:41)
[junit4] 2> at org.apache.curator.framework.recipes.shared.SharedValue.readValue(SharedValue.java:244)
[junit4] 2> at org.apache.curator.framework.recipes.shared.SharedValue.access$100(SharedValue.java:44)
[junit4] 2> at org.apache.curator.framework.recipes.shared.SharedValue$1.process(SharedValue.java:61)
[junit4] 2> at org.apache.curator.framework.imps.NamespaceWatcher.process(NamespaceWatcher.java:67)
[junit4] 2> at org.apache.zookeeper.ClientCnxn$EventThread.processEvent(ClientCnxn.java:522)
[junit4] 2> at org.apache.zookeeper.ClientCnxn$EventThread.run(ClientCnxn.java:498)
[junit4] 2> 132822 ERROR (jetty-launcher-153-thread-1-EventThread) [n:127.0.0.1:36949_solr ] o.a.c.f.i.CuratorFrameworkImpl Watcher exception
[junit4] 2> java.lang.InterruptedException
[junit4] 2> at java.util.concurrent.locks.AbstractQueuedSynchronizer.doAcquireSharedNanos(AbstractQueuedSynchronizer.java:1039)
[junit4] 2> at java.util.concurrent.locks.AbstractQueuedSynchronizer.tryAcquireSharedNanos(AbstractQueuedSynchronizer.java:1328)
[junit4] 2> at java.util.concurrent.CountDownLatch.await(CountDownLatch.java:277)
[junit4] 2> at org.apache.curator.CuratorZookeeperClient.internalBlockUntilConnectedOrTimedOut(CuratorZookeeperClient.java:323)
[junit4] 2> at org.apache.curator.RetryLoop.callWithRetry(RetryLoop.java:105)
[junit4] 2> at org.apache.curator.framework.imps.GetDataBuilderImpl.pathInForeground(GetDataBuilderImpl.java:288)
[junit4] 2> at org.apache.curator.framework.imps.GetDataBuilderImpl.forPath(GetDataBuilderImpl.java:279)
[junit4] 2> at org.apache.curator.framework.imps.GetDataBuilderImpl.forPath(GetDataBuilderImpl.java:41)
[junit4] 2> at org.apache.curator.framework.recipes.shared.SharedValue.readValue(SharedValue.java:244)
[junit4] 2> at org.apache.curator.framework.recipes.shared.SharedValue.access$100(SharedValue.java:44)
[junit4] 2> at org.apache.curator.framework.recipes.shared.SharedValue$1.process(SharedValue.java:61)
[junit4] 2> at org.apache.curator.framework.imps.NamespaceWatcher.process(NamespaceWatcher.java:67)
[junit4] 2> at org.apache.zookeeper.ClientCnxn$EventThread.processEvent(ClientCnxn.java:522)
[junit4] 2> at org.apache.zookeeper.ClientCnxn$EventThread.run(ClientCnxn.java:498)
[junit4] 2> Jan 05, 2017 5:30:33 AM com.carrotsearch.randomizedtesting.ThreadLeakControl tryToInterruptAll
[junit4] 2> INFO: All leaked threads terminated.
[junit4] 2> NOTE: test params are: codec=Asserting(Lucene62): {}, docValues:{}, maxPointsInLeafNode=2039, maxMBSortInHeap=7.952354069581764, sim=RandomSimilarity(queryNorm=false,coord=crazy): {}, locale=mk, timezone=America/Guadeloupe
[junit4] 2> NOTE: SunOS 5.11 amd64/Oracle Corporation 1.8.0_112 (64-bit)/cpus=3,threads=1,free=139286264,total=312475648
[junit4] 2> NOTE: All tests run in this JVM: [TestJoin, TestSolrCLIRunExample, TestGeoJSONResponseWriter, TestUnifiedSolrHighlighter, TestXmlQParserPlugin, LoggingHandlerTest, TestTrieFacet, DateMathParserTest, TestGraphTermsQParserPlugin, HdfsRestartWhileUpdatingTest, SimpleCollectionCreateDeleteTest, RequestHandlersTest, SpellCheckCollatorTest, TestTolerantUpdateProcessorRandomCloud, TermVectorComponentTest, TestSolrCloudWithSecureImpersonation]
[junit4] 2> NOTE: reproduce with: ant test -Dtestcase=TestSolrCloudWithSecureImpersonation -Dtests.seed=F5331B1AA8E993BA -Dtests.slow=true -Dtests.locale=mk -Dtests.timezone=America/Guadeloupe -Dtests.asserts=true -Dtests.file.encoding=UTF-8
[junit4] ERROR 0.00s J1 | TestSolrCloudWithSecureImpersonation (suite) <<<
[junit4] > Throwable #1: com.carrotsearch.randomizedtesting.ThreadLeakError: 2 threads leaked from SUITE scope at org.apache.solr.cloud.TestSolrCloudWithSecureImpersonation:
[junit4] > 1) Thread[id=788, name=jetty-launcher-153-thread-1-EventThread, state=TIMED_WAITING, group=TGRP-TestSolrCloudWithSecureImpersonation]
[junit4] > at sun.misc.Unsafe.park(Native Method)
[junit4] > at java.util.concurrent.locks.LockSupport.parkNanos(LockSupport.java:215)
[junit4] > at java.util.concurrent.locks.AbstractQueuedSynchronizer.doAcquireSharedNanos(AbstractQueuedSynchronizer.java:1037)
[junit4] > at java.util.concurrent.locks.AbstractQueuedSynchronizer.tryAcquireSharedNanos(AbstractQueuedSynchronizer.java:1328)
[junit4] > at java.util.concurrent.CountDownLatch.await(CountDownLatch.java:277)
[junit4] > at org.apache.curator.CuratorZookeeperClient.internalBlockUntilConnectedOrTimedOut(CuratorZookeeperClient.java:323)
[junit4] > at org.apache.curator.RetryLoop.callWithRetry(RetryLoop.java:105)
[junit4] > at org.apache.curator.framework.imps.GetDataBuilderImpl.pathInForeground(GetDataBuilderImpl.java:288)
[junit4] > at org.apache.curator.framework.imps.GetDataBuilderImpl.forPath(GetDataBuilderImpl.java:279)
[junit4] > at org.apache.curator.framework.imps.GetDataBuilderImpl.forPath(GetDataBuilderImpl.java:41)
[junit4] > at org.apache.curator.framework.recipes.shared.SharedValue.readValue(SharedValue.java:244)
[junit4] > at org.apache.curator.framework.recipes.shared.SharedValue.access$100(SharedValue.java:44)
[junit4] > at org.apache.curator.framework.recipes.shared.SharedValue$1.process(SharedValue.java:61)
[junit4] > at org.apache.curator.framework.imps.NamespaceWatcher.process(NamespaceWatcher.java:67)
[junit4] > at org.apache.zookeeper.ClientCnxn$EventThread.processEvent(ClientCnxn.java:522)
[junit4] > at org.apache.zookeeper.ClientCnxn$EventThread.run(ClientCnxn.java:498)
[junit4] > 2) Thread[id=789, name=jetty-launcher-153-thread-2-EventThread, state=TIMED_WAITING, group=TGRP-TestSolrCloudWithSecureImpersonation]
[junit4] > at sun.misc.Unsafe.park(Native Method)
[junit4] > at java.util.concurrent.locks.LockSupport.parkNanos(LockSupport.java:215)
[junit4] > at java.util.concurrent.locks.AbstractQueuedSynchronizer.doAcquireSharedNanos(AbstractQueuedSynchronizer.java:1037)
[junit4] > at java.util.concurrent.locks.AbstractQueuedSynchronizer.tryAcquireSharedNanos(AbstractQueuedSynchronizer.java:1328)
[junit4] > at java.util.concurrent.CountDownLatch.await(CountDownLatch.java:277)
[junit4] > at org.apache.curator.CuratorZookeeperClient.internalBlockUntilConnectedOrTimedOut(CuratorZookeeperClient.java:323)
[junit4] > at org.apache.curator.RetryLoop.callWithRetry(RetryLoop.java:105)
[junit4] > at org.apache.curator.framework.imps.GetDataBuilderImpl.pathInForeground(GetDataBuilderImpl.java:288)
[junit4] > at org.apache.curator.framework.imps.GetDataBuilderImpl.forPath(GetDataBuilderImpl.java:279)
[junit4] > at org.apache.curator.framework.imps.GetDataBuilderImpl.forPath(GetDataBuilderImpl.java:41)
[junit4] > at org.apache.curator.framework.recipes.shared.SharedValue.readValue(SharedValue.java:244)
[junit4] > at org.apache.curator.framework.recipes.shared.SharedValue.access$100(SharedValue.java:44)
[junit4] > at org.apache.curator.framework.recipes.shared.SharedValue$1.process(SharedValue.java:61)
[junit4] > at org.apache.curator.framework.imps.NamespaceWatcher.process(NamespaceWatcher.java:67)
[junit4] > at org.apache.zookeeper.ClientCnxn$EventThread.processEvent(ClientCnxn.java:522)
[junit4] > at org.apache.zookeeper.ClientCnxn$EventThread.run(ClientCnxn.java:498)
[junit4] > at __randomizedtesting.SeedInfo.seed([F5331B1AA8E993BA]:0)
[junit4] Completed [35/677 (1!)] on J1 in 42.54s, 12 tests, 1 error <<< FAILURES!
[...truncated 56843 lines...]
-ecj-javadoc-lint-src:
[mkdir] Created dir: /var/tmp/ecj1799295687
[ecj-lint] Compiling 1014 source files to /var/tmp/ecj1799295687
[ecj-lint] invalid Class-Path header in manifest of jar file: /export/home/jenkins/.ivy2/cache/org.restlet.jee/org.restlet/jars/org.restlet-2.3.0.jar
[ecj-lint] invalid Class-Path header in manifest of jar file: /export/home/jenkins/.ivy2/cache/org.restlet.jee/org.restlet.ext.servlet/jars/org.restlet.ext.servlet-2.3.0.jar
[ecj-lint] ----------
[ecj-lint] 1. WARNING in /export/home/jenkins/workspace/Lucene-Solr-6.x-Solaris/solr/core/src/java/org/apache/solr/client/solrj/embedded/EmbeddedSolrServer.java (at line 203)
[ecj-lint] new JavaBinCodec(resolver) {
[ecj-lint]
[ecj-lint] @Override
[ecj-lint] public void writeSolrDocument(SolrDocument doc) {
[ecj-lint] callback.streamSolrDocument(doc);
[ecj-lint] //super.writeSolrDocument( doc, fields );
[ecj-lint] }
[ecj-lint]
[ecj-lint] @Override
[ecj-lint] public void writeSolrDocumentList(SolrDocumentList docs) throws IOException {
[ecj-lint] if (docs.size() > 0) {
[ecj-lint] SolrDocumentList tmp = new SolrDocumentList();
[ecj-lint] tmp.setMaxScore(docs.getMaxScore());
[ecj-lint] tmp.setNumFound(docs.getNumFound());
[ecj-lint] tmp.setStart(docs.getStart());
[ecj-lint] docs = tmp;
[ecj-lint] }
[ecj-lint] callback.streamDocListInfo(docs.getNumFound(), docs.getStart(), docs.getMaxScore());
[ecj-lint] super.writeSolrDocumentList(docs);
[ecj-lint] }
[ecj-lint]
[ecj-lint] }.setWritableDocFields(resolver). marshal(rsp.getValues(), out);
[ecj-lint] ^^^^^^^^^^^^^^^^^^^^^^^^^^^^^^^^^^^^^^^^^^^^^^^^^^^^^^^^^^^^^^^^^^^^^^^^^^^^^^^^^^^^^^^^^^^^^^^^^^^^^^^^^^^^^^^^^^^^^^^^^^^^^^^^^^^^^^^^^^^^^^^^^^^^^^^^^^^^^^^^^^^^^^^^^^^^^^^^^^^^^^^^^^^^^^^^^^^^^^^^^^^^^^^^^^^^^^^^^^^^^^^^^^^^^^^^^^^^^^^^^^^^^^^^^^^^^^^^^^^^^^^^^^^^^^^^^^^^^^^^^^^^^^^^^^^^^^^^^^^^^^^^^^^^^^^^^^^^^^^^^^^^^^^^^^^^^^^^^^^^^^^^^^^^^^^^^^^^^^^^^^^^^^^^^^^^^^^^^^^^^^^^^^^^^^^^^^^^^^^^^^^^^^^^^^^^^^^^^^^^^^^^^^^^^^^^^^^^^^^^^^^^^^^^^^^^^^^^^^^^^^^^^^^^^^^^^^^^^^^^^^^^^^^^^^^^^^^^^^^^^^^^^^^^^^^^^^^^^^^^^^^^^^^^^^^^^^^^^^^^^^^^^^^^^^^^^^^^^^^^^^^^^^^^^^^^^^^^^^^^^^^^^^^^^^^^^^^^^^^^^^^^^^^^^^^^^^^^^^^^^^^^^^^^^^^^^^^^^^^^^^^^^^^^^^^^^^^^^^^^^^^^^^^^^^^^^^^^^^^^^^^^^^^^^^^^^^^^^^^^^^^^^^^^^^^^^^^^^^^^^^^^^^^^^^^^^^^^^^^^^^^^^^^^^^^^^^^^^^^^^^^^^^^^^^^^^^^^^^^^^^^^^^^^^^^^^^^^^^^^^^^^^^^^^^^^^^^^
[ecj-lint] Resource leak: '<unassigned Closeable value>' is never closed
[ecj-lint] ----------
[ecj-lint] 2. WARNING in /export/home/jenkins/workspace/Lucene-Solr-6.x-Solaris/solr/core/src/java/org/apache/solr/client/solrj/embedded/EmbeddedSolrServer.java (at line 227)
[ecj-lint] return (NamedList<Object>) new JavaBinCodec(resolver).unmarshal(in);
[ecj-lint] ^^^^^^^^^^^^^^^^^^^^^^^^^^
[ecj-lint] Resource leak: '<unassigned Closeable value>' is never closed
[ecj-lint] ----------
[ecj-lint] ----------
[ecj-lint] 3. WARNING in /export/home/jenkins/workspace/Lucene-Solr-6.x-Solaris/solr/core/src/java/org/apache/solr/cloud/Assign.java (at line 101)
[ecj-lint] Collections.sort(shardIdNames, (o1, o2) -> {
[ecj-lint] ^^^^^^^^^^^
[ecj-lint] (Recovered) Internal inconsistency detected during lambda shape analysis
[ecj-lint] ----------
[ecj-lint] 4. WARNING in /export/home/jenkins/workspace/Lucene-Solr-6.x-Solaris/solr/core/src/java/org/apache/solr/cloud/Assign.java (at line 101)
[ecj-lint] Collections.sort(shardIdNames, (o1, o2) -> {
[ecj-lint] ^^^^^^^^^^^
[ecj-lint] (Recovered) Internal inconsistency detected during lambda shape analysis
[ecj-lint] ----------
[ecj-lint] 5. WARNING in /export/home/jenkins/workspace/Lucene-Solr-6.x-Solaris/solr/core/src/java/org/apache/solr/cloud/Assign.java (at line 101)
[ecj-lint] Collections.sort(shardIdNames, (o1, o2) -> {
[ecj-lint] ^^^^^^^^^^^
[ecj-lint] (Recovered) Internal inconsistency detected during lambda shape analysis
[ecj-lint] ----------
[ecj-lint] ----------
[ecj-lint] 6. WARNING in /export/home/jenkins/workspace/Lucene-Solr-6.x-Solaris/solr/core/src/java/org/apache/solr/cloud/rule/ReplicaAssigner.java (at line 216)
[ecj-lint] Collections.sort(sortedLiveNodes, (n1, n2) -> {
[ecj-lint] ^^^^^^^^^^^
[ecj-lint] (Recovered) Internal inconsistency detected during lambda shape analysis
[ecj-lint] ----------
[ecj-lint] 7. WARNING in /export/home/jenkins/workspace/Lucene-Solr-6.x-Solaris/solr/core/src/java/org/apache/solr/cloud/rule/ReplicaAssigner.java (at line 216)
[ecj-lint] Collections.sort(sortedLiveNodes, (n1, n2) -> {
[ecj-lint] ^^^^^^^^^^^
[ecj-lint] (Recovered) Internal inconsistency detected during lambda shape analysis
[ecj-lint] ----------
[ecj-lint] 8. WARNING in /export/home/jenkins/workspace/Lucene-Solr-6.x-Solaris/solr/core/src/java/org/apache/solr/cloud/rule/ReplicaAssigner.java (at line 216)
[ecj-lint] Collections.sort(sortedLiveNodes, (n1, n2) -> {
[ecj-lint] ^^^^^^^^^^^
[ecj-lint] (Recovered) Internal inconsistency detected during lambda shape analysis
[ecj-lint] ----------
[ecj-lint] ----------
[ecj-lint] 9. WARNING in /export/home/jenkins/workspace/Lucene-Solr-6.x-Solaris/solr/core/src/java/org/apache/solr/core/HdfsDirectoryFactory.java (at line 230)
[ecj-lint] dir = new BlockDirectory(path, hdfsDir, cache, null, blockCacheReadEnabled, false, cacheMerges, cacheReadOnce);
[ecj-lint] ^^^^^^^^^^^^^^^^^^^^^^^^^^^^^^^^^^^^^^^^^^^^^^^^^^^^^^^^^^^^^^^^^^^^^^^^^^^^^^^^^^^^^^^^^^^^^^^^^^^^^^^^^^^^^^
[ecj-lint] Resource leak: 'dir' is never closed
[ecj-lint] ----------
[ecj-lint] ----------
[ecj-lint] 10. WARNING in /export/home/jenkins/workspace/Lucene-Solr-6.x-Solaris/solr/core/src/java/org/apache/solr/handler/AnalysisRequestHandlerBase.java (at line 120)
[ecj-lint] reader = cfiltfac.create(reader);
[ecj-lint] ^^^^^^^^^^^^^^^^^^^^^^^^^^^^^^^^
[ecj-lint] Resource leak: 'reader' is not closed at this location
[ecj-lint] ----------
[ecj-lint] 11. WARNING in /export/home/jenkins/workspace/Lucene-Solr-6.x-Solaris/solr/core/src/java/org/apache/solr/handler/AnalysisRequestHandlerBase.java (at line 144)
[ecj-lint] return namedList;
[ecj-lint] ^^^^^^^^^^^^^^^^^
[ecj-lint] Resource leak: 'listBasedTokenStream' is not closed at this location
[ecj-lint] ----------
[ecj-lint] ----------
[ecj-lint] 12. WARNING in /export/home/jenkins/workspace/Lucene-Solr-6.x-Solaris/solr/core/src/java/org/apache/solr/handler/ClassifyStream.java (at line 88)
[ecj-lint] SolrCore solrCore = (SolrCore) solrCoreObj;
[ecj-lint] ^^^^^^^^
[ecj-lint] Resource leak: 'solrCore' is never closed
[ecj-lint] ----------
[ecj-lint] ----------
[ecj-lint] 13. WARNING in /export/home/jenkins/workspace/Lucene-Solr-6.x-Solaris/solr/core/src/java/org/apache/solr/handler/ReplicationHandler.java (at line 1229)
[ecj-lint] DirectoryReader reader = s==null ? null : s.get().getIndexReader();
[ecj-lint] ^^^^^^
[ecj-lint] Resource leak: 'reader' is never closed
[ecj-lint] ----------
[ecj-lint] ----------
[ecj-lint] 14. WARNING in /export/home/jenkins/workspace/Lucene-Solr-6.x-Solaris/solr/core/src/java/org/apache/solr/handler/SQLHandler.java (at line 255)
[ecj-lint] ParallelStream parallelStream = new ParallelStream(workerZkHost, workerCollection, tupleStream, numWorkers, comp);
[ecj-lint] ^^^^^^^^^^^^^^
[ecj-lint] Resource leak: 'parallelStream' is never closed
[ecj-lint] ----------
[ecj-lint] 15. WARNING in /export/home/jenkins/workspace/Lucene-Solr-6.x-Solaris/solr/core/src/java/org/apache/solr/handler/SQLHandler.java (at line 394)
[ecj-lint] ParallelStream parallelStream = new ParallelStream(workerZkHost, workerCollection, tupleStream, numWorkers, comp);
[ecj-lint] ^^^^^^^^^^^^^^
[ecj-lint] Resource leak: 'parallelStream' is never closed
[ecj-lint] ----------
[ecj-lint] ----------
[ecj-lint] 16. WARNING in /export/home/jenkins/workspace/Lucene-Solr-6.x-Solaris/solr/core/src/java/org/apache/solr/handler/component/ExpandComponent.java (at line 223)
[ecj-lint] UninvertingReader uninvertingReader = new UninvertingReader(new ReaderWrapper(searcher.getSlowAtomicReader(), field), mapping);
[ecj-lint] ^^^^^^^^^^^^^^^^^
[ecj-lint] Resource leak: 'uninvertingReader' is never closed
[ecj-lint] ----------
[ecj-lint] ----------
[ecj-lint] 17. ERROR in /export/home/jenkins/workspace/Lucene-Solr-6.x-Solaris/solr/core/src/java/org/apache/solr/handler/component/QueryComponent.java (at line 61)
[ecj-lint] import org.apache.solr.common.params.MoreLikeThisParams;
[ecj-lint] ^^^^^^^^^^^^^^^^^^^^^^^^^^^^^^^^^^^^^^^^^^^^^^^^
[ecj-lint] The import org.apache.solr.common.params.MoreLikeThisParams is never used
[ecj-lint] ----------
[ecj-lint] ----------
[ecj-lint] 18. WARNING in /export/home/jenkins/workspace/Lucene-Solr-6.x-Solaris/solr/core/src/java/org/apache/solr/highlight/DefaultSolrHighlighter.java (at line 555)
[ecj-lint] tvWindowStream = new OffsetWindowTokenFilter(tvStream);
[ecj-lint] ^^^^^^^^^^^^^^^^^^^^^^^^^^^^^^^^^^^^^^^^^^^^^^^^^^^^^^
[ecj-lint] Resource leak: 'tvWindowStream' is never closed
[ecj-lint] ----------
[ecj-lint] ----------
[ecj-lint] 19. WARNING in /export/home/jenkins/workspace/Lucene-Solr-6.x-Solaris/solr/core/src/java/org/apache/solr/request/SimpleFacets.java (at line 864)
[ecj-lint] fastForRandomSet = new HashDocSet(sset.getDocs(), 0, sset.size());
[ecj-lint] ^^^^^^^^^^^^^^^^^^^^^^^^^^^^^^^^^^^^^^^^^^^^^^^^^^^^^^^^^^^^^^^^^
[ecj-lint] Resource leak: 'fastForRandomSet' is never closed
[ecj-lint] ----------
[ecj-lint] ----------
[ecj-lint] 20. WARNING in /export/home/jenkins/workspace/Lucene-Solr-6.x-Solaris/solr/core/src/java/org/apache/solr/response/BinaryResponseWriter.java (at line 51)
[ecj-lint] new JavaBinCodec(resolver).setWritableDocFields(resolver).marshal(response.getValues(), out);
[ecj-lint] ^^^^^^^^^^^^^^^^^^^^^^^^^^
[ecj-lint] Resource leak: '<unassigned Closeable value>' is never closed
[ecj-lint] ----------
[ecj-lint] 21. WARNING in /export/home/jenkins/workspace/Lucene-Solr-6.x-Solaris/solr/core/src/java/org/apache/solr/response/BinaryResponseWriter.java (at line 163)
[ecj-lint] new JavaBinCodec(resolver).setWritableDocFields(resolver).marshal(rsp.getValues(), out);
[ecj-lint] ^^^^^^^^^^^^^^^^^^^^^^^^^^
[ecj-lint] Resource leak: '<unassigned Closeable value>' is never closed
[ecj-lint] ----------
[ecj-lint] 22. WARNING in /export/home/jenkins/workspace/Lucene-Solr-6.x-Solaris/solr/core/src/java/org/apache/solr/response/BinaryResponseWriter.java (at line 166)
[ecj-lint] return (NamedList<Object>) new JavaBinCodec(resolver).unmarshal(in);
[ecj-lint] ^^^^^^^^^^^^^^^^^^^^^^^^^^
[ecj-lint] Resource leak: '<unassigned Closeable value>' is never closed
[ecj-lint] ----------
[ecj-lint] ----------
[ecj-lint] 23. WARNING in /export/home/jenkins/workspace/Lucene-Solr-6.x-Solaris/solr/core/src/java/org/apache/solr/response/SmileResponseWriter.java (at line 33)
[ecj-lint] new SmileWriter(out, request, response).writeResponse();
[ecj-lint] ^^^^^^^^^^^^^^^^^^^^^^^^^^^^^^^^^^^^^^^
[ecj-lint] Resource leak: '<unassigned Closeable value>' is never closed
[ecj-lint] ----------
[ecj-lint] ----------
[ecj-lint] 24. WARNING in /export/home/jenkins/workspace/Lucene-Solr-6.x-Solaris/solr/core/src/java/org/apache/solr/schema/OpenExchangeRatesOrgProvider.java (at line 146)
[ecj-lint] ratesJsonStream = resourceLoader.openResource(ratesFileLocation);
[ecj-lint] ^^^^^^^^^^^^^^^^^^^^^^^^^^^^^^^^^^^^^^^^^^^^^^^^^^^^^^^^^^^^^^^^
[ecj-lint] Resource leak: 'ratesJsonStream' is not closed at this location
[ecj-lint] ----------
[ecj-lint] ----------
[ecj-lint] 25. WARNING in /export/home/jenkins/workspace/Lucene-Solr-6.x-Solaris/solr/core/src/java/org/apache/solr/search/CollapsingQParserPlugin.java (at line 1185)
[ecj-lint] UninvertingReader uninvertingReader = new UninvertingReader(new ReaderWrapper(searcher.getSlowAtomicReader(), collapseField), mapping);
[ecj-lint] ^^^^^^^^^^^^^^^^^
[ecj-lint] Resource leak: 'uninvertingReader' is never closed
[ecj-lint] ----------
[ecj-lint] ----------
[ecj-lint] 26. WARNING in /export/home/jenkins/workspace/Lucene-Solr-6.x-Solaris/solr/core/src/java/org/apache/solr/search/CursorMark.java (at line 188)
[ecj-lint] pieces = (List<Object>) new JavaBinCodec().unmarshal(in);
[ecj-lint] ^^^^^^^^^^^^^^^^^^
[ecj-lint] Resource leak: '<unassigned Closeable value>' is never closed
[ecj-lint] ----------
[ecj-lint] 27. WARNING in /export/home/jenkins/workspace/Lucene-Solr-6.x-Solaris/solr/core/src/java/org/apache/solr/search/CursorMark.java (at line 265)
[ecj-lint] new JavaBinCodec().marshal(marshalledValues, out);
[ecj-lint] ^^^^^^^^^^^^^^^^^^
[ecj-lint] Resource leak: '<unassigned Closeable value>' is never closed
[ecj-lint] ----------
[ecj-lint] ----------
[ecj-lint] 28. WARNING in /export/home/jenkins/workspace/Lucene-Solr-6.x-Solaris/solr/core/src/java/org/apache/solr/search/DocSlice.java (at line 145)
[ecj-lint] HashDocSet h = new HashDocSet(docs,offset,len);
[ecj-lint] ^
[ecj-lint] Resource leak: 'h' is never closed
[ecj-lint] ----------
[ecj-lint] 29. WARNING in /export/home/jenkins/workspace/Lucene-Solr-6.x-Solaris/solr/core/src/java/org/apache/solr/search/DocSlice.java (at line 154)
[ecj-lint] HashDocSet h = new HashDocSet(docs,offset,len);
[ecj-lint] ^
[ecj-lint] Resource leak: 'h' is never closed
[ecj-lint] ----------
[ecj-lint] 30. WARNING in /export/home/jenkins/workspace/Lucene-Solr-6.x-Solaris/solr/core/src/java/org/apache/solr/search/DocSlice.java (at line 163)
[ecj-lint] HashDocSet h = new HashDocSet(docs,offset,len);
[ecj-lint] ^
[ecj-lint] Resource leak: 'h' is never closed
[ecj-lint] ----------
[ecj-lint] ----------
[ecj-lint] 31. WARNING in /export/home/jenkins/workspace/Lucene-Solr-6.x-Solaris/solr/core/src/java/org/apache/solr/search/function/OrdFieldSource.java (at line 78)
[ecj-lint] SolrIndexSearcher is = (SolrIndexSearcher) o;
[ecj-lint] ^^
[ecj-lint] Resource leak: 'is' is never closed
[ecj-lint] ----------
[ecj-lint] ----------
[ecj-lint] 32. WARNING in /export/home/jenkins/workspace/Lucene-Solr-6.x-Solaris/solr/core/src/java/org/apache/solr/search/function/ReverseOrdFieldSource.java (at line 78)
[ecj-lint] SolrIndexSearcher is = (SolrIndexSearcher) o;
[ecj-lint] ^^
[ecj-lint] Resource leak: 'is' is never closed
[ecj-lint] ----------
[ecj-lint] ----------
[ecj-lint] 33. WARNING in /export/home/jenkins/workspace/Lucene-Solr-6.x-Solaris/solr/core/src/java/org/apache/solr/servlet/SolrDispatchFilter.java (at line 261)
[ecj-lint] throw new SolrException(ErrorCode.SERVER_ERROR, "Error occurred while loading solr.xml from zookeeper", e);
[ecj-lint] ^^^^^^^^^^^^^^^^^^^^^^^^^^^^^^^^^^^^^^^^^^^^^^^^^^^^^^^^^^^^^^^^^^^^^^^^^^^^^^^^^^^^^^^^^^^^^^^^^^^^^^^^^^^
[ecj-lint] Resource leak: 'loader' is not closed at this location
[ecj-lint] ----------
[ecj-lint] ----------
[ecj-lint] 34. WARNING in /export/home/jenkins/workspace/Lucene-Solr-6.x-Solaris/solr/core/src/java/org/apache/solr/update/CdcrTransactionLog.java (at line 98)
[ecj-lint] ChannelFastInputStream is = new ChannelFastInputStream(channel, pos);
[ecj-lint] ^^
[ecj-lint] Resource leak: 'is' is never closed
[ecj-lint] ----------
[ecj-lint] ----------
[ecj-lint] 35. WARNING in /export/home/jenkins/workspace/Lucene-Solr-6.x-Solaris/solr/core/src/java/org/apache/solr/update/HdfsTransactionLog.java (at line 188)
[ecj-lint] LogCodec codec = new LogCodec(resolver);
[ecj-lint] ^^^^^
[ecj-lint] Resource leak: 'codec' is never closed
[ecj-lint] ----------
[ecj-lint] 36. WARNING in /export/home/jenkins/workspace/Lucene-Solr-6.x-Solaris/solr/core/src/java/org/apache/solr/update/HdfsTransactionLog.java (at line 258)
[ecj-lint] LogCodec codec = new LogCodec(resolver);
[ecj-lint] ^^^^^
[ecj-lint] Resource leak: 'codec' is never closed
[ecj-lint] ----------
[ecj-lint] ----------
[ecj-lint] 37. WARNING in /export/home/jenkins/workspace/Lucene-Solr-6.x-Solaris/solr/core/src/java/org/apache/solr/update/TransactionLog.java (at line 226)
[ecj-lint] ChannelFastInputStream is = new ChannelFastInputStream(channel, pos);
[ecj-lint] ^^
[ecj-lint] Resource leak: 'is' is never closed
[ecj-lint] ----------
[ecj-lint] 38. WARNING in /export/home/jenkins/workspace/Lucene-Solr-6.x-Solaris/solr/core/src/java/org/apache/solr/update/TransactionLog.java (at line 226)
[ecj-lint] ChannelFastInputStream is = new ChannelFastInputStream(channel, pos);
[ecj-lint] ^^
[ecj-lint] Resource leak: 'is' is never closed
[ecj-lint] ----------
[ecj-lint] 39. WARNING in /export/home/jenkins/workspace/Lucene-Solr-6.x-Solaris/solr/core/src/java/org/apache/solr/update/TransactionLog.java (at line 258)
[ecj-lint] LogCodec codec = new LogCodec(resolver);
[ecj-lint] ^^^^^
[ecj-lint] Resource leak: 'codec' is never closed
[ecj-lint] ----------
[ecj-lint] 40. WARNING in /export/home/jenkins/workspace/Lucene-Solr-6.x-Solaris/solr/core/src/java/org/apache/solr/update/TransactionLog.java (at line 273)
[ecj-lint] LogCodec codec = new LogCodec(resolver);
[ecj-lint] ^^^^^
[ecj-lint] Resource leak: 'codec' is never closed
[ecj-lint] ----------
[ecj-lint] 41. WARNING in /export/home/jenkins/workspace/Lucene-Solr-6.x-Solaris/solr/core/src/java/org/apache/solr/update/TransactionLog.java (at line 492)
[ecj-lint] LogCodec codec = new LogCodec(resolver);
[ecj-lint] ^^^^^
[ecj-lint] Resource leak: 'codec' is never closed
[ecj-lint] ----------
[ecj-lint] ----------
[ecj-lint] 42. WARNING in /export/home/jenkins/workspace/Lucene-Solr-6.x-Solaris/solr/core/src/java/org/apache/solr/util/SimplePostTool.java (at line 655)
[ecj-lint] BAOS bos = new BAOS();
[ecj-lint] ^^^
[ecj-lint] Resource leak: 'bos' is never closed
[ecj-lint] ----------
[ecj-lint] 43. WARNING in /export/home/jenkins/workspace/Lucene-Solr-6.x-Solaris/solr/core/src/java/org/apache/solr/util/SimplePostTool.java (at line 655)
[ecj-lint] BAOS bos = new BAOS();
[ecj-lint] ^^^
[ecj-lint] Resource leak: 'bos' is never closed
[ecj-lint] ----------
[ecj-lint] ----------
[ecj-lint] 44. WARNING in /export/home/jenkins/workspace/Lucene-Solr-6.x-Solaris/solr/core/src/java/org/apache/solr/util/SolrLogLayout.java (at line 149)
[ecj-lint] SolrQueryRequest req = requestInfo == null ? null : requestInfo.getReq();
[ecj-lint] ^^^
[ecj-lint] Resource leak: 'req' is never closed
[ecj-lint] ----------
[ecj-lint] 44 problems (1 error, 43 warnings)
BUILD FAILED
/export/home/jenkins/workspace/Lucene-Solr-6.x-Solaris/build.xml:775: The following error occurred while executing this line:
/export/home/jenkins/workspace/Lucene-Solr-6.x-Solaris/build.xml:101: The following error occurred while executing this line:
/export/home/jenkins/workspace/Lucene-Solr-6.x-Solaris/solr/build.xml:671: The following error occurred while executing this line:
/export/home/jenkins/workspace/Lucene-Solr-6.x-Solaris/lucene/common-build.xml:1992: The following error occurred while executing this line:
/export/home/jenkins/workspace/Lucene-Solr-6.x-Solaris/lucene/common-build.xml:2031: Compile failed; see the compiler error output for details.
Total time: 87 minutes 28 seconds
Build step 'Invoke Ant' marked build as failure
Archiving artifacts
[WARNINGS] Skipping publisher since build result is FAILURE
Recording test results
Email was triggered for: Failure - Any
Sending email for trigger: Failure - Any