You are viewing a plain text version of this content. The canonical link for it is here.
Posted to dev@juneau.apache.org by Apache Jenkins Server <je...@builds.apache.org> on 2025/05/12 15:56:16 UTC
Build failed in Jenkins: Juneau » Juneau-Java-17 #991
See <https://ci-builds.apache.org/job/Juneau/job/Juneau-Java-17/991/display/redirect?page=changes>
Changes:
[James Bognar] [maven-release-plugin] prepare release juneau-9.1.0-RC1
[James Bognar] [maven-release-plugin] prepare for next development iteration
------------------------------------------
[...truncated 730.91 KiB...]
[INFO] --- enforcer:3.5.0:enforce (enforce-java-version) @ juneau-examples-rest ---
[INFO]
[INFO] --- enforcer:3.5.0:enforce (enforce-maven) @ juneau-examples-rest ---
[INFO]
[INFO] --- remote-resources:3.3.0:process (process-resource-bundles) @ juneau-examples-rest ---
[INFO] Preparing remote bundle org.apache.apache.resources:apache-jar-resource-bundle:1.7
[INFO] Copying 3 resources from 1 bundle.
[INFO]
[INFO] --- resources:3.3.1:resources (default-resources) @ juneau-examples-rest ---
[INFO] Copying 20 resources from src/main/resources to target/classes
[INFO] Copying 3 resources from target/maven-shared-archive-resources to target/classes
[INFO] Copying 3 resources from target/maven-shared-archive-resources to target/classes
[INFO] Copying 3 resources from target/maven-shared-archive-resources to target/classes
[INFO]
[INFO] --- compiler:3.14.0:compile (default-compile) @ juneau-examples-rest ---
[INFO] Recompiling the module because of changed dependency.
[INFO] Compiling 14 source files with javac [debug release 17] to target/classes
[WARNING] Overwriting artifact's file from <https://ci-builds.apache.org/job/Juneau/job/Juneau-Java-17/ws/juneau-examples/juneau-examples-rest/target/juneau-examples-rest-9.1.1-SNAPSHOT.jar> to <https://ci-builds.apache.org/job/Juneau/job/Juneau-Java-17/ws/juneau-examples/juneau-examples-rest/target/classes>
[INFO]
[INFO] >>>>>>>>>>>>>>>>>>>>>>>>>>>>>>>>>>>>>>>>>>>>>>>>>>>>>>>>>>>>>>>>>>>>>>>>
[INFO] Forking juneau/examples/examples-rest-jetty 9.1.1-SNAPSHOT
[INFO] >>>>>>>>>>>>>>>>>>>>>>>>>>>>>>>>>>>>>>>>>>>>>>>>>>>>>>>>>>>>>>>>>>>>>>>>
[INFO]
[INFO] --- enforcer:3.5.0:enforce (enforce-maven-version) @ juneau-examples-rest-jetty ---
[INFO]
[INFO] --- enforcer:3.5.0:enforce (enforce-java-version) @ juneau-examples-rest-jetty ---
[INFO]
[INFO] --- enforcer:3.5.0:enforce (enforce-maven) @ juneau-examples-rest-jetty ---
[INFO]
[INFO] --- remote-resources:3.3.0:process (process-resource-bundles) @ juneau-examples-rest-jetty ---
[INFO] Preparing remote bundle org.apache.apache.resources:apache-jar-resource-bundle:1.7
[INFO] Copying 3 resources from 1 bundle.
[INFO]
[INFO] --- resources:3.3.1:resources (default-resources) @ juneau-examples-rest-jetty ---
[INFO] Copying 1 resource from src/main/resources to target/classes
[INFO] Copying 3 resources from target/maven-shared-archive-resources to target/classes
[INFO] Copying 3 resources from target/maven-shared-archive-resources to target/classes
[INFO] Copying 3 resources from target/maven-shared-archive-resources to target/classes
[INFO]
[INFO] --- compiler:3.14.0:compile (default-compile) @ juneau-examples-rest-jetty ---
[INFO] Recompiling the module because of changed dependency.
[INFO] Compiling 2 source files with javac [debug release 17] to target/classes
[WARNING] Overwriting artifact's file from <https://ci-builds.apache.org/job/Juneau/job/Juneau-Java-17/ws/juneau-examples/juneau-examples-rest-jetty/target/juneau-examples-rest-jetty-9.1.1-SNAPSHOT.jar> to <https://ci-builds.apache.org/job/Juneau/job/Juneau-Java-17/ws/juneau-examples/juneau-examples-rest-jetty/target/classes>
[INFO]
[INFO] >>>>>>>>>>>>>>>>>>>>>>>>>>>>>>>>>>>>>>>>>>>>>>>>>>>>>>>>>>>>>>>>>>>>>>>>
[INFO] Forking juneau/examples/examples-rest-springboot 9.1.1-SNAPSHOT
[INFO] >>>>>>>>>>>>>>>>>>>>>>>>>>>>>>>>>>>>>>>>>>>>>>>>>>>>>>>>>>>>>>>>>>>>>>>>
[INFO]
[INFO] --- enforcer:3.5.0:enforce (enforce-maven-version) @ juneau-examples-rest-springboot ---
[INFO]
[INFO] --- enforcer:3.5.0:enforce (enforce-java-version) @ juneau-examples-rest-springboot ---
[INFO]
[INFO] --- enforcer:3.5.0:enforce (enforce-maven) @ juneau-examples-rest-springboot ---
[INFO]
[INFO] --- remote-resources:3.3.0:process (process-resource-bundles) @ juneau-examples-rest-springboot ---
[INFO] Preparing remote bundle org.apache.apache.resources:apache-jar-resource-bundle:1.7
[INFO] Copying 3 resources from 1 bundle.
[INFO]
[INFO] --- resources:3.3.1:resources (default-resources) @ juneau-examples-rest-springboot ---
[INFO] Copying 3 resources from src/main/resources to target/classes
[INFO] Copying 3 resources from target/maven-shared-archive-resources to target/classes
[INFO] Copying 3 resources from target/maven-shared-archive-resources to target/classes
[INFO] Copying 3 resources from target/maven-shared-archive-resources to target/classes
[INFO]
[INFO] --- compiler:3.14.0:compile (default-compile) @ juneau-examples-rest-springboot ---
[INFO] Recompiling the module because of changed dependency.
[INFO] Compiling 5 source files with javac [debug release 17] to target/classes
[WARNING] Overwriting artifact's file from <https://ci-builds.apache.org/job/Juneau/job/Juneau-Java-17/ws/juneau-examples/juneau-examples-rest-springboot/target/juneau-examples-rest-springboot-9.1.1-SNAPSHOT.jar> to <https://ci-builds.apache.org/job/Juneau/job/Juneau-Java-17/ws/juneau-examples/juneau-examples-rest-springboot/target/classes>
[INFO]
[INFO] >>>>>>>>>>>>>>>>>>>>>>>>>>>>>>>>>>>>>>>>>>>>>>>>>>>>>>>>>>>>>>>>>>>>>>>>
[INFO] Forking juneau/examples/examples-rest-jetty-ftest 9.1.1-SNAPSHOT
[INFO] >>>>>>>>>>>>>>>>>>>>>>>>>>>>>>>>>>>>>>>>>>>>>>>>>>>>>>>>>>>>>>>>>>>>>>>>
[INFO]
[INFO] --- enforcer:3.5.0:enforce (enforce-maven-version) @ juneau-examples-rest-jetty-ftest ---
[INFO]
[INFO] --- enforcer:3.5.0:enforce (enforce-java-version) @ juneau-examples-rest-jetty-ftest ---
[INFO]
[INFO] --- enforcer:3.5.0:enforce (enforce-maven) @ juneau-examples-rest-jetty-ftest ---
[INFO]
[INFO] --- jacoco:0.8.13:prepare-agent (default-prepare-agent) @ juneau-examples-rest-jetty-ftest ---
[INFO] argLine set to -javaagent:/home/jenkins/.m2/repository/org/jacoco/org.jacoco.agent/0.8.13/org.jacoco.agent-0.8.13-runtime.jar=destfile=<https://ci-builds.apache.org/job/Juneau/job/Juneau-Java-17/ws/juneau-examples/juneau-examples-rest-jetty-ftest/target/jacoco.exec>
[INFO]
[INFO] --- remote-resources:3.3.0:process (process-resource-bundles) @ juneau-examples-rest-jetty-ftest ---
[INFO] Preparing remote bundle org.apache.apache.resources:apache-jar-resource-bundle:1.7
[INFO] Copying 3 resources from 1 bundle.
[INFO]
[INFO] --- resources:3.3.1:resources (default-resources) @ juneau-examples-rest-jetty-ftest ---
[INFO] skip non existing resourceDirectory <https://ci-builds.apache.org/job/Juneau/job/Juneau-Java-17/ws/juneau-examples/juneau-examples-rest-jetty-ftest/src/main/resources>
[INFO] Copying 3 resources from target/maven-shared-archive-resources to target/classes
[INFO] Copying 3 resources from target/maven-shared-archive-resources to target/classes
[INFO] Copying 3 resources from target/maven-shared-archive-resources to target/classes
[INFO]
[INFO] --- compiler:3.14.0:compile (default-compile) @ juneau-examples-rest-jetty-ftest ---
[INFO] Recompiling the module because of changed dependency.
[WARNING] Overwriting artifact's file from <https://ci-builds.apache.org/job/Juneau/job/Juneau-Java-17/ws/juneau-examples/juneau-examples-rest-jetty-ftest/target/juneau-examples-rest-jetty-ftest-9.1.1-SNAPSHOT.jar> to <https://ci-builds.apache.org/job/Juneau/job/Juneau-Java-17/ws/juneau-examples/juneau-examples-rest-jetty-ftest/target/classes>
[INFO]
[INFO] >>>>>>>>>>>>>>>>>>>>>>>>>>>>>>>>>>>>>>>>>>>>>>>>>>>>>>>>>>>>>>>>>>>>>>>>
[INFO] Forking juneau/utest-utils 9.1.1-SNAPSHOT
[INFO] >>>>>>>>>>>>>>>>>>>>>>>>>>>>>>>>>>>>>>>>>>>>>>>>>>>>>>>>>>>>>>>>>>>>>>>>
[INFO]
[INFO] --- enforcer:3.5.0:enforce (enforce-maven-version) @ juneau-utest-utils ---
[INFO]
[INFO] --- enforcer:3.5.0:enforce (enforce-java-version) @ juneau-utest-utils ---
[INFO]
[INFO] --- enforcer:3.5.0:enforce (enforce-maven) @ juneau-utest-utils ---
[INFO]
[INFO] --- remote-resources:3.3.0:process (process-resource-bundles) @ juneau-utest-utils ---
[INFO] Preparing remote bundle org.apache.apache.resources:apache-jar-resource-bundle:1.7
[INFO] Copying 3 resources from 1 bundle.
[INFO]
[INFO] --- resources:3.3.1:resources (default-resources) @ juneau-utest-utils ---
[INFO] skip non existing resourceDirectory <https://ci-builds.apache.org/job/Juneau/job/Juneau-Java-17/ws/juneau-utest-utils/src/main/resources>
[INFO] Copying 3 resources from target/maven-shared-archive-resources to target/classes
[INFO] Copying 3 resources from target/maven-shared-archive-resources to target/classes
[INFO] Copying 3 resources from target/maven-shared-archive-resources to target/classes
[INFO]
[INFO] --- compiler:3.14.0:compile (default-compile) @ juneau-utest-utils ---
[INFO] Recompiling the module because of changed dependency.
[INFO] Compiling 30 source files with javac [debug release 17] to target/classes
[WARNING] Overwriting artifact's file from <https://ci-builds.apache.org/job/Juneau/job/Juneau-Java-17/ws/juneau-utest-utils/target/juneau-utest-utils-9.1.1-SNAPSHOT.jar> to <https://ci-builds.apache.org/job/Juneau/job/Juneau-Java-17/ws/juneau-utest-utils/target/classes>
[INFO]
[INFO] >>>>>>>>>>>>>>>>>>>>>>>>>>>>>>>>>>>>>>>>>>>>>>>>>>>>>>>>>>>>>>>>>>>>>>>>
[INFO] Forking juneau/utest 9.1.1-SNAPSHOT
[INFO] >>>>>>>>>>>>>>>>>>>>>>>>>>>>>>>>>>>>>>>>>>>>>>>>>>>>>>>>>>>>>>>>>>>>>>>>
[INFO]
[INFO] --- enforcer:3.5.0:enforce (enforce-maven-version) @ juneau-utest ---
[INFO]
[INFO] --- enforcer:3.5.0:enforce (enforce-java-version) @ juneau-utest ---
[INFO]
[INFO] --- enforcer:3.5.0:enforce (enforce-maven) @ juneau-utest ---
[INFO]
[INFO] --- jacoco:0.8.13:prepare-agent (default-prepare-agent) @ juneau-utest ---
[INFO] argLine set to -javaagent:/home/jenkins/.m2/repository/org/jacoco/org.jacoco.agent/0.8.13/org.jacoco.agent-0.8.13-runtime.jar=destfile=<https://ci-builds.apache.org/job/Juneau/job/Juneau-Java-17/ws/juneau-utest/target/jacoco.exec>
[INFO]
[INFO] --- remote-resources:3.3.0:process (process-resource-bundles) @ juneau-utest ---
[INFO] Preparing remote bundle org.apache.apache.resources:apache-jar-resource-bundle:1.7
[INFO] Copying 3 resources from 1 bundle.
[INFO]
[INFO] --- resources:3.3.1:resources (default-resources) @ juneau-utest ---
[INFO] skip non existing resourceDirectory <https://ci-builds.apache.org/job/Juneau/job/Juneau-Java-17/ws/juneau-utest/src/main/resources>
[INFO] Copying 3 resources from target/maven-shared-archive-resources to target/classes
[INFO] Copying 3 resources from target/maven-shared-archive-resources to target/classes
[INFO] Copying 3 resources from target/maven-shared-archive-resources to target/classes
[INFO]
[INFO] --- compiler:3.14.0:compile (default-compile) @ juneau-utest ---
[INFO] Recompiling the module because of changed dependency.
[WARNING] Overwriting artifact's file from <https://ci-builds.apache.org/job/Juneau/job/Juneau-Java-17/ws/juneau-utest/target/juneau-utest-9.1.1-SNAPSHOT.jar> to <https://ci-builds.apache.org/job/Juneau/job/Juneau-Java-17/ws/juneau-utest/target/classes>
[INFO]
[INFO] >>>>>>>>>>>>>>>>>>>>>>>>>>>>>>>>>>>>>>>>>>>>>>>>>>>>>>>>>>>>>>>>>>>>>>>>
[INFO] Forking juneau/all 9.1.1-SNAPSHOT
[INFO] >>>>>>>>>>>>>>>>>>>>>>>>>>>>>>>>>>>>>>>>>>>>>>>>>>>>>>>>>>>>>>>>>>>>>>>>
[INFO]
[INFO] --- enforcer:3.5.0:enforce (enforce-maven-version) @ juneau-all ---
[INFO]
[INFO] --- enforcer:3.5.0:enforce (enforce-java-version) @ juneau-all ---
[INFO]
[INFO] --- enforcer:3.5.0:enforce (enforce-maven) @ juneau-all ---
[INFO]
[INFO] --- remote-resources:3.3.0:process (process-resource-bundles) @ juneau-all ---
[INFO] Preparing remote bundle org.apache.apache.resources:apache-jar-resource-bundle:1.7
[INFO] Copying 3 resources from 1 bundle.
[INFO]
[INFO] --- resources:3.3.1:resources (default-resources) @ juneau-all ---
[INFO] skip non existing resourceDirectory <https://ci-builds.apache.org/job/Juneau/job/Juneau-Java-17/ws/juneau-all/src/main/resources>
[INFO] Copying 3 resources from target/maven-shared-archive-resources to target/classes
[INFO] Copying 3 resources from target/maven-shared-archive-resources to target/classes
[INFO] Copying 3 resources from target/maven-shared-archive-resources to target/classes
[INFO]
[INFO] --- compiler:3.14.0:compile (default-compile) @ juneau-all ---
[INFO] No sources to compile
[WARNING] Overwriting artifact's file from <https://ci-builds.apache.org/job/Juneau/job/Juneau-Java-17/ws/juneau-all/target/juneau-all-9.1.1-SNAPSHOT.jar> to <https://ci-builds.apache.org/job/Juneau/job/Juneau-Java-17/ws/juneau-all/target/classes>
[INFO]
[INFO] >>>>>>>>>>>>>>>>>>>>>>>>>>>>>>>>>>>>>>>>>>>>>>>>>>>>>>>>>>>>>>>>>>>>>>>>
[INFO] Forking juneau/distrib 9.1.1-SNAPSHOT
[INFO] >>>>>>>>>>>>>>>>>>>>>>>>>>>>>>>>>>>>>>>>>>>>>>>>>>>>>>>>>>>>>>>>>>>>>>>>
[INFO]
[INFO] --- enforcer:3.5.0:enforce (enforce-maven-version) @ juneau-distrib ---
[INFO]
[INFO] --- enforcer:3.5.0:enforce (enforce-java-version) @ juneau-distrib ---
[INFO]
[INFO] --- enforcer:3.5.0:enforce (enforce-maven) @ juneau-distrib ---
[INFO]
[INFO] --- remote-resources:3.3.0:process (process-resource-bundles) @ juneau-distrib ---
[INFO] Preparing remote bundle org.apache.apache.resources:apache-jar-resource-bundle:1.7
[INFO] Copying 3 resources from 1 bundle.
[INFO]
[INFO] <<< javadoc:3.11.2:aggregate (default-cli) < compile @ juneau <<<
[INFO]
[INFO]
[INFO] --- javadoc:3.11.2:aggregate (default-cli) @ juneau ---
[INFO] No previous run data found, generating javadoc.
[INFO] ------------------------------------------------------------------------
[INFO] Reactor Summary for juneau 9.1.1-SNAPSHOT:
[INFO]
[INFO] juneau ............................................. FAILURE [ 10.608 s]
[INFO] juneau/core ........................................ SUCCESS [ 4.393 s]
[INFO] juneau/core/common ................................. SUCCESS [ 9.437 s]
[INFO] juneau/core/marshall ............................... SUCCESS [ 22.666 s]
[INFO] juneau/core/dto .................................... SUCCESS [ 11.231 s]
[INFO] juneau/core/config ................................. SUCCESS [ 7.074 s]
[INFO] juneau/core/assertions ............................. SUCCESS [ 8.315 s]
[INFO] juneau/rest ........................................ SUCCESS [ 3.769 s]
[INFO] juneau/rest/rest-common ............................ SUCCESS [ 9.163 s]
[INFO] juneau/rest/rest-server ............................ SUCCESS [ 10.884 s]
[INFO] juneau/rest/rest-server-springboot ................. SUCCESS [ 8.127 s]
[INFO] juneau/rest/rest-client ............................ SUCCESS [ 7.977 s]
[INFO] juneau/rest/rest-mock .............................. SUCCESS [ 6.599 s]
[INFO] juneau/microservice ................................ SUCCESS [ 3.619 s]
[INFO] juneau/microservice/microservice-core .............. SUCCESS [ 6.639 s]
[INFO] juneau/microservice/microservice-jetty ............. SUCCESS [ 8.134 s]
[INFO] juneau/microservice/my-jetty-microservice .......... SUCCESS [ 5.406 s]
[INFO] juneau/microservice/my-springboot-microservice ..... SUCCESS [ 5.439 s]
[INFO] juneau/sc .......................................... SUCCESS [ 3.574 s]
[INFO] juneau/sc/sc-server ................................ SUCCESS [ 6.079 s]
[INFO] juneau/sc/sc-client ................................ SUCCESS [ 4.651 s]
[INFO] juneau/examples .................................... SUCCESS [ 3.661 s]
[INFO] juneau/examples/examples-core ...................... SUCCESS [ 7.383 s]
[INFO] juneau/examples/rest ............................... SUCCESS [ 7.407 s]
[INFO] juneau/examples/examples-rest-jetty ................ SUCCESS [ 7.690 s]
[INFO] juneau/examples/examples-rest-springboot ........... SUCCESS [ 13.498 s]
[INFO] juneau/examples/examples-rest-jetty-ftest .......... SUCCESS [ 12.372 s]
[INFO] juneau/utest-utils ................................. SUCCESS [ 6.862 s]
[INFO] juneau/utest ....................................... SUCCESS [01:02 min]
[INFO] juneau/all ......................................... SUCCESS [ 9.345 s]
[INFO] juneau/distrib ..................................... SUCCESS [ 9.512 s]
[INFO] ------------------------------------------------------------------------
[INFO] BUILD FAILURE
[INFO] ------------------------------------------------------------------------
[INFO] Total time: 05:15 min
[INFO] Finished at: 2025-05-12T15:56:13Z
[INFO] ------------------------------------------------------------------------
[ERROR] Failed to execute goal org.apache.maven.plugins:maven-javadoc-plugin:3.11.2:aggregate (default-cli) on project juneau: An error has occurred in Javadoc report generation:
[ERROR] Exit code: 2
[ERROR] error: No source files for package org.apache.juneau.common.internal
[ERROR] 1 error
[ERROR] Command line was: /usr/local/asfpackages/java/adoptium-jdk-17.0.12+7/bin/javadoc -J-Duser.language= -J-Duser.country= -J-DjuneauVersion=9.1.0 -J-DjuneauVersionNext=9.1.1 --allow-script-in-comments @options @packages
[ERROR]
[ERROR] Refer to the generated Javadoc files in '<https://ci-builds.apache.org/job/Juneau/job/Juneau-Java-17/ws/target/reports/apidocs'> dir.
[ERROR]
[ERROR] -> [Help 1]
[ERROR]
[ERROR] To see the full stack trace of the errors, re-run Maven with the -e switch.
[ERROR] Re-run Maven using the -X switch to enable full debug logging.
[ERROR]
[ERROR] For more information about the errors and possible solutions, please read the following articles:
[ERROR] [Help 1] http://cwiki.apache.org/confluence/display/MAVEN/MojoExecutionException
Build step 'Invoke top-level Maven targets' marked build as failure
Recording test results
[Checks API] No suitable checks publisher found.
Jenkins build is back to normal : Juneau » Juneau-Java-17 #995
Posted by Apache Jenkins Server <je...@builds.apache.org>.
See <https://ci-builds.apache.org/job/Juneau/job/Juneau-Java-17/995/display/redirect?page=changes>
Build failed in Jenkins: Juneau » Juneau-Java-17 #994
Posted by Apache Jenkins Server <je...@builds.apache.org>.
See <https://ci-builds.apache.org/job/Juneau/job/Juneau-Java-17/994/display/redirect?page=changes>
Changes:
[James Bognar] Update release JDK versions
[James Bognar] Remove unnecessary check for specific gpg path.
------------------------------------------
[...truncated 740.13 KiB...]
[INFO] --- enforcer:3.5.0:enforce (enforce-java-version) @ juneau-examples-rest ---
[INFO]
[INFO] --- enforcer:3.5.0:enforce (enforce-maven) @ juneau-examples-rest ---
[INFO]
[INFO] --- remote-resources:3.3.0:process (process-resource-bundles) @ juneau-examples-rest ---
[INFO] Preparing remote bundle org.apache.apache.resources:apache-jar-resource-bundle:1.7
[INFO] Copying 3 resources from 1 bundle.
[INFO]
[INFO] --- resources:3.3.1:resources (default-resources) @ juneau-examples-rest ---
[INFO] Copying 20 resources from src/main/resources to target/classes
[INFO] Copying 3 resources from target/maven-shared-archive-resources to target/classes
[INFO] Copying 3 resources from target/maven-shared-archive-resources to target/classes
[INFO] Copying 3 resources from target/maven-shared-archive-resources to target/classes
[INFO]
[INFO] --- compiler:3.14.0:compile (default-compile) @ juneau-examples-rest ---
[INFO] Recompiling the module because of changed dependency.
[INFO] Compiling 14 source files with javac [debug release 17] to target/classes
[WARNING] Overwriting artifact's file from <https://ci-builds.apache.org/job/Juneau/job/Juneau-Java-17/ws/juneau-examples/juneau-examples-rest/target/juneau-examples-rest-9.1.0-SNAPSHOT.jar> to <https://ci-builds.apache.org/job/Juneau/job/Juneau-Java-17/ws/juneau-examples/juneau-examples-rest/target/classes>
[INFO]
[INFO] >>>>>>>>>>>>>>>>>>>>>>>>>>>>>>>>>>>>>>>>>>>>>>>>>>>>>>>>>>>>>>>>>>>>>>>>
[INFO] Forking juneau/examples/examples-rest-jetty 9.1.0-SNAPSHOT
[INFO] >>>>>>>>>>>>>>>>>>>>>>>>>>>>>>>>>>>>>>>>>>>>>>>>>>>>>>>>>>>>>>>>>>>>>>>>
[INFO]
[INFO] --- enforcer:3.5.0:enforce (enforce-maven-version) @ juneau-examples-rest-jetty ---
[INFO]
[INFO] --- enforcer:3.5.0:enforce (enforce-java-version) @ juneau-examples-rest-jetty ---
[INFO]
[INFO] --- enforcer:3.5.0:enforce (enforce-maven) @ juneau-examples-rest-jetty ---
[INFO]
[INFO] --- remote-resources:3.3.0:process (process-resource-bundles) @ juneau-examples-rest-jetty ---
[INFO] Preparing remote bundle org.apache.apache.resources:apache-jar-resource-bundle:1.7
[INFO] Copying 3 resources from 1 bundle.
[INFO]
[INFO] --- resources:3.3.1:resources (default-resources) @ juneau-examples-rest-jetty ---
[INFO] Copying 1 resource from src/main/resources to target/classes
[INFO] Copying 3 resources from target/maven-shared-archive-resources to target/classes
[INFO] Copying 3 resources from target/maven-shared-archive-resources to target/classes
[INFO] Copying 3 resources from target/maven-shared-archive-resources to target/classes
[INFO]
[INFO] --- compiler:3.14.0:compile (default-compile) @ juneau-examples-rest-jetty ---
[INFO] Recompiling the module because of changed dependency.
[INFO] Compiling 2 source files with javac [debug release 17] to target/classes
[WARNING] Overwriting artifact's file from <https://ci-builds.apache.org/job/Juneau/job/Juneau-Java-17/ws/juneau-examples/juneau-examples-rest-jetty/target/juneau-examples-rest-jetty-9.1.0-SNAPSHOT.jar> to <https://ci-builds.apache.org/job/Juneau/job/Juneau-Java-17/ws/juneau-examples/juneau-examples-rest-jetty/target/classes>
[INFO]
[INFO] >>>>>>>>>>>>>>>>>>>>>>>>>>>>>>>>>>>>>>>>>>>>>>>>>>>>>>>>>>>>>>>>>>>>>>>>
[INFO] Forking juneau/examples/examples-rest-springboot 9.1.0-SNAPSHOT
[INFO] >>>>>>>>>>>>>>>>>>>>>>>>>>>>>>>>>>>>>>>>>>>>>>>>>>>>>>>>>>>>>>>>>>>>>>>>
[INFO]
[INFO] --- enforcer:3.5.0:enforce (enforce-maven-version) @ juneau-examples-rest-springboot ---
[INFO]
[INFO] --- enforcer:3.5.0:enforce (enforce-java-version) @ juneau-examples-rest-springboot ---
[INFO]
[INFO] --- enforcer:3.5.0:enforce (enforce-maven) @ juneau-examples-rest-springboot ---
[INFO]
[INFO] --- remote-resources:3.3.0:process (process-resource-bundles) @ juneau-examples-rest-springboot ---
[INFO] Preparing remote bundle org.apache.apache.resources:apache-jar-resource-bundle:1.7
[INFO] Copying 3 resources from 1 bundle.
[INFO]
[INFO] --- resources:3.3.1:resources (default-resources) @ juneau-examples-rest-springboot ---
[INFO] Copying 3 resources from src/main/resources to target/classes
[INFO] Copying 3 resources from target/maven-shared-archive-resources to target/classes
[INFO] Copying 3 resources from target/maven-shared-archive-resources to target/classes
[INFO] Copying 3 resources from target/maven-shared-archive-resources to target/classes
[INFO]
[INFO] --- compiler:3.14.0:compile (default-compile) @ juneau-examples-rest-springboot ---
[INFO] Recompiling the module because of changed dependency.
[INFO] Compiling 5 source files with javac [debug release 17] to target/classes
[WARNING] Overwriting artifact's file from <https://ci-builds.apache.org/job/Juneau/job/Juneau-Java-17/ws/juneau-examples/juneau-examples-rest-springboot/target/juneau-examples-rest-springboot-9.1.0-SNAPSHOT.jar> to <https://ci-builds.apache.org/job/Juneau/job/Juneau-Java-17/ws/juneau-examples/juneau-examples-rest-springboot/target/classes>
[INFO]
[INFO] >>>>>>>>>>>>>>>>>>>>>>>>>>>>>>>>>>>>>>>>>>>>>>>>>>>>>>>>>>>>>>>>>>>>>>>>
[INFO] Forking juneau/examples/examples-rest-jetty-ftest 9.1.0-SNAPSHOT
[INFO] >>>>>>>>>>>>>>>>>>>>>>>>>>>>>>>>>>>>>>>>>>>>>>>>>>>>>>>>>>>>>>>>>>>>>>>>
[INFO]
[INFO] --- enforcer:3.5.0:enforce (enforce-maven-version) @ juneau-examples-rest-jetty-ftest ---
[INFO]
[INFO] --- enforcer:3.5.0:enforce (enforce-java-version) @ juneau-examples-rest-jetty-ftest ---
[INFO]
[INFO] --- enforcer:3.5.0:enforce (enforce-maven) @ juneau-examples-rest-jetty-ftest ---
[INFO]
[INFO] --- jacoco:0.8.13:prepare-agent (default-prepare-agent) @ juneau-examples-rest-jetty-ftest ---
[INFO] argLine set to -javaagent:/home/jenkins/.m2/repository/org/jacoco/org.jacoco.agent/0.8.13/org.jacoco.agent-0.8.13-runtime.jar=destfile=<https://ci-builds.apache.org/job/Juneau/job/Juneau-Java-17/ws/juneau-examples/juneau-examples-rest-jetty-ftest/target/jacoco.exec>
[INFO]
[INFO] --- remote-resources:3.3.0:process (process-resource-bundles) @ juneau-examples-rest-jetty-ftest ---
[INFO] Preparing remote bundle org.apache.apache.resources:apache-jar-resource-bundle:1.7
[INFO] Copying 3 resources from 1 bundle.
[INFO]
[INFO] --- resources:3.3.1:resources (default-resources) @ juneau-examples-rest-jetty-ftest ---
[INFO] skip non existing resourceDirectory <https://ci-builds.apache.org/job/Juneau/job/Juneau-Java-17/ws/juneau-examples/juneau-examples-rest-jetty-ftest/src/main/resources>
[INFO] Copying 3 resources from target/maven-shared-archive-resources to target/classes
[INFO] Copying 3 resources from target/maven-shared-archive-resources to target/classes
[INFO] Copying 3 resources from target/maven-shared-archive-resources to target/classes
[INFO]
[INFO] --- compiler:3.14.0:compile (default-compile) @ juneau-examples-rest-jetty-ftest ---
[INFO] Recompiling the module because of changed dependency.
[WARNING] Overwriting artifact's file from <https://ci-builds.apache.org/job/Juneau/job/Juneau-Java-17/ws/juneau-examples/juneau-examples-rest-jetty-ftest/target/juneau-examples-rest-jetty-ftest-9.1.0-SNAPSHOT.jar> to <https://ci-builds.apache.org/job/Juneau/job/Juneau-Java-17/ws/juneau-examples/juneau-examples-rest-jetty-ftest/target/classes>
[INFO]
[INFO] >>>>>>>>>>>>>>>>>>>>>>>>>>>>>>>>>>>>>>>>>>>>>>>>>>>>>>>>>>>>>>>>>>>>>>>>
[INFO] Forking juneau/utest-utils 9.1.0-SNAPSHOT
[INFO] >>>>>>>>>>>>>>>>>>>>>>>>>>>>>>>>>>>>>>>>>>>>>>>>>>>>>>>>>>>>>>>>>>>>>>>>
[INFO]
[INFO] --- enforcer:3.5.0:enforce (enforce-maven-version) @ juneau-utest-utils ---
[INFO]
[INFO] --- enforcer:3.5.0:enforce (enforce-java-version) @ juneau-utest-utils ---
[INFO]
[INFO] --- enforcer:3.5.0:enforce (enforce-maven) @ juneau-utest-utils ---
[INFO]
[INFO] --- remote-resources:3.3.0:process (process-resource-bundles) @ juneau-utest-utils ---
[INFO] Preparing remote bundle org.apache.apache.resources:apache-jar-resource-bundle:1.7
[INFO] Copying 3 resources from 1 bundle.
[INFO]
[INFO] --- resources:3.3.1:resources (default-resources) @ juneau-utest-utils ---
[INFO] skip non existing resourceDirectory <https://ci-builds.apache.org/job/Juneau/job/Juneau-Java-17/ws/juneau-utest-utils/src/main/resources>
[INFO] Copying 3 resources from target/maven-shared-archive-resources to target/classes
[INFO] Copying 3 resources from target/maven-shared-archive-resources to target/classes
[INFO] Copying 3 resources from target/maven-shared-archive-resources to target/classes
[INFO]
[INFO] --- compiler:3.14.0:compile (default-compile) @ juneau-utest-utils ---
[INFO] Recompiling the module because of changed dependency.
[INFO] Compiling 30 source files with javac [debug release 17] to target/classes
[WARNING] Overwriting artifact's file from <https://ci-builds.apache.org/job/Juneau/job/Juneau-Java-17/ws/juneau-utest-utils/target/juneau-utest-utils-9.1.0-SNAPSHOT.jar> to <https://ci-builds.apache.org/job/Juneau/job/Juneau-Java-17/ws/juneau-utest-utils/target/classes>
[INFO]
[INFO] >>>>>>>>>>>>>>>>>>>>>>>>>>>>>>>>>>>>>>>>>>>>>>>>>>>>>>>>>>>>>>>>>>>>>>>>
[INFO] Forking juneau/utest 9.1.0-SNAPSHOT
[INFO] >>>>>>>>>>>>>>>>>>>>>>>>>>>>>>>>>>>>>>>>>>>>>>>>>>>>>>>>>>>>>>>>>>>>>>>>
[INFO]
[INFO] --- enforcer:3.5.0:enforce (enforce-maven-version) @ juneau-utest ---
[INFO]
[INFO] --- enforcer:3.5.0:enforce (enforce-java-version) @ juneau-utest ---
[INFO]
[INFO] --- enforcer:3.5.0:enforce (enforce-maven) @ juneau-utest ---
[INFO]
[INFO] --- jacoco:0.8.13:prepare-agent (default-prepare-agent) @ juneau-utest ---
[INFO] argLine set to -javaagent:/home/jenkins/.m2/repository/org/jacoco/org.jacoco.agent/0.8.13/org.jacoco.agent-0.8.13-runtime.jar=destfile=<https://ci-builds.apache.org/job/Juneau/job/Juneau-Java-17/ws/juneau-utest/target/jacoco.exec>
[INFO]
[INFO] --- remote-resources:3.3.0:process (process-resource-bundles) @ juneau-utest ---
[INFO] Preparing remote bundle org.apache.apache.resources:apache-jar-resource-bundle:1.7
[INFO] Copying 3 resources from 1 bundle.
[INFO]
[INFO] --- resources:3.3.1:resources (default-resources) @ juneau-utest ---
[INFO] skip non existing resourceDirectory <https://ci-builds.apache.org/job/Juneau/job/Juneau-Java-17/ws/juneau-utest/src/main/resources>
[INFO] Copying 3 resources from target/maven-shared-archive-resources to target/classes
[INFO] Copying 3 resources from target/maven-shared-archive-resources to target/classes
[INFO] Copying 3 resources from target/maven-shared-archive-resources to target/classes
[INFO]
[INFO] --- compiler:3.14.0:compile (default-compile) @ juneau-utest ---
[INFO] Recompiling the module because of changed dependency.
[WARNING] Overwriting artifact's file from <https://ci-builds.apache.org/job/Juneau/job/Juneau-Java-17/ws/juneau-utest/target/juneau-utest-9.1.0-SNAPSHOT.jar> to <https://ci-builds.apache.org/job/Juneau/job/Juneau-Java-17/ws/juneau-utest/target/classes>
[INFO]
[INFO] >>>>>>>>>>>>>>>>>>>>>>>>>>>>>>>>>>>>>>>>>>>>>>>>>>>>>>>>>>>>>>>>>>>>>>>>
[INFO] Forking juneau/all 9.1.0-SNAPSHOT
[INFO] >>>>>>>>>>>>>>>>>>>>>>>>>>>>>>>>>>>>>>>>>>>>>>>>>>>>>>>>>>>>>>>>>>>>>>>>
[INFO]
[INFO] --- enforcer:3.5.0:enforce (enforce-maven-version) @ juneau-all ---
[INFO]
[INFO] --- enforcer:3.5.0:enforce (enforce-java-version) @ juneau-all ---
[INFO]
[INFO] --- enforcer:3.5.0:enforce (enforce-maven) @ juneau-all ---
[INFO]
[INFO] --- remote-resources:3.3.0:process (process-resource-bundles) @ juneau-all ---
[INFO] Preparing remote bundle org.apache.apache.resources:apache-jar-resource-bundle:1.7
[INFO] Copying 3 resources from 1 bundle.
[INFO]
[INFO] --- resources:3.3.1:resources (default-resources) @ juneau-all ---
[INFO] skip non existing resourceDirectory <https://ci-builds.apache.org/job/Juneau/job/Juneau-Java-17/ws/juneau-all/src/main/resources>
[INFO] Copying 3 resources from target/maven-shared-archive-resources to target/classes
[INFO] Copying 3 resources from target/maven-shared-archive-resources to target/classes
[INFO] Copying 3 resources from target/maven-shared-archive-resources to target/classes
[INFO]
[INFO] --- compiler:3.14.0:compile (default-compile) @ juneau-all ---
[INFO] No sources to compile
[WARNING] Overwriting artifact's file from <https://ci-builds.apache.org/job/Juneau/job/Juneau-Java-17/ws/juneau-all/target/juneau-all-9.1.0-SNAPSHOT.jar> to <https://ci-builds.apache.org/job/Juneau/job/Juneau-Java-17/ws/juneau-all/target/classes>
[INFO]
[INFO] >>>>>>>>>>>>>>>>>>>>>>>>>>>>>>>>>>>>>>>>>>>>>>>>>>>>>>>>>>>>>>>>>>>>>>>>
[INFO] Forking juneau/distrib 9.1.0-SNAPSHOT
[INFO] >>>>>>>>>>>>>>>>>>>>>>>>>>>>>>>>>>>>>>>>>>>>>>>>>>>>>>>>>>>>>>>>>>>>>>>>
[INFO]
[INFO] --- enforcer:3.5.0:enforce (enforce-maven-version) @ juneau-distrib ---
[INFO]
[INFO] --- enforcer:3.5.0:enforce (enforce-java-version) @ juneau-distrib ---
[INFO]
[INFO] --- enforcer:3.5.0:enforce (enforce-maven) @ juneau-distrib ---
[INFO]
[INFO] --- remote-resources:3.3.0:process (process-resource-bundles) @ juneau-distrib ---
[INFO] Preparing remote bundle org.apache.apache.resources:apache-jar-resource-bundle:1.7
[INFO] Copying 3 resources from 1 bundle.
[INFO]
[INFO] <<< javadoc:3.11.2:aggregate (default-cli) < compile @ juneau <<<
[INFO]
[INFO]
[INFO] --- javadoc:3.11.2:aggregate (default-cli) @ juneau ---
[INFO] No previous run data found, generating javadoc.
[INFO] ------------------------------------------------------------------------
[INFO] Reactor Summary for juneau 9.1.0-SNAPSHOT:
[INFO]
[INFO] juneau ............................................. FAILURE [ 8.892 s]
[INFO] juneau/core ........................................ SUCCESS [ 4.123 s]
[INFO] juneau/core/common ................................. SUCCESS [ 11.883 s]
[INFO] juneau/core/marshall ............................... SUCCESS [ 19.735 s]
[INFO] juneau/core/dto .................................... SUCCESS [ 13.160 s]
[INFO] juneau/core/config ................................. SUCCESS [ 6.831 s]
[INFO] juneau/core/assertions ............................. SUCCESS [ 7.463 s]
[INFO] juneau/rest ........................................ SUCCESS [ 3.758 s]
[INFO] juneau/rest/rest-common ............................ SUCCESS [ 9.070 s]
[INFO] juneau/rest/rest-server ............................ SUCCESS [ 10.385 s]
[INFO] juneau/rest/rest-server-springboot ................. SUCCESS [ 6.253 s]
[INFO] juneau/rest/rest-client ............................ SUCCESS [ 7.691 s]
[INFO] juneau/rest/rest-mock .............................. SUCCESS [ 6.613 s]
[INFO] juneau/microservice ................................ SUCCESS [ 3.661 s]
[INFO] juneau/microservice/microservice-core .............. SUCCESS [ 9.249 s]
[INFO] juneau/microservice/microservice-jetty ............. SUCCESS [ 6.282 s]
[INFO] juneau/microservice/my-jetty-microservice .......... SUCCESS [ 5.506 s]
[INFO] juneau/microservice/my-springboot-microservice ..... SUCCESS [ 5.335 s]
[INFO] juneau/sc .......................................... SUCCESS [ 3.544 s]
[INFO] juneau/sc/sc-server ................................ SUCCESS [ 5.578 s]
[INFO] juneau/sc/sc-client ................................ SUCCESS [ 5.730 s]
[INFO] juneau/examples .................................... SUCCESS [ 3.588 s]
[INFO] juneau/examples/examples-core ...................... SUCCESS [ 6.823 s]
[INFO] juneau/examples/rest ............................... SUCCESS [ 7.493 s]
[INFO] juneau/examples/examples-rest-jetty ................ SUCCESS [ 7.203 s]
[INFO] juneau/examples/examples-rest-springboot ........... SUCCESS [ 14.236 s]
[INFO] juneau/examples/examples-rest-jetty-ftest .......... SUCCESS [ 11.284 s]
[INFO] juneau/utest-utils ................................. SUCCESS [ 6.730 s]
[INFO] juneau/utest ....................................... SUCCESS [ 56.240 s]
[INFO] juneau/all ......................................... SUCCESS [ 9.004 s]
[INFO] juneau/distrib ..................................... SUCCESS [ 8.944 s]
[INFO] ------------------------------------------------------------------------
[INFO] BUILD FAILURE
[INFO] ------------------------------------------------------------------------
[INFO] Total time: 05:02 min
[INFO] Finished at: 2025-05-12T16:42:17Z
[INFO] ------------------------------------------------------------------------
[ERROR] Failed to execute goal org.apache.maven.plugins:maven-javadoc-plugin:3.11.2:aggregate (default-cli) on project juneau: An error has occurred in Javadoc report generation:
[ERROR] Exit code: 2
[ERROR] error: No source files for package org.apache.juneau.common.internal
[ERROR] 1 error
[ERROR] Command line was: /usr/local/asfpackages/java/adoptium-jdk-17.0.12+7/bin/javadoc -J-Duser.language= -J-Duser.country= -J-DjuneauVersion=9.1.0 -J-DjuneauVersionNext=9.1.1 --allow-script-in-comments @options @packages
[ERROR]
[ERROR] Refer to the generated Javadoc files in '<https://ci-builds.apache.org/job/Juneau/job/Juneau-Java-17/ws/target/reports/apidocs'> dir.
[ERROR]
[ERROR] -> [Help 1]
[ERROR]
[ERROR] To see the full stack trace of the errors, re-run Maven with the -e switch.
[ERROR] Re-run Maven using the -X switch to enable full debug logging.
[ERROR]
[ERROR] For more information about the errors and possible solutions, please read the following articles:
[ERROR] [Help 1] http://cwiki.apache.org/confluence/display/MAVEN/MojoExecutionException
Build step 'Invoke top-level Maven targets' marked build as failure
Recording test results
[Checks API] No suitable checks publisher found.
Build failed in Jenkins: Juneau » Juneau-Java-17 #993
Posted by Apache Jenkins Server <je...@builds.apache.org>.
See <https://ci-builds.apache.org/job/Juneau/job/Juneau-Java-17/993/display/redirect?page=changes>
Changes:
[James Bognar] Remove spurious dependency causing release failure.
------------------------------------------
[...truncated 738.07 KiB...]
[INFO] --- enforcer:3.5.0:enforce (enforce-java-version) @ juneau-examples-rest ---
[INFO]
[INFO] --- enforcer:3.5.0:enforce (enforce-maven) @ juneau-examples-rest ---
[INFO]
[INFO] --- remote-resources:3.3.0:process (process-resource-bundles) @ juneau-examples-rest ---
[INFO] Preparing remote bundle org.apache.apache.resources:apache-jar-resource-bundle:1.7
[INFO] Copying 3 resources from 1 bundle.
[INFO]
[INFO] --- resources:3.3.1:resources (default-resources) @ juneau-examples-rest ---
[INFO] Copying 20 resources from src/main/resources to target/classes
[INFO] Copying 3 resources from target/maven-shared-archive-resources to target/classes
[INFO] Copying 3 resources from target/maven-shared-archive-resources to target/classes
[INFO] Copying 3 resources from target/maven-shared-archive-resources to target/classes
[INFO]
[INFO] --- compiler:3.14.0:compile (default-compile) @ juneau-examples-rest ---
[INFO] Recompiling the module because of changed dependency.
[INFO] Compiling 14 source files with javac [debug release 17] to target/classes
[WARNING] Overwriting artifact's file from <https://ci-builds.apache.org/job/Juneau/job/Juneau-Java-17/ws/juneau-examples/juneau-examples-rest/target/juneau-examples-rest-9.1.0-SNAPSHOT.jar> to <https://ci-builds.apache.org/job/Juneau/job/Juneau-Java-17/ws/juneau-examples/juneau-examples-rest/target/classes>
[INFO]
[INFO] >>>>>>>>>>>>>>>>>>>>>>>>>>>>>>>>>>>>>>>>>>>>>>>>>>>>>>>>>>>>>>>>>>>>>>>>
[INFO] Forking juneau/examples/examples-rest-jetty 9.1.0-SNAPSHOT
[INFO] >>>>>>>>>>>>>>>>>>>>>>>>>>>>>>>>>>>>>>>>>>>>>>>>>>>>>>>>>>>>>>>>>>>>>>>>
[INFO]
[INFO] --- enforcer:3.5.0:enforce (enforce-maven-version) @ juneau-examples-rest-jetty ---
[INFO]
[INFO] --- enforcer:3.5.0:enforce (enforce-java-version) @ juneau-examples-rest-jetty ---
[INFO]
[INFO] --- enforcer:3.5.0:enforce (enforce-maven) @ juneau-examples-rest-jetty ---
[INFO]
[INFO] --- remote-resources:3.3.0:process (process-resource-bundles) @ juneau-examples-rest-jetty ---
[INFO] Preparing remote bundle org.apache.apache.resources:apache-jar-resource-bundle:1.7
[INFO] Copying 3 resources from 1 bundle.
[INFO]
[INFO] --- resources:3.3.1:resources (default-resources) @ juneau-examples-rest-jetty ---
[INFO] Copying 1 resource from src/main/resources to target/classes
[INFO] Copying 3 resources from target/maven-shared-archive-resources to target/classes
[INFO] Copying 3 resources from target/maven-shared-archive-resources to target/classes
[INFO] Copying 3 resources from target/maven-shared-archive-resources to target/classes
[INFO]
[INFO] --- compiler:3.14.0:compile (default-compile) @ juneau-examples-rest-jetty ---
[INFO] Recompiling the module because of changed dependency.
[INFO] Compiling 2 source files with javac [debug release 17] to target/classes
[WARNING] Overwriting artifact's file from <https://ci-builds.apache.org/job/Juneau/job/Juneau-Java-17/ws/juneau-examples/juneau-examples-rest-jetty/target/juneau-examples-rest-jetty-9.1.0-SNAPSHOT.jar> to <https://ci-builds.apache.org/job/Juneau/job/Juneau-Java-17/ws/juneau-examples/juneau-examples-rest-jetty/target/classes>
[INFO]
[INFO] >>>>>>>>>>>>>>>>>>>>>>>>>>>>>>>>>>>>>>>>>>>>>>>>>>>>>>>>>>>>>>>>>>>>>>>>
[INFO] Forking juneau/examples/examples-rest-springboot 9.1.0-SNAPSHOT
[INFO] >>>>>>>>>>>>>>>>>>>>>>>>>>>>>>>>>>>>>>>>>>>>>>>>>>>>>>>>>>>>>>>>>>>>>>>>
[INFO]
[INFO] --- enforcer:3.5.0:enforce (enforce-maven-version) @ juneau-examples-rest-springboot ---
[INFO]
[INFO] --- enforcer:3.5.0:enforce (enforce-java-version) @ juneau-examples-rest-springboot ---
[INFO]
[INFO] --- enforcer:3.5.0:enforce (enforce-maven) @ juneau-examples-rest-springboot ---
[INFO]
[INFO] --- remote-resources:3.3.0:process (process-resource-bundles) @ juneau-examples-rest-springboot ---
[INFO] Preparing remote bundle org.apache.apache.resources:apache-jar-resource-bundle:1.7
[INFO] Copying 3 resources from 1 bundle.
[INFO]
[INFO] --- resources:3.3.1:resources (default-resources) @ juneau-examples-rest-springboot ---
[INFO] Copying 3 resources from src/main/resources to target/classes
[INFO] Copying 3 resources from target/maven-shared-archive-resources to target/classes
[INFO] Copying 3 resources from target/maven-shared-archive-resources to target/classes
[INFO] Copying 3 resources from target/maven-shared-archive-resources to target/classes
[INFO]
[INFO] --- compiler:3.14.0:compile (default-compile) @ juneau-examples-rest-springboot ---
[INFO] Recompiling the module because of changed dependency.
[INFO] Compiling 5 source files with javac [debug release 17] to target/classes
[WARNING] Overwriting artifact's file from <https://ci-builds.apache.org/job/Juneau/job/Juneau-Java-17/ws/juneau-examples/juneau-examples-rest-springboot/target/juneau-examples-rest-springboot-9.1.0-SNAPSHOT.jar> to <https://ci-builds.apache.org/job/Juneau/job/Juneau-Java-17/ws/juneau-examples/juneau-examples-rest-springboot/target/classes>
[INFO]
[INFO] >>>>>>>>>>>>>>>>>>>>>>>>>>>>>>>>>>>>>>>>>>>>>>>>>>>>>>>>>>>>>>>>>>>>>>>>
[INFO] Forking juneau/examples/examples-rest-jetty-ftest 9.1.0-SNAPSHOT
[INFO] >>>>>>>>>>>>>>>>>>>>>>>>>>>>>>>>>>>>>>>>>>>>>>>>>>>>>>>>>>>>>>>>>>>>>>>>
[INFO]
[INFO] --- enforcer:3.5.0:enforce (enforce-maven-version) @ juneau-examples-rest-jetty-ftest ---
[INFO]
[INFO] --- enforcer:3.5.0:enforce (enforce-java-version) @ juneau-examples-rest-jetty-ftest ---
[INFO]
[INFO] --- enforcer:3.5.0:enforce (enforce-maven) @ juneau-examples-rest-jetty-ftest ---
[INFO]
[INFO] --- jacoco:0.8.13:prepare-agent (default-prepare-agent) @ juneau-examples-rest-jetty-ftest ---
[INFO] argLine set to -javaagent:/home/jenkins/.m2/repository/org/jacoco/org.jacoco.agent/0.8.13/org.jacoco.agent-0.8.13-runtime.jar=destfile=<https://ci-builds.apache.org/job/Juneau/job/Juneau-Java-17/ws/juneau-examples/juneau-examples-rest-jetty-ftest/target/jacoco.exec>
[INFO]
[INFO] --- remote-resources:3.3.0:process (process-resource-bundles) @ juneau-examples-rest-jetty-ftest ---
[INFO] Preparing remote bundle org.apache.apache.resources:apache-jar-resource-bundle:1.7
[INFO] Copying 3 resources from 1 bundle.
[INFO]
[INFO] --- resources:3.3.1:resources (default-resources) @ juneau-examples-rest-jetty-ftest ---
[INFO] skip non existing resourceDirectory <https://ci-builds.apache.org/job/Juneau/job/Juneau-Java-17/ws/juneau-examples/juneau-examples-rest-jetty-ftest/src/main/resources>
[INFO] Copying 3 resources from target/maven-shared-archive-resources to target/classes
[INFO] Copying 3 resources from target/maven-shared-archive-resources to target/classes
[INFO] Copying 3 resources from target/maven-shared-archive-resources to target/classes
[INFO]
[INFO] --- compiler:3.14.0:compile (default-compile) @ juneau-examples-rest-jetty-ftest ---
[INFO] Recompiling the module because of changed dependency.
[WARNING] Overwriting artifact's file from <https://ci-builds.apache.org/job/Juneau/job/Juneau-Java-17/ws/juneau-examples/juneau-examples-rest-jetty-ftest/target/juneau-examples-rest-jetty-ftest-9.1.0-SNAPSHOT.jar> to <https://ci-builds.apache.org/job/Juneau/job/Juneau-Java-17/ws/juneau-examples/juneau-examples-rest-jetty-ftest/target/classes>
[INFO]
[INFO] >>>>>>>>>>>>>>>>>>>>>>>>>>>>>>>>>>>>>>>>>>>>>>>>>>>>>>>>>>>>>>>>>>>>>>>>
[INFO] Forking juneau/utest-utils 9.1.0-SNAPSHOT
[INFO] >>>>>>>>>>>>>>>>>>>>>>>>>>>>>>>>>>>>>>>>>>>>>>>>>>>>>>>>>>>>>>>>>>>>>>>>
[INFO]
[INFO] --- enforcer:3.5.0:enforce (enforce-maven-version) @ juneau-utest-utils ---
[INFO]
[INFO] --- enforcer:3.5.0:enforce (enforce-java-version) @ juneau-utest-utils ---
[INFO]
[INFO] --- enforcer:3.5.0:enforce (enforce-maven) @ juneau-utest-utils ---
[INFO]
[INFO] --- remote-resources:3.3.0:process (process-resource-bundles) @ juneau-utest-utils ---
[INFO] Preparing remote bundle org.apache.apache.resources:apache-jar-resource-bundle:1.7
[INFO] Copying 3 resources from 1 bundle.
[INFO]
[INFO] --- resources:3.3.1:resources (default-resources) @ juneau-utest-utils ---
[INFO] skip non existing resourceDirectory <https://ci-builds.apache.org/job/Juneau/job/Juneau-Java-17/ws/juneau-utest-utils/src/main/resources>
[INFO] Copying 3 resources from target/maven-shared-archive-resources to target/classes
[INFO] Copying 3 resources from target/maven-shared-archive-resources to target/classes
[INFO] Copying 3 resources from target/maven-shared-archive-resources to target/classes
[INFO]
[INFO] --- compiler:3.14.0:compile (default-compile) @ juneau-utest-utils ---
[INFO] Recompiling the module because of changed dependency.
[INFO] Compiling 30 source files with javac [debug release 17] to target/classes
[WARNING] Overwriting artifact's file from <https://ci-builds.apache.org/job/Juneau/job/Juneau-Java-17/ws/juneau-utest-utils/target/juneau-utest-utils-9.1.0-SNAPSHOT.jar> to <https://ci-builds.apache.org/job/Juneau/job/Juneau-Java-17/ws/juneau-utest-utils/target/classes>
[INFO]
[INFO] >>>>>>>>>>>>>>>>>>>>>>>>>>>>>>>>>>>>>>>>>>>>>>>>>>>>>>>>>>>>>>>>>>>>>>>>
[INFO] Forking juneau/utest 9.1.0-SNAPSHOT
[INFO] >>>>>>>>>>>>>>>>>>>>>>>>>>>>>>>>>>>>>>>>>>>>>>>>>>>>>>>>>>>>>>>>>>>>>>>>
[INFO]
[INFO] --- enforcer:3.5.0:enforce (enforce-maven-version) @ juneau-utest ---
[INFO]
[INFO] --- enforcer:3.5.0:enforce (enforce-java-version) @ juneau-utest ---
[INFO]
[INFO] --- enforcer:3.5.0:enforce (enforce-maven) @ juneau-utest ---
[INFO]
[INFO] --- jacoco:0.8.13:prepare-agent (default-prepare-agent) @ juneau-utest ---
[INFO] argLine set to -javaagent:/home/jenkins/.m2/repository/org/jacoco/org.jacoco.agent/0.8.13/org.jacoco.agent-0.8.13-runtime.jar=destfile=<https://ci-builds.apache.org/job/Juneau/job/Juneau-Java-17/ws/juneau-utest/target/jacoco.exec>
[INFO]
[INFO] --- remote-resources:3.3.0:process (process-resource-bundles) @ juneau-utest ---
[INFO] Preparing remote bundle org.apache.apache.resources:apache-jar-resource-bundle:1.7
[INFO] Copying 3 resources from 1 bundle.
[INFO]
[INFO] --- resources:3.3.1:resources (default-resources) @ juneau-utest ---
[INFO] skip non existing resourceDirectory <https://ci-builds.apache.org/job/Juneau/job/Juneau-Java-17/ws/juneau-utest/src/main/resources>
[INFO] Copying 3 resources from target/maven-shared-archive-resources to target/classes
[INFO] Copying 3 resources from target/maven-shared-archive-resources to target/classes
[INFO] Copying 3 resources from target/maven-shared-archive-resources to target/classes
[INFO]
[INFO] --- compiler:3.14.0:compile (default-compile) @ juneau-utest ---
[INFO] Recompiling the module because of changed dependency.
[WARNING] Overwriting artifact's file from <https://ci-builds.apache.org/job/Juneau/job/Juneau-Java-17/ws/juneau-utest/target/juneau-utest-9.1.0-SNAPSHOT.jar> to <https://ci-builds.apache.org/job/Juneau/job/Juneau-Java-17/ws/juneau-utest/target/classes>
[INFO]
[INFO] >>>>>>>>>>>>>>>>>>>>>>>>>>>>>>>>>>>>>>>>>>>>>>>>>>>>>>>>>>>>>>>>>>>>>>>>
[INFO] Forking juneau/all 9.1.0-SNAPSHOT
[INFO] >>>>>>>>>>>>>>>>>>>>>>>>>>>>>>>>>>>>>>>>>>>>>>>>>>>>>>>>>>>>>>>>>>>>>>>>
[INFO]
[INFO] --- enforcer:3.5.0:enforce (enforce-maven-version) @ juneau-all ---
[INFO]
[INFO] --- enforcer:3.5.0:enforce (enforce-java-version) @ juneau-all ---
[INFO]
[INFO] --- enforcer:3.5.0:enforce (enforce-maven) @ juneau-all ---
[INFO]
[INFO] --- remote-resources:3.3.0:process (process-resource-bundles) @ juneau-all ---
[INFO] Preparing remote bundle org.apache.apache.resources:apache-jar-resource-bundle:1.7
[INFO] Copying 3 resources from 1 bundle.
[INFO]
[INFO] --- resources:3.3.1:resources (default-resources) @ juneau-all ---
[INFO] skip non existing resourceDirectory <https://ci-builds.apache.org/job/Juneau/job/Juneau-Java-17/ws/juneau-all/src/main/resources>
[INFO] Copying 3 resources from target/maven-shared-archive-resources to target/classes
[INFO] Copying 3 resources from target/maven-shared-archive-resources to target/classes
[INFO] Copying 3 resources from target/maven-shared-archive-resources to target/classes
[INFO]
[INFO] --- compiler:3.14.0:compile (default-compile) @ juneau-all ---
[INFO] No sources to compile
[WARNING] Overwriting artifact's file from <https://ci-builds.apache.org/job/Juneau/job/Juneau-Java-17/ws/juneau-all/target/juneau-all-9.1.0-SNAPSHOT.jar> to <https://ci-builds.apache.org/job/Juneau/job/Juneau-Java-17/ws/juneau-all/target/classes>
[INFO]
[INFO] >>>>>>>>>>>>>>>>>>>>>>>>>>>>>>>>>>>>>>>>>>>>>>>>>>>>>>>>>>>>>>>>>>>>>>>>
[INFO] Forking juneau/distrib 9.1.0-SNAPSHOT
[INFO] >>>>>>>>>>>>>>>>>>>>>>>>>>>>>>>>>>>>>>>>>>>>>>>>>>>>>>>>>>>>>>>>>>>>>>>>
[INFO]
[INFO] --- enforcer:3.5.0:enforce (enforce-maven-version) @ juneau-distrib ---
[INFO]
[INFO] --- enforcer:3.5.0:enforce (enforce-java-version) @ juneau-distrib ---
[INFO]
[INFO] --- enforcer:3.5.0:enforce (enforce-maven) @ juneau-distrib ---
[INFO]
[INFO] --- remote-resources:3.3.0:process (process-resource-bundles) @ juneau-distrib ---
[INFO] Preparing remote bundle org.apache.apache.resources:apache-jar-resource-bundle:1.7
[INFO] Copying 3 resources from 1 bundle.
[INFO]
[INFO] <<< javadoc:3.11.2:aggregate (default-cli) < compile @ juneau <<<
[INFO]
[INFO]
[INFO] --- javadoc:3.11.2:aggregate (default-cli) @ juneau ---
[INFO] No previous run data found, generating javadoc.
[INFO] ------------------------------------------------------------------------
[INFO] Reactor Summary for juneau 9.1.0-SNAPSHOT:
[INFO]
[INFO] juneau ............................................. FAILURE [ 8.925 s]
[INFO] juneau/core ........................................ SUCCESS [ 4.314 s]
[INFO] juneau/core/common ................................. SUCCESS [ 10.567 s]
[INFO] juneau/core/marshall ............................... SUCCESS [ 22.936 s]
[INFO] juneau/core/dto .................................... SUCCESS [ 11.420 s]
[INFO] juneau/core/config ................................. SUCCESS [ 6.933 s]
[INFO] juneau/core/assertions ............................. SUCCESS [ 11.481 s]
[INFO] juneau/rest ........................................ SUCCESS [ 3.900 s]
[INFO] juneau/rest/rest-common ............................ SUCCESS [ 9.643 s]
[INFO] juneau/rest/rest-server ............................ SUCCESS [ 11.516 s]
[INFO] juneau/rest/rest-server-springboot ................. SUCCESS [ 8.353 s]
[INFO] juneau/rest/rest-client ............................ SUCCESS [ 7.930 s]
[INFO] juneau/rest/rest-mock .............................. SUCCESS [ 7.396 s]
[INFO] juneau/microservice ................................ SUCCESS [ 3.773 s]
[INFO] juneau/microservice/microservice-core .............. SUCCESS [ 6.519 s]
[INFO] juneau/microservice/microservice-jetty ............. SUCCESS [ 6.954 s]
[INFO] juneau/microservice/my-jetty-microservice .......... SUCCESS [ 7.592 s]
[INFO] juneau/microservice/my-springboot-microservice ..... SUCCESS [ 5.899 s]
[INFO] juneau/sc .......................................... SUCCESS [ 3.757 s]
[INFO] juneau/sc/sc-server ................................ SUCCESS [ 7.178 s]
[INFO] juneau/sc/sc-client ................................ SUCCESS [01:00 min]
[INFO] juneau/examples .................................... SUCCESS [ 3.650 s]
[INFO] juneau/examples/examples-core ...................... SUCCESS [ 6.732 s]
[INFO] juneau/examples/rest ............................... SUCCESS [ 9.721 s]
[INFO] juneau/examples/examples-rest-jetty ................ SUCCESS [ 7.132 s]
[INFO] juneau/examples/examples-rest-springboot ........... SUCCESS [ 11.722 s]
[INFO] juneau/examples/examples-rest-jetty-ftest .......... SUCCESS [ 13.846 s]
[INFO] juneau/utest-utils ................................. SUCCESS [ 7.237 s]
[INFO] juneau/utest ....................................... SUCCESS [01:02 min]
[INFO] juneau/all ......................................... SUCCESS [ 8.240 s]
[INFO] juneau/distrib ..................................... SUCCESS [ 8.149 s]
[INFO] ------------------------------------------------------------------------
[INFO] BUILD FAILURE
[INFO] ------------------------------------------------------------------------
[INFO] Total time: 06:18 min
[INFO] Finished at: 2025-05-12T16:37:02Z
[INFO] ------------------------------------------------------------------------
[ERROR] Failed to execute goal org.apache.maven.plugins:maven-javadoc-plugin:3.11.2:aggregate (default-cli) on project juneau: An error has occurred in Javadoc report generation:
[ERROR] Exit code: 2
[ERROR] error: No source files for package org.apache.juneau.common.internal
[ERROR] 1 error
[ERROR] Command line was: /usr/local/asfpackages/java/adoptium-jdk-17.0.12+7/bin/javadoc -J-Duser.language= -J-Duser.country= -J-DjuneauVersion=9.1.0 -J-DjuneauVersionNext=9.1.1 --allow-script-in-comments @options @packages
[ERROR]
[ERROR] Refer to the generated Javadoc files in '<https://ci-builds.apache.org/job/Juneau/job/Juneau-Java-17/ws/target/reports/apidocs'> dir.
[ERROR]
[ERROR] -> [Help 1]
[ERROR]
[ERROR] To see the full stack trace of the errors, re-run Maven with the -e switch.
[ERROR] Re-run Maven using the -X switch to enable full debug logging.
[ERROR]
[ERROR] For more information about the errors and possible solutions, please read the following articles:
[ERROR] [Help 1] http://cwiki.apache.org/confluence/display/MAVEN/MojoExecutionException
Build step 'Invoke top-level Maven targets' marked build as failure
Recording test results
[Checks API] No suitable checks publisher found.
Build failed in Jenkins: Juneau » Juneau-Java-17 #992
Posted by Apache Jenkins Server <je...@builds.apache.org>.
See <https://ci-builds.apache.org/job/Juneau/job/Juneau-Java-17/992/display/redirect?page=changes>
Changes:
[James Bognar] [maven-release-plugin] rollback the release of juneau-9.1.0-RC1
------------------------------------------
[...truncated 738.55 KiB...]
[INFO] --- enforcer:3.5.0:enforce (enforce-java-version) @ juneau-examples-rest ---
[INFO]
[INFO] --- enforcer:3.5.0:enforce (enforce-maven) @ juneau-examples-rest ---
[INFO]
[INFO] --- remote-resources:3.3.0:process (process-resource-bundles) @ juneau-examples-rest ---
[INFO] Preparing remote bundle org.apache.apache.resources:apache-jar-resource-bundle:1.7
[INFO] Copying 3 resources from 1 bundle.
[INFO]
[INFO] --- resources:3.3.1:resources (default-resources) @ juneau-examples-rest ---
[INFO] Copying 20 resources from src/main/resources to target/classes
[INFO] Copying 3 resources from target/maven-shared-archive-resources to target/classes
[INFO] Copying 3 resources from target/maven-shared-archive-resources to target/classes
[INFO] Copying 3 resources from target/maven-shared-archive-resources to target/classes
[INFO]
[INFO] --- compiler:3.14.0:compile (default-compile) @ juneau-examples-rest ---
[INFO] Recompiling the module because of changed dependency.
[INFO] Compiling 14 source files with javac [debug release 17] to target/classes
[WARNING] Overwriting artifact's file from <https://ci-builds.apache.org/job/Juneau/job/Juneau-Java-17/ws/juneau-examples/juneau-examples-rest/target/juneau-examples-rest-9.1.0-SNAPSHOT.jar> to <https://ci-builds.apache.org/job/Juneau/job/Juneau-Java-17/ws/juneau-examples/juneau-examples-rest/target/classes>
[INFO]
[INFO] >>>>>>>>>>>>>>>>>>>>>>>>>>>>>>>>>>>>>>>>>>>>>>>>>>>>>>>>>>>>>>>>>>>>>>>>
[INFO] Forking juneau/examples/examples-rest-jetty 9.1.0-SNAPSHOT
[INFO] >>>>>>>>>>>>>>>>>>>>>>>>>>>>>>>>>>>>>>>>>>>>>>>>>>>>>>>>>>>>>>>>>>>>>>>>
[INFO]
[INFO] --- enforcer:3.5.0:enforce (enforce-maven-version) @ juneau-examples-rest-jetty ---
[INFO]
[INFO] --- enforcer:3.5.0:enforce (enforce-java-version) @ juneau-examples-rest-jetty ---
[INFO]
[INFO] --- enforcer:3.5.0:enforce (enforce-maven) @ juneau-examples-rest-jetty ---
[INFO]
[INFO] --- remote-resources:3.3.0:process (process-resource-bundles) @ juneau-examples-rest-jetty ---
[INFO] Preparing remote bundle org.apache.apache.resources:apache-jar-resource-bundle:1.7
[INFO] Copying 3 resources from 1 bundle.
[INFO]
[INFO] --- resources:3.3.1:resources (default-resources) @ juneau-examples-rest-jetty ---
[INFO] Copying 1 resource from src/main/resources to target/classes
[INFO] Copying 3 resources from target/maven-shared-archive-resources to target/classes
[INFO] Copying 3 resources from target/maven-shared-archive-resources to target/classes
[INFO] Copying 3 resources from target/maven-shared-archive-resources to target/classes
[INFO]
[INFO] --- compiler:3.14.0:compile (default-compile) @ juneau-examples-rest-jetty ---
[INFO] Recompiling the module because of changed dependency.
[INFO] Compiling 2 source files with javac [debug release 17] to target/classes
[WARNING] Overwriting artifact's file from <https://ci-builds.apache.org/job/Juneau/job/Juneau-Java-17/ws/juneau-examples/juneau-examples-rest-jetty/target/juneau-examples-rest-jetty-9.1.0-SNAPSHOT.jar> to <https://ci-builds.apache.org/job/Juneau/job/Juneau-Java-17/ws/juneau-examples/juneau-examples-rest-jetty/target/classes>
[INFO]
[INFO] >>>>>>>>>>>>>>>>>>>>>>>>>>>>>>>>>>>>>>>>>>>>>>>>>>>>>>>>>>>>>>>>>>>>>>>>
[INFO] Forking juneau/examples/examples-rest-springboot 9.1.0-SNAPSHOT
[INFO] >>>>>>>>>>>>>>>>>>>>>>>>>>>>>>>>>>>>>>>>>>>>>>>>>>>>>>>>>>>>>>>>>>>>>>>>
[INFO]
[INFO] --- enforcer:3.5.0:enforce (enforce-maven-version) @ juneau-examples-rest-springboot ---
[INFO]
[INFO] --- enforcer:3.5.0:enforce (enforce-java-version) @ juneau-examples-rest-springboot ---
[INFO]
[INFO] --- enforcer:3.5.0:enforce (enforce-maven) @ juneau-examples-rest-springboot ---
[INFO]
[INFO] --- remote-resources:3.3.0:process (process-resource-bundles) @ juneau-examples-rest-springboot ---
[INFO] Preparing remote bundle org.apache.apache.resources:apache-jar-resource-bundle:1.7
[INFO] Copying 3 resources from 1 bundle.
[INFO]
[INFO] --- resources:3.3.1:resources (default-resources) @ juneau-examples-rest-springboot ---
[INFO] Copying 3 resources from src/main/resources to target/classes
[INFO] Copying 3 resources from target/maven-shared-archive-resources to target/classes
[INFO] Copying 3 resources from target/maven-shared-archive-resources to target/classes
[INFO] Copying 3 resources from target/maven-shared-archive-resources to target/classes
[INFO]
[INFO] --- compiler:3.14.0:compile (default-compile) @ juneau-examples-rest-springboot ---
[INFO] Recompiling the module because of changed dependency.
[INFO] Compiling 5 source files with javac [debug release 17] to target/classes
[WARNING] Overwriting artifact's file from <https://ci-builds.apache.org/job/Juneau/job/Juneau-Java-17/ws/juneau-examples/juneau-examples-rest-springboot/target/juneau-examples-rest-springboot-9.1.0-SNAPSHOT.jar> to <https://ci-builds.apache.org/job/Juneau/job/Juneau-Java-17/ws/juneau-examples/juneau-examples-rest-springboot/target/classes>
[INFO]
[INFO] >>>>>>>>>>>>>>>>>>>>>>>>>>>>>>>>>>>>>>>>>>>>>>>>>>>>>>>>>>>>>>>>>>>>>>>>
[INFO] Forking juneau/examples/examples-rest-jetty-ftest 9.1.0-SNAPSHOT
[INFO] >>>>>>>>>>>>>>>>>>>>>>>>>>>>>>>>>>>>>>>>>>>>>>>>>>>>>>>>>>>>>>>>>>>>>>>>
[INFO]
[INFO] --- enforcer:3.5.0:enforce (enforce-maven-version) @ juneau-examples-rest-jetty-ftest ---
[INFO]
[INFO] --- enforcer:3.5.0:enforce (enforce-java-version) @ juneau-examples-rest-jetty-ftest ---
[INFO]
[INFO] --- enforcer:3.5.0:enforce (enforce-maven) @ juneau-examples-rest-jetty-ftest ---
[INFO]
[INFO] --- jacoco:0.8.13:prepare-agent (default-prepare-agent) @ juneau-examples-rest-jetty-ftest ---
[INFO] argLine set to -javaagent:/home/jenkins/.m2/repository/org/jacoco/org.jacoco.agent/0.8.13/org.jacoco.agent-0.8.13-runtime.jar=destfile=<https://ci-builds.apache.org/job/Juneau/job/Juneau-Java-17/ws/juneau-examples/juneau-examples-rest-jetty-ftest/target/jacoco.exec>
[INFO]
[INFO] --- remote-resources:3.3.0:process (process-resource-bundles) @ juneau-examples-rest-jetty-ftest ---
[INFO] Preparing remote bundle org.apache.apache.resources:apache-jar-resource-bundle:1.7
[INFO] Copying 3 resources from 1 bundle.
[INFO]
[INFO] --- resources:3.3.1:resources (default-resources) @ juneau-examples-rest-jetty-ftest ---
[INFO] skip non existing resourceDirectory <https://ci-builds.apache.org/job/Juneau/job/Juneau-Java-17/ws/juneau-examples/juneau-examples-rest-jetty-ftest/src/main/resources>
[INFO] Copying 3 resources from target/maven-shared-archive-resources to target/classes
[INFO] Copying 3 resources from target/maven-shared-archive-resources to target/classes
[INFO] Copying 3 resources from target/maven-shared-archive-resources to target/classes
[INFO]
[INFO] --- compiler:3.14.0:compile (default-compile) @ juneau-examples-rest-jetty-ftest ---
[INFO] Recompiling the module because of changed dependency.
[WARNING] Overwriting artifact's file from <https://ci-builds.apache.org/job/Juneau/job/Juneau-Java-17/ws/juneau-examples/juneau-examples-rest-jetty-ftest/target/juneau-examples-rest-jetty-ftest-9.1.0-SNAPSHOT.jar> to <https://ci-builds.apache.org/job/Juneau/job/Juneau-Java-17/ws/juneau-examples/juneau-examples-rest-jetty-ftest/target/classes>
[INFO]
[INFO] >>>>>>>>>>>>>>>>>>>>>>>>>>>>>>>>>>>>>>>>>>>>>>>>>>>>>>>>>>>>>>>>>>>>>>>>
[INFO] Forking juneau/utest-utils 9.1.0-SNAPSHOT
[INFO] >>>>>>>>>>>>>>>>>>>>>>>>>>>>>>>>>>>>>>>>>>>>>>>>>>>>>>>>>>>>>>>>>>>>>>>>
[INFO]
[INFO] --- enforcer:3.5.0:enforce (enforce-maven-version) @ juneau-utest-utils ---
[INFO]
[INFO] --- enforcer:3.5.0:enforce (enforce-java-version) @ juneau-utest-utils ---
[INFO]
[INFO] --- enforcer:3.5.0:enforce (enforce-maven) @ juneau-utest-utils ---
[INFO]
[INFO] --- remote-resources:3.3.0:process (process-resource-bundles) @ juneau-utest-utils ---
[INFO] Preparing remote bundle org.apache.apache.resources:apache-jar-resource-bundle:1.7
[INFO] Copying 3 resources from 1 bundle.
[INFO]
[INFO] --- resources:3.3.1:resources (default-resources) @ juneau-utest-utils ---
[INFO] skip non existing resourceDirectory <https://ci-builds.apache.org/job/Juneau/job/Juneau-Java-17/ws/juneau-utest-utils/src/main/resources>
[INFO] Copying 3 resources from target/maven-shared-archive-resources to target/classes
[INFO] Copying 3 resources from target/maven-shared-archive-resources to target/classes
[INFO] Copying 3 resources from target/maven-shared-archive-resources to target/classes
[INFO]
[INFO] --- compiler:3.14.0:compile (default-compile) @ juneau-utest-utils ---
[INFO] Recompiling the module because of changed dependency.
[INFO] Compiling 30 source files with javac [debug release 17] to target/classes
[WARNING] Overwriting artifact's file from <https://ci-builds.apache.org/job/Juneau/job/Juneau-Java-17/ws/juneau-utest-utils/target/juneau-utest-utils-9.1.0-SNAPSHOT.jar> to <https://ci-builds.apache.org/job/Juneau/job/Juneau-Java-17/ws/juneau-utest-utils/target/classes>
[INFO]
[INFO] >>>>>>>>>>>>>>>>>>>>>>>>>>>>>>>>>>>>>>>>>>>>>>>>>>>>>>>>>>>>>>>>>>>>>>>>
[INFO] Forking juneau/utest 9.1.0-SNAPSHOT
[INFO] >>>>>>>>>>>>>>>>>>>>>>>>>>>>>>>>>>>>>>>>>>>>>>>>>>>>>>>>>>>>>>>>>>>>>>>>
[INFO]
[INFO] --- enforcer:3.5.0:enforce (enforce-maven-version) @ juneau-utest ---
[INFO]
[INFO] --- enforcer:3.5.0:enforce (enforce-java-version) @ juneau-utest ---
[INFO]
[INFO] --- enforcer:3.5.0:enforce (enforce-maven) @ juneau-utest ---
[INFO]
[INFO] --- jacoco:0.8.13:prepare-agent (default-prepare-agent) @ juneau-utest ---
[INFO] argLine set to -javaagent:/home/jenkins/.m2/repository/org/jacoco/org.jacoco.agent/0.8.13/org.jacoco.agent-0.8.13-runtime.jar=destfile=<https://ci-builds.apache.org/job/Juneau/job/Juneau-Java-17/ws/juneau-utest/target/jacoco.exec>
[INFO]
[INFO] --- remote-resources:3.3.0:process (process-resource-bundles) @ juneau-utest ---
[INFO] Preparing remote bundle org.apache.apache.resources:apache-jar-resource-bundle:1.7
[INFO] Copying 3 resources from 1 bundle.
[INFO]
[INFO] --- resources:3.3.1:resources (default-resources) @ juneau-utest ---
[INFO] skip non existing resourceDirectory <https://ci-builds.apache.org/job/Juneau/job/Juneau-Java-17/ws/juneau-utest/src/main/resources>
[INFO] Copying 3 resources from target/maven-shared-archive-resources to target/classes
[INFO] Copying 3 resources from target/maven-shared-archive-resources to target/classes
[INFO] Copying 3 resources from target/maven-shared-archive-resources to target/classes
[INFO]
[INFO] --- compiler:3.14.0:compile (default-compile) @ juneau-utest ---
[INFO] Recompiling the module because of changed dependency.
[WARNING] Overwriting artifact's file from <https://ci-builds.apache.org/job/Juneau/job/Juneau-Java-17/ws/juneau-utest/target/juneau-utest-9.1.0-SNAPSHOT.jar> to <https://ci-builds.apache.org/job/Juneau/job/Juneau-Java-17/ws/juneau-utest/target/classes>
[INFO]
[INFO] >>>>>>>>>>>>>>>>>>>>>>>>>>>>>>>>>>>>>>>>>>>>>>>>>>>>>>>>>>>>>>>>>>>>>>>>
[INFO] Forking juneau/all 9.1.0-SNAPSHOT
[INFO] >>>>>>>>>>>>>>>>>>>>>>>>>>>>>>>>>>>>>>>>>>>>>>>>>>>>>>>>>>>>>>>>>>>>>>>>
[INFO]
[INFO] --- enforcer:3.5.0:enforce (enforce-maven-version) @ juneau-all ---
[INFO]
[INFO] --- enforcer:3.5.0:enforce (enforce-java-version) @ juneau-all ---
[INFO]
[INFO] --- enforcer:3.5.0:enforce (enforce-maven) @ juneau-all ---
[INFO]
[INFO] --- remote-resources:3.3.0:process (process-resource-bundles) @ juneau-all ---
[INFO] Preparing remote bundle org.apache.apache.resources:apache-jar-resource-bundle:1.7
[INFO] Copying 3 resources from 1 bundle.
[INFO]
[INFO] --- resources:3.3.1:resources (default-resources) @ juneau-all ---
[INFO] skip non existing resourceDirectory <https://ci-builds.apache.org/job/Juneau/job/Juneau-Java-17/ws/juneau-all/src/main/resources>
[INFO] Copying 3 resources from target/maven-shared-archive-resources to target/classes
[INFO] Copying 3 resources from target/maven-shared-archive-resources to target/classes
[INFO] Copying 3 resources from target/maven-shared-archive-resources to target/classes
[INFO]
[INFO] --- compiler:3.14.0:compile (default-compile) @ juneau-all ---
[INFO] No sources to compile
[WARNING] Overwriting artifact's file from <https://ci-builds.apache.org/job/Juneau/job/Juneau-Java-17/ws/juneau-all/target/juneau-all-9.1.0-SNAPSHOT.jar> to <https://ci-builds.apache.org/job/Juneau/job/Juneau-Java-17/ws/juneau-all/target/classes>
[INFO]
[INFO] >>>>>>>>>>>>>>>>>>>>>>>>>>>>>>>>>>>>>>>>>>>>>>>>>>>>>>>>>>>>>>>>>>>>>>>>
[INFO] Forking juneau/distrib 9.1.0-SNAPSHOT
[INFO] >>>>>>>>>>>>>>>>>>>>>>>>>>>>>>>>>>>>>>>>>>>>>>>>>>>>>>>>>>>>>>>>>>>>>>>>
[INFO]
[INFO] --- enforcer:3.5.0:enforce (enforce-maven-version) @ juneau-distrib ---
[INFO]
[INFO] --- enforcer:3.5.0:enforce (enforce-java-version) @ juneau-distrib ---
[INFO]
[INFO] --- enforcer:3.5.0:enforce (enforce-maven) @ juneau-distrib ---
[INFO]
[INFO] --- remote-resources:3.3.0:process (process-resource-bundles) @ juneau-distrib ---
[INFO] Preparing remote bundle org.apache.apache.resources:apache-jar-resource-bundle:1.7
[INFO] Copying 3 resources from 1 bundle.
[INFO]
[INFO] <<< javadoc:3.11.2:aggregate (default-cli) < compile @ juneau <<<
[INFO]
[INFO]
[INFO] --- javadoc:3.11.2:aggregate (default-cli) @ juneau ---
[INFO] No previous run data found, generating javadoc.
[INFO] ------------------------------------------------------------------------
[INFO] Reactor Summary for juneau 9.1.0-SNAPSHOT:
[INFO]
[INFO] juneau ............................................. FAILURE [ 9.321 s]
[INFO] juneau/core ........................................ SUCCESS [ 4.294 s]
[INFO] juneau/core/common ................................. SUCCESS [ 10.056 s]
[INFO] juneau/core/marshall ............................... SUCCESS [ 22.305 s]
[INFO] juneau/core/dto .................................... SUCCESS [ 11.610 s]
[INFO] juneau/core/config ................................. SUCCESS [ 6.853 s]
[INFO] juneau/core/assertions ............................. SUCCESS [ 9.965 s]
[INFO] juneau/rest ........................................ SUCCESS [ 3.770 s]
[INFO] juneau/rest/rest-common ............................ SUCCESS [ 9.472 s]
[INFO] juneau/rest/rest-server ............................ SUCCESS [ 11.494 s]
[INFO] juneau/rest/rest-server-springboot ................. SUCCESS [ 8.159 s]
[INFO] juneau/rest/rest-client ............................ SUCCESS [ 8.148 s]
[INFO] juneau/rest/rest-mock .............................. SUCCESS [ 7.008 s]
[INFO] juneau/microservice ................................ SUCCESS [ 3.657 s]
[INFO] juneau/microservice/microservice-core .............. SUCCESS [ 6.880 s]
[INFO] juneau/microservice/microservice-jetty ............. SUCCESS [ 7.923 s]
[INFO] juneau/microservice/my-jetty-microservice .......... SUCCESS [ 5.818 s]
[INFO] juneau/microservice/my-springboot-microservice ..... SUCCESS [ 5.347 s]
[INFO] juneau/sc .......................................... SUCCESS [ 3.532 s]
[INFO] juneau/sc/sc-server ................................ SUCCESS [ 5.704 s]
[INFO] juneau/sc/sc-client ................................ SUCCESS [ 4.557 s]
[INFO] juneau/examples .................................... SUCCESS [ 4.669 s]
[INFO] juneau/examples/examples-core ...................... SUCCESS [ 7.468 s]
[INFO] juneau/examples/rest ............................... SUCCESS [ 7.719 s]
[INFO] juneau/examples/examples-rest-jetty ................ SUCCESS [ 7.129 s]
[INFO] juneau/examples/examples-rest-springboot ........... SUCCESS [ 12.492 s]
[INFO] juneau/examples/examples-rest-jetty-ftest .......... SUCCESS [ 11.386 s]
[INFO] juneau/utest-utils ................................. SUCCESS [ 6.775 s]
[INFO] juneau/utest ....................................... SUCCESS [ 59.422 s]
[INFO] juneau/all ......................................... SUCCESS [ 9.082 s]
[INFO] juneau/distrib ..................................... SUCCESS [ 10.087 s]
[INFO] ------------------------------------------------------------------------
[INFO] BUILD FAILURE
[INFO] ------------------------------------------------------------------------
[INFO] Total time: 05:15 min
[INFO] Finished at: 2025-05-12T16:30:31Z
[INFO] ------------------------------------------------------------------------
[ERROR] Failed to execute goal org.apache.maven.plugins:maven-javadoc-plugin:3.11.2:aggregate (default-cli) on project juneau: An error has occurred in Javadoc report generation:
[ERROR] Exit code: 2
[ERROR] error: No source files for package org.apache.juneau.common.internal
[ERROR] 1 error
[ERROR] Command line was: /usr/local/asfpackages/java/adoptium-jdk-17.0.12+7/bin/javadoc -J-Duser.language= -J-Duser.country= -J-DjuneauVersion=9.1.0 -J-DjuneauVersionNext=9.1.1 --allow-script-in-comments @options @packages
[ERROR]
[ERROR] Refer to the generated Javadoc files in '<https://ci-builds.apache.org/job/Juneau/job/Juneau-Java-17/ws/target/reports/apidocs'> dir.
[ERROR]
[ERROR] -> [Help 1]
[ERROR]
[ERROR] To see the full stack trace of the errors, re-run Maven with the -e switch.
[ERROR] Re-run Maven using the -X switch to enable full debug logging.
[ERROR]
[ERROR] For more information about the errors and possible solutions, please read the following articles:
[ERROR] [Help 1] http://cwiki.apache.org/confluence/display/MAVEN/MojoExecutionException
Build step 'Invoke top-level Maven targets' marked build as failure
Recording test results
[Checks API] No suitable checks publisher found.